%YAML 1.1
%TAG !u! tag:unity3d.com,2011:
--- !u!1045 &1
EditorBuildSettings:
  m_ObjectHideFlags: 0
  serializedVersion: 2
  m_Scenes:
  - enabled: 1
    path: Assets/Scenes/MainMenu.unity
    guid: 758f567cf551e174eb5369dbba7a821e
  - enabled: 1
    path: Assets/Scenes/SampleScene.unity
    guid: 2cda990e2423bbf4892e6590ba056729
  - enabled: 1
    path: Assets/Scenes/Level_1.unity
    guid: 377b532ecdd05784b9434f68b433b98d
  - enabled: 1
    path: Assets/Scenes/Level_2.unity
    guid: 4bba021d36156fa4eadf627d882551e5
  - enabled: 1
    path: Assets/Scenes/Level_3.unity
    guid: 198c91dfe6b2ea242a1c7e140717024b
  - enabled: 1
    path: Assets/Scenes/LevelSelect.unity
    guid: d4bd5defd0439454cb8ba33335bb8ae2
  - enabled: 1
    path: Assets/Scenes/HelpScene.unity
    guid: f99942f5c5bd1df44be2594cafc618cf
  m_configObjects: {}
