%YAML 1.1
%TAG !u! tag:unity3d.com,2011:
--- !u!95 &4142235232323260147
Animator:
  serializedVersion: 3
  m_ObjectHideFlags: 0
  m_CorrespondingSourceObject: {fileID: 0}
  m_PrefabInstance: {fileID: 0}
  m_PrefabAsset: {fileID: 0}
  m_GameObject: {fileID: 6515950722264071132}
  m_Enabled: 1
  m_Avatar: {fileID: 0}
  m_Controller: {fileID: 9100000, guid: 0d5f970af6c5bd044805fb74675ce2ac, type: 2}
  m_CullingMode: 0
  m_UpdateMode: 0
  m_ApplyRootMotion: 0
  m_LinearVelocityBlending: 0
  m_WarningMessage: 
  m_HasTransformHierarchy: 1
  m_AllowConstantClipSamplingOptimization: 1
  m_KeepAnimatorControllerStateOnDisable: 0
--- !u!1001 &6245410185149597325
PrefabInstance:
  m_ObjectHideFlags: 0
  serializedVersion: 2
  m_Modification:
    m_TransformParent: {fileID: 6194881528928660065}
    m_Modifications:
    - target: {fileID: -8679921383154817045, guid: 47bfc20c54af6ae409a06a7bfeae71fa, type: 3}
      propertyPath: m_RootOrder
      value: 1
      objectReference: {fileID: 0}
    - target: {fileID: -8679921383154817045, guid: 47bfc20c54af6ae409a06a7bfeae71fa, type: 3}
      propertyPath: m_LocalScale.x
      value: 0.4
      objectReference: {fileID: 0}
    - target: {fileID: -8679921383154817045, guid: 47bfc20c54af6ae409a06a7bfeae71fa, type: 3}
      propertyPath: m_LocalScale.y
      value: 0.4
      objectReference: {fileID: 0}
    - target: {fileID: -8679921383154817045, guid: 47bfc20c54af6ae409a06a7bfeae71fa, type: 3}
      propertyPath: m_LocalScale.z
      value: 0.4
      objectReference: {fileID: 0}
    - target: {fileID: -8679921383154817045, guid: 47bfc20c54af6ae409a06a7bfeae71fa, type: 3}
      propertyPath: m_LocalPosition.x
      value: 0
      objectReference: {fileID: 0}
    - target: {fileID: -8679921383154817045, guid: 47bfc20c54af6ae409a06a7bfeae71fa, type: 3}
      propertyPath: m_LocalPosition.y
      value: -0.297
      objectReference: {fileID: 0}
    - target: {fileID: -8679921383154817045, guid: 47bfc20c54af6ae409a06a7bfeae71fa, type: 3}
      propertyPath: m_LocalPosition.z
      value: -0.14
      objectReference: {fileID: 0}
    - target: {fileID: -8679921383154817045, guid: 47bfc20c54af6ae409a06a7bfeae71fa, type: 3}
      propertyPath: m_LocalRotation.w
      value: 1
      objectReference: {fileID: 0}
    - target: {fileID: -8679921383154817045, guid: 47bfc20c54af6ae409a06a7bfeae71fa, type: 3}
      propertyPath: m_LocalRotation.x
      value: 0
      objectReference: {fileID: 0}
    - target: {fileID: -8679921383154817045, guid: 47bfc20c54af6ae409a06a7bfeae71fa, type: 3}
      propertyPath: m_LocalRotation.y
      value: 0
      objectReference: {fileID: 0}
    - target: {fileID: -8679921383154817045, guid: 47bfc20c54af6ae409a06a7bfeae71fa, type: 3}
      propertyPath: m_LocalRotation.z
      value: 0
      objectReference: {fileID: 0}
    - target: {fileID: -8679921383154817045, guid: 47bfc20c54af6ae409a06a7bfeae71fa, type: 3}
      propertyPath: m_LocalEulerAnglesHint.x
      value: 0
      objectReference: {fileID: 0}
    - target: {fileID: -8679921383154817045, guid: 47bfc20c54af6ae409a06a7bfeae71fa, type: 3}
      propertyPath: m_LocalEulerAnglesHint.y
      value: 0
      objectReference: {fileID: 0}
    - target: {fileID: -8679921383154817045, guid: 47bfc20c54af6ae409a06a7bfeae71fa, type: 3}
      propertyPath: m_LocalEulerAnglesHint.z
      value: 0
      objectReference: {fileID: 0}
    - target: {fileID: -6722085885383957590, guid: 47bfc20c54af6ae409a06a7bfeae71fa, type: 3}
      propertyPath: m_Enabled
      value: 0
      objectReference: {fileID: 0}
    - target: {fileID: 65702495048144492, guid: 47bfc20c54af6ae409a06a7bfeae71fa, type: 3}
      propertyPath: m_IsActive
      value: 0
      objectReference: {fileID: 0}
    - target: {fileID: 919132149155446097, guid: 47bfc20c54af6ae409a06a7bfeae71fa, type: 3}
      propertyPath: m_Name
      value: monster2@Dwarf Walk
      objectReference: {fileID: 0}
    m_RemovedComponents: []
  m_SourcePrefab: {fileID: 100100000, guid: 47bfc20c54af6ae409a06a7bfeae71fa, type: 3}
--- !u!1 &6515950722264071132 stripped
GameObject:
  m_CorrespondingSourceObject: {fileID: 919132149155446097, guid: 47bfc20c54af6ae409a06a7bfeae71fa, type: 3}
  m_PrefabInstance: {fileID: 6245410185149597325}
  m_PrefabAsset: {fileID: 0}
--- !u!1001 &7835932776699031496
PrefabInstance:
  m_ObjectHideFlags: 0
  serializedVersion: 2
  m_Modification:
    m_TransformParent: {fileID: 0}
    m_Modifications:
    - target: {fileID: 3283229601894383977, guid: 376bece0fe3c0a540afbf515bf3578f4, type: 3}
      propertyPath: isEvil
      value: 1
      objectReference: {fileID: 0}
    - target: {fileID: 4127110034370299304, guid: 376bece0fe3c0a540afbf515bf3578f4, type: 3}
      propertyPath: m_Mesh
      value: 
      objectReference: {fileID: 0}
    - target: {fileID: 4127110034370299305, guid: 376bece0fe3c0a540afbf515bf3578f4, type: 3}
      propertyPath: m_RootOrder
      value: 0
      objectReference: {fileID: 0}
    - target: {fileID: 4127110034370299305, guid: 376bece0fe3c0a540afbf515bf3578f4, type: 3}
      propertyPath: m_LocalPosition.x
      value: -8.25
      objectReference: {fileID: 0}
    - target: {fileID: 4127110034370299305, guid: 376bece0fe3c0a540afbf515bf3578f4, type: 3}
      propertyPath: m_LocalPosition.y
      value: -1.89
      objectReference: {fileID: 0}
    - target: {fileID: 4127110034370299305, guid: 376bece0fe3c0a540afbf515bf3578f4, type: 3}
      propertyPath: m_LocalPosition.z
      value: -0.5
      objectReference: {fileID: 0}
    - target: {fileID: 4127110034370299305, guid: 376bece0fe3c0a540afbf515bf3578f4, type: 3}
      propertyPath: m_LocalRotation.w
      value: 0.7071068
      objectReference: {fileID: 0}
    - target: {fileID: 4127110034370299305, guid: 376bece0fe3c0a540afbf515bf3578f4, type: 3}
      propertyPath: m_LocalRotation.x
      value: 0
      objectReference: {fileID: 0}
    - target: {fileID: 4127110034370299305, guid: 376bece0fe3c0a540afbf515bf3578f4, type: 3}
      propertyPath: m_LocalRotation.y
      value: 0.7071068
      objectReference: {fileID: 0}
    - target: {fileID: 4127110034370299305, guid: 376bece0fe3c0a540afbf515bf3578f4, type: 3}
      propertyPath: m_LocalRotation.z
      value: 0
      objectReference: {fileID: 0}
    - target: {fileID: 4127110034370299305, guid: 376bece0fe3c0a540afbf515bf3578f4, type: 3}
      propertyPath: m_LocalEulerAnglesHint.x
      value: 0
      objectReference: {fileID: 0}
    - target: {fileID: 4127110034370299305, guid: 376bece0fe3c0a540afbf515bf3578f4, type: 3}
      propertyPath: m_LocalEulerAnglesHint.y
      value: 90
      objectReference: {fileID: 0}
    - target: {fileID: 4127110034370299305, guid: 376bece0fe3c0a540afbf515bf3578f4, type: 3}
      propertyPath: m_LocalEulerAnglesHint.z
      value: 0
      objectReference: {fileID: 0}
    - target: {fileID: 4127110034370299306, guid: 376bece0fe3c0a540afbf515bf3578f4, type: 3}
      propertyPath: m_Mesh
      value: 
      objectReference: {fileID: 0}
    - target: {fileID: 4127110034370299308, guid: 376bece0fe3c0a540afbf515bf3578f4, type: 3}
      propertyPath: m_Name
      value: EnemyBadPrefab
      objectReference: {fileID: 0}
    - target: {fileID: 4611214745341563462, guid: 376bece0fe3c0a540afbf515bf3578f4, type: 3}
      propertyPath: m_Radius
      value: 0.4
      objectReference: {fileID: 0}
    - target: {fileID: 4611214745341563462, guid: 376bece0fe3c0a540afbf515bf3578f4, type: 3}
      propertyPath: m_Offset.x
      value: -0
      objectReference: {fileID: 0}
    - target: {fileID: 4611214745341563462, guid: 376bece0fe3c0a540afbf515bf3578f4, type: 3}
      propertyPath: m_Offset.y
      value: 1.3
      objectReference: {fileID: 0}
    - target: {fileID: 7219720866813044110, guid: 376bece0fe3c0a540afbf515bf3578f4, type: 3}
      propertyPath: m_IsActive
      value: 0
      objectReference: {fileID: 0}
    m_RemovedComponents: []
  m_SourcePrefab: {fileID: 100100000, guid: 376bece0fe3c0a540afbf515bf3578f4, type: 3}
--- !u!4 &6194881528928660065 stripped
Transform:
  m_CorrespondingSourceObject: {fileID: 4127110034370299305, guid: 376bece0fe3c0a540afbf515bf3578f4, type: 3}
  m_PrefabInstance: {fileID: 7835932776699031496}
  m_PrefabAsset: {fileID: 0}
