%YAML 1.1
%TAG !u! tag:unity3d.com,2011:
--- !u!1 &3204281244137861363
GameObject:
  m_ObjectHideFlags: 0
  m_CorrespondingSourceObject: {fileID: 0}
  m_PrefabInstance: {fileID: 0}
  m_PrefabAsset: {fileID: 0}
  serializedVersion: 6
  m_Component:
  - component: {fileID: 2827192373798824521}
  - component: {fileID: 1194562111699150316}
  - component: {fileID: 3996690272806703398}
  m_Layer: 0
  m_Name: brokenPlatform2Prefab
  m_TagString: Untagged
  m_Icon: {fileID: 0}
  m_NavMeshLayer: 0
  m_StaticEditorFlags: 0
  m_IsActive: 1
--- !u!4 &2827192373798824521
Transform:
  m_ObjectHideFlags: 0
  m_CorrespondingSourceObject: {fileID: 0}
  m_PrefabInstance: {fileID: 0}
  m_PrefabAsset: {fileID: 0}
  m_GameObject: {fileID: 3204281244137861363}
  m_LocalRotation: {x: -0.7652679, y: 0.10174611, z: 0.57835144, w: 0.26367107}
  m_LocalPosition: {x: -0.38703066, y: 0, z: 0.5}
  m_LocalScale: {x: 12.5, y: 12.5, z: 100}
  m_Children: []
  m_Father: {fileID: 0}
  m_RootOrder: 0
  m_LocalEulerAnglesHint: {x: -148.584, y: 77, z: -10.072998}
--- !u!33 &1194562111699150316
MeshFilter:
  m_ObjectHideFlags: 0
  m_CorrespondingSourceObject: {fileID: 0}
  m_PrefabInstance: {fileID: 0}
  m_PrefabAsset: {fileID: 0}
  m_GameObject: {fileID: 3204281244137861363}
  m_Mesh: {fileID: 3390558720134950976, guid: a09f761126c37a84da2bc9c2f6fbec8c, type: 3}
--- !u!23 &3996690272806703398
MeshRenderer:
  m_ObjectHideFlags: 0
  m_CorrespondingSourceObject: {fileID: 0}
  m_PrefabInstance: {fileID: 0}
  m_PrefabAsset: {fileID: 0}
  m_GameObject: {fileID: 3204281244137861363}
  m_Enabled: 1
  m_CastShadows: 1
  m_ReceiveShadows: 1
  m_DynamicOccludee: 1
  m_MotionVectors: 1
  m_LightProbeUsage: 1
  m_ReflectionProbeUsage: 1
  m_RayTracingMode: 2
  m_RayTraceProcedural: 0
  m_RenderingLayerMask: 1
  m_RendererPriority: 0
  m_Materials:
  - {fileID: 2100000, guid: 29fedcac12f94f64ab312df420e41f87, type: 2}
  - {fileID: 2100000, guid: e1e7098c6ccc5db4b90588f6617a4ae7, type: 2}
  - {fileID: 2100000, guid: 29fedcac12f94f64ab312df420e41f87, type: 2}
  - {fileID: 2100000, guid: 68050d66818052f4bb98e993edca0e17, type: 2}
  - {fileID: 2100000, guid: ef6fad94f8aa4cc4aa01f7bf5e7b75e0, type: 2}
  m_StaticBatchInfo:
    firstSubMesh: 0
    subMeshCount: 0
  m_StaticBatchRoot: {fileID: 0}
  m_ProbeAnchor: {fileID: 0}
  m_LightProbeVolumeOverride: {fileID: 0}
  m_ScaleInLightmap: 1
  m_ReceiveGI: 1
  m_PreserveUVs: 0
  m_IgnoreNormalsForChartDetection: 0
  m_ImportantGI: 0
  m_StitchLightmapSeams: 1
  m_SelectedEditorRenderState: 3
  m_MinimumChartSize: 4
  m_AutoUVMaxDistance: 0.5
  m_AutoUVMaxAngle: 89
  m_LightmapParameters: {fileID: 0}
  m_SortingLayerID: 0
  m_SortingLayer: 0
  m_SortingOrder: 0
  m_AdditionalVertexStreams: {fileID: 0}
