{
  "Header": {
    "title": "CABAÑAS EN CHINÁCOTA",
    "paragraph": "Villa La Condesa te da la bienvenida, para disfrutar de un ambiente familiar y relajante, donde sus espacios libres, corredores y alrededores te permiten conectarte con la naturaleza."
  },
  "About": {
    "paragraph": "En Villa La Condesa, nos gusta tratar a nuestros huéspedes como familia, que disfruten y se sientan como en casa, por eso nuestras cabañas se destacas entre otras de la zona, por ser muy relajante, acogedora y con una vista espectacular… ¡Ven a disfrutar del mejor clima!",
    "Why": [
      "EL mejor alojamiento.",
      "Disfruta de Caminatas ecológicas.",
      "Ten tus momentos de meditación.",
      "Despeja tu mente, frente a las hermosas montañas."
    ],
    "Why2": [
      "Asadero.",
      "Hamacas.",
      "Nevera.",
      "Juegos de mesa."
    ]
  },
  "Gallery": [
    {
      "title": "Entrada",
      "largeImage": "img/portfolio/02-large.jpg",
      "smallImage": "img/portfolio/02-small.jpg"
    },
    {
      "title": "Habitación",
      "largeImage": "img/portfolio/01-large.jpg",
      "smallImage": "img/portfolio/01-small.jpg"
    },
    {
      "title": "Mesas y Sillas",
      "largeImage": "img/portfolio/03-large.jpg",
      "smallImage": "img/portfolio/03-small.jpg"
    },
    {
      "title": "Juegos",
      "largeImage": "img/portfolio/04-large.jpg",
      "smallImage": "img/portfolio/04-small.jpg"
    },
    {
      "title": "Sala",
      "largeImage": "img/portfolio/05-large.jpg",
      "smallImage": "img/portfolio/05-small.jpg"
    },
    {
      "title": "Baños",
      "largeImage": "img/portfolio/06-large.jpg",
      "smallImage": "img/portfolio/06-small.jpg"
    },
    {
      "title": "Habitaciones",
      "largeImage": "img/portfolio/07-large.jpg",
      "smallImage": "img/portfolio/07-small.jpg"
    },
    {
      "title": "Habitaciones",
      "largeImage": "img/portfolio/08-large.jpg",
      "smallImage": "img/portfolio/08-small.jpg"
    },
    {
      "title": "Vista Relajante",
      "largeImage": "img/portfolio/09-large.jpg",
      "smallImage": "img/portfolio/09-small.jpg"
    }
  ],
  "Services": [
    {
      "icon": "fa fa-wifi",
      "name": "Servicio de Wifi",
      "text": "Para estar siempre en contacto con la red."
    },
    {
      "icon": "fa fa-car",
      "name": "Estacionamiento de Vehículos",
      "text": "Si viajas en tu vehículo puedes aparcarlo en nuestras instalaciones."
    },
    {
      "icon": "fa fa-cutlery",
      "name": "Asadero",
      "text": "Trae tus ricas carnes, y prepara tu propia parrilla en nuestro asadero diseñado a la medida."
    }
  ],
  "Testimonials": [
    {
      "img": "img/testimonials/01.jpg",
      "text": "100% recomendado",
      "name": "Kimberly Conde"
    },
    {
      "img": "img/testimonials/02.jpg",
      "text": "Excelente me gusto mucho la vista es muy rica y relajante",
      "name": "Jorge Castillo"
    },
    {
      "img": "img/testimonials/03.jpg",
      "text": "¡Muy recomendado para momentos en familia, excelente vista, comodidad y muy buena atención, espero volver pronto! 👍👍🎉👏.",
      "name": "Michel Parada"
    },
    {
      "img": "img/testimonials/04.jpg",
      "text": "Excelente sitio, para disfrutar en familia, lo recomiendo 100%.",
      "name": "Maryerlis Sanchez"
    },
    {
      "img": "img/testimonials/05.jpg",
      "text": "Una experiencia única y diferente, respirar el aire fresco de la mañana junto a un rico café de Chinácota “no tiene precio” gracias por la oportunidad de disfrutarte “Villa la Condesa",
      "name": "John V"
    },
    {
      "img": "img/testimonials/06.jpg",
      "text": "Excelente lugar para disfrutar en familia al aire libre y en la naturaleza. Ideal para parrillas y pasar tardes con buen clima.",
      "name": "Luis Silva"
    }
  ],
  "Team": [
    {
      "img": "img/team/01.jpg",
      "name": "Luz Conde",
      "job": "Founder and CEO"
    },
    {
      "img": "img/team/03.jpg",
      "name": "Lesly Conde",
      "job": "Administradora"
    }
  ],
  "Contact": {
    "address": "Chinácota, Norte de Santander, Colombia",
    "phone": "+57 321-650-5748",
    "email": "lacondesachinacota@gmail.com",
    "facebook": "fb.com",
    "instagram": "https://www.instagram.com/villalacondesa/?hl=es",
    "youtube": "https://www.youtube.com/channel/UCwF44qxVbRrFAiCHcNGqkqQ/featured"
  },
  "Features": [
    {
      "icon": "fa fa-comments-o",
      "title": "Lorem ipsum",
      "text": "Lorem ipsum dolor sit amet placerat facilisis felis mi in tempus eleifend pellentesque natoque etiam."
    },
    {
      "icon": "fa fa-bullhorn",
      "title": "Lorem ipsum",
      "text": "Lorem ipsum dolor sit amet placerat facilisis felis mi in tempus eleifend pellentesque natoque etiam."
    },
    {
      "icon": "fa fa-group",
      "title": "Lorem ipsum",
      "text": "Lorem ipsum dolor sit amet placerat facilisis felis mi in tempus eleifend pellentesque natoque etiam."
    },
    {
      "icon": "fa fa-magic",
      "title": "Lorem ipsum",
      "text": "Lorem ipsum dolor sit amet placerat facilisis felis mi in tempus eleifend pellentesque natoque etiam."
    }
  ]
}