[
	{
		"name": "Kolibri",
		"link": "//localhost:8080",
		"linkText": "localhost:8080"
	},	
    {
		"name": "Har Roz Meeting",
		"link": "//meet.jit.si/mirzapur",
		"linkText": "meet.jit.si/mirzapur"
	},
	{
		"name": "Crafts workshop",
		"link": "//meet.jit.si/slots2",
		"linkText": "meet.jit.si/slots2"
	}
]
	
