<?xml version="1.0" encoding="UTF-8" standalone="no"?>
<!-- Created with Inkscape (http://www.inkscape.org/) -->

<svg
   xmlns:dc="http://purl.org/dc/elements/1.1/"
   xmlns:cc="http://creativecommons.org/ns#"
   xmlns:rdf="http://www.w3.org/1999/02/22-rdf-syntax-ns#"
   xmlns:svg="http://www.w3.org/2000/svg"
   xmlns="http://www.w3.org/2000/svg"
   xmlns:xlink="http://www.w3.org/1999/xlink"
   xmlns:sodipodi="http://sodipodi.sourceforge.net/DTD/sodipodi-0.dtd"
   xmlns:inkscape="http://www.inkscape.org/namespaces/inkscape"
   width="163.5274mm"
   height="91.084541mm"
   viewBox="0 0 163.5274 91.084542"
   version="1.1"
   id="svg8"
   inkscape:version="0.92.3 (2405546, 2018-03-11)"
   sodipodi:docname="fig3_r7.01.08.svg">
  <sodipodi:namedview
     id="base"
     pagecolor="#ffffff"
     bordercolor="#666666"
     borderopacity="1.0"
     inkscape:pageopacity="0.0"
     inkscape:pageshadow="2"
     inkscape:zoom="1.2069487"
     inkscape:cx="302.42195"
     inkscape:cy="278.18084"
     inkscape:document-units="mm"
     inkscape:current-layer="layer1"
     showgrid="false"
     fit-margin-top="0"
     fit-margin-left="0"
     fit-margin-right="0"
     fit-margin-bottom="0"
     inkscape:window-width="1920"
     inkscape:window-height="996"
     inkscape:window-x="0"
     inkscape:window-y="28"
     inkscape:window-maximized="1" />
  <defs
     id="defs2" />
  <metadata
     id="metadata5">
    <rdf:RDF>
      <cc:Work
         rdf:about="">
        <dc:format>image/svg+xml</dc:format>
        <dc:type
           rdf:resource="http://purl.org/dc/dcmitype/StillImage" />
        <dc:title></dc:title>
      </cc:Work>
    </rdf:RDF>
  </metadata>
  <g
     transform="translate(-41.841965,-105.80074)"
     id="layer1"
     inkscape:groupmode="layer"
     inkscape:label="Layer 1">
    <image
       width="126.47083"
       height="87.57708"
       preserveAspectRatio="none"
       xlink:href="data:image/png;base64,iVBORw0KGgoAAAANSUhEUgAAAd4AAAFLCAIAAAD3V3pkAAAABGdBTUEAALGPC/xhBQAAACBjSFJN AAB6JgAAgIQAAPoAAACA6AAAdTAAAOpgAAA6mAAAF3CculE8AAAABmJLR0QA/wD/AP+gvaeTAAAA CW9GRnMAAAQbAAABhwAydAQ+AAAACXZwQWcAAAeAAAAEOADeU4N4AAB8TUlEQVR42u2ddXwTSf/H Z3ejTZqkqaSpu9DS0uIUd7eDwwvcccihhx5uxx1yuMsBh7vdwSHFXQql3lL3NG3jLvv7Y58nT35F DlooaTLvP/Land3ZHdtPZme/8x0Ex3EAgUAgEEsChUUAgUAglgaUZggEArE4oDRDIBCIxQGlGQKB QCwOKM0QCARicUBphkAgEIsDSjMEAoFYHFCaIRAIxOKA0gyBQCAWh+VK84ULF2D1QCAQ2wSxwIna arV62rRp6enp9+7dgzUEgUBsEIvrNctkstmzZ1+4cMFgMMDqgUAgtonFSfPVq1fPnDkza9YsWDcQ CMRmsSxpfvTo0YoVK65evQorBgKB2DIky0lKenr6gAED1q5dq9VqCwsLZTLZs2fPmjZtiiCI+WlH jhx59OgRAMBoNNLp9G5du8FahEAgH4/RaHTzcGsU2ciSE2lBnwETEhJiYmKIbZ1OZzAYaDSaVCrF MOyd58vl8vnz52/duhU2NQgE8vEoFconT5507NTRkhNpQQMajRo1UvyXlStXtmjRQqFQvE+XIRAI xIqxULtmX1/fZs2aweqBQCC2iQWNNZvz7bfffvvtt7B6IBCIbQInakMgEIjFAaUZAoFALA4ozRAI BGJxQGmGQCAQiwNKMwQCgVgcUJohEAjE4oDSDIFAIBaHhdo1QywfjUajVCphOUC+BBiGsVgsWy4B KM2QGnL48OG9e/dWVFTAooB8XjAMi4iIOHPmjC0XApRmSA3RarWdO3detWoVLArI5yUjI2P06NE2 XghwrBkCgUAsDijNEAgEYnFAaYZAIBCLA0ozBAKBWBxQmiEQCMTigNIMgUAgFgeUZggEArE4oDRD IBCIxQGlGQKBQCwOKM0QCARicUBphkAgEIsDSjMEAoFYHFCaIRAIxOKA0gyBQCAWB5RmCAQCsTi+ gr/mqqqqhIQEAECTJk3eXsjg7t27BoOB2A4JCXFzc4OVBIFAbI26lmaFQjF69Oh79+7RaLSePXtu 377dzs7O/ITevXtjGEalUgEAGzZsGDFiBKwkCARia9T1gMZvv/2Wlpb28OFDgUCQmpq6Y8eOt885 duyYQCAQCARQlyEQiG1S173mn3/+edasWW/evDl37pxerw8KCjI/umDBgo4dO9Lp9HPnznG53Pbt 28Magnwqe/fubdOmTUhIyDuP5uXl/fXXX1OnTrXY9N+9e/fatWvVAtls9rx58z7L9Tdv3ty/f39v b+8PnyYUCvfv32+66erVq8eNG+fk5FTttFu3bimVyt69e8OG93mpa2lmMpkAgBMnTly+fLmysrKo qMhgMGAYRhyVyWQpKSkLFy6srKykUqk//fTT2LFjq11BIBBIJBIAwNdfzhkHMpmspLQk7mbctX+u 4QBHAIIDHACAAITBYPTr169rt64cDgdF4efWuuPo0aMPHz6cM2dOWFhYtUPZ2dnr1q178uSJJUvz 48ePr1692rVrV/NAiUSycePGn376qfbXNxqNH9W6cdz8zC1btgwcOLCaNN++ffvevXuNGzeGre6z 83WWbd2wYcOGDRs2bdo0efLkIUOGODo6EuHffPNN9+7de/XqBQB49OhRTExMbGysSbgJEhMTU1JS AABarfbrll1eYd7S+UsvXrloMBhQgBqBkfgFABAbV65cady0cdOmTfv369+sWbNqGYF8Of7888+u Xbu+Lc0ZGRm7d++OjIy08PS3aNFi9erV5iEikWjp0qXbt2//4YcfKBRKbS7+kfru4uIyf/78D58j kUiaNm1KPLCQz0tdS3N8fLxQKOzevTsAoEuXLtWOUqnUf/1L79KlCxFRLpf/a9P5QiiVyitXrqz8 ZWVubi6CIyiCurm7tYlpQ6aSUQQFAEhl0ru371aKKuOfx8e/iN+zZ0+Hdh1mzZoV0zoGtrk6oEOH DkVFRRkZGcHBwabA3Nzc9PT0bt26lZWVVTv/3Llzcrmc2G7Xrh3xsv/q1aukpKRqZ7JYrP79+5t2 T58+rVKpTDf19PQktl+/fq3T6dhs9uPHjwEALi4u3bt3l8lk58+fN8UdOHAg8RL5MTg4OPzyyy8c Dmf06NHm0nzr1q2ioiIAQHR0dHh4OBGYl5eXnZ3dqVMn02kGg+H48eODBw+mUqmXLl1q0aKFi4sL cejZs2fp6enEtp+fX+vWrYltiURy48aNQYMGAQCOHTumUqkuXLjg6uratWtXV1dXAMCTJ0+kUikA 4Pnz502bNoWt7vNS19L8/PnzxYsXL1++vEmTJsuXL/fy8pLJZHl5ecQ70aNHj3777be1a9eGh4fP nz/f19cXQRCLKi+9QZ+elr5l85a///5bppBx2JzOHTuPih3l4+vj5e1Fwv5TnlqtNic3JzM9c+fO nUnJSTKp7MbNG6kpqeMmjBs5cqQrz9VmG5zeoK+oqMjJzhFViQAAOILjOI4iKMABQIABN2AIRmwb cSMCEAQgAAAc4DjAUYD+b/v/R+G78n19fdlsNoqhAICZM2ceO3aMxWKZS/PTp0/j4uIWLVo0ZcoU 8yRdvnzZXJqrqqoGDhzo5eWVmpp67tw502lCoTA1NXXEiBGENOM4TkQ0SbNEIunfvz+hzhcvXoyP j4+JiXn06BEAIDQ0tGXLlpcuXTK/IIqiffv2fdt+9ON58ODB+fPnCwsLAQAFBQUYhoWGhhJqe/Dg QXNp1ul03333Xc+ePalU6oIFC/bs2UNI88uXL8+fP5+Wlkac5u/vTyaTmzdvDgAoLS2dMWMGIc2X Ll1Sq9XXr19nMpnR0dGurq4vXrw4f/58RkYGAKBBgwYkEikqKgrqaT2W5okTJwoEgtmzZwMA+Hz+ 5cuXU1JSYmNjKysrAQCzZs0qLi4mnhw/P7+rV69a1CitXq8/dvzY2jVrCwsKAQrc3Nx+/vnn2FGx b49UUCiUkOCQkOCQrt26Pnzw8MXLF9u3bC8uK1792+onj59MnTw1pk0MiUSynKzVGaVlpRcuXjh6 6GhaWhpiRIyo0WA0kFCSaRtDMdSI4ihuMBoQBMEAhgPcAAwAAAxgCEAMiAE34hiK/S86RoppETN8 2PB+A/vZ29sTNwoPD5fJZPn5+UQXuLi4WCgUNmrUyDwxBoPhzp07u3bt2rt3L9ETBAAMGjSIw+GM GTNmxIgRJhuh8vLyS5cuJSQkbNu2jWgJt2/f3rFjx5EjR7hcLnFO3759HR0dhw8fTuwmJCS0bdv2 woULpt2lS5fm5OSY7j5y5MiYmJiPlGa1Wn3//v3OnTubGtuzZ8/2798/bty4Vq1aAQD27t174sSJ 4cOHBwcH83g8T0/PFy9eNGnSBACg1Wrv3LnToUOHt5vctm3bGjVq9NtvvxG7cXFxV65cIaTZnBMn Tri5ue3YsYP4bp+QkHD48OHOnTuvWbMGAHDu3LkjR46QSKSGDRtCSf1s4BbA2LFjaxBLJpNNmTKl LtOZlJzk6+vLtGc6Ojr+/PPPEqnk4+PGXY9r3rQ5057JtGe6ubqtWLHizZs3llD4NWb79u0LFiz4 1FgXLl1o1ryZPdOewWTYM+3tmHZsJtuOacdisuhMOrFNhLOYLAaTwWQyiV8iCrHLYrJMp7GZbDqT zmKyohpF5efl4zjerl27v/76C8fxCRMmrFu3jrjv3r17hwwZguP4/fv3IyMjiUC1Wt2iRQuxWEzs pqSkPH36tGPHjgcOHKiW7PPnz3fq1Mm87TVv3lyhUBC7ycnJT58+bdOmzdGjR4mQ5cuX//TTT+ZX ePXqla+v78cU0W+//fbNN988/f9cu3atffv25qc1btz49u3b5iHLly+fPn06sX358uWYmBhiWygU UqlUjUZD7IaFhT18+ND06G3evPmdyUhLS3N3dzft8vn8jIwMYrtPnz6HDx82P3nv3r2DBw/+XE0r PT29efPmX67pKuSKm3E3Lfz5+vodt6SkpKFDh1r+f1hKSsrcmXMrKirYbPamDZt69e5Fp9M/PnqH Th0uRlzc98e+fXv3VVRWbNyw8VrctWOHj3l4eNiU/QaGY2RAJpPIOqOO6C8DIyBhJJ1BR8bIwABI KElv1BOdYhJK0uN6BCAYwMB/hzJICAkYAYZiRH8ZGAAZIxtxIwklgfeMflVVValUqrdnllKp1MeP H2dmZpaWlgIAFixYkJ6eXlJSMmrUKPPTJBKJRCIxjSMDAJhM5uPHj9+8eUN8Gpk3b15WVlZxcfEH Mk6lUr28vEyjuuC/owfvPPnmzZvJycnEtlqtLi0tbdmy5Z07d6qdVlBQYH7BioqKT21LfD5fq9Wa LsJisT5y/m1JSYn5rd8evofUkq8vzQ0bNrTw9yAcx3Nycib8MCE5OZlMIU+aNKlHzx6fpMsAABRF eTzerJmzWrVstX3b9ps3byYlJI0eO3rnjp1BgUG2o85RTaIGjxh87PgxUaUIA5ge6MmArAVaCqCY fsmArAd6EiAZgAEFKGGPCAAghpuNwEhEJAGSDuiIKM4s59jxsWwO2/xeDg4OBoNBIpEcPHgwNTV1 3759b9dscXFx//79ic9ZFy5caNKkCTG6akIul588efLp06cHDhwwBRqNxqKiot69exMWnJcvX46M jOzbt+8HMh4aGvrnn3/GxPzvO/D58+cbNWr0TnUeNmyYaTZWQkLClClTjh8//vZps2bNIubNmhg3 bhyxQaPR2Gy2QCBwdHQsKytzd3d/Z6pWrVq1ZMmSzp07E7vdu3dfvXr128bLb7N69eotW7aYh/Tp 0wfq6WfEFoc7P5WSkpKJEycmJSdR6dQ5c+ZMnza9xtZLNBqtQ4cOjSIbjZ8w/nbc7RfPX4wdM3bO nDn9+/e3EXV2d3OfPnX69KnT6+Bev/322+zZs9evX8/hcN55gkaj8fHxKS8vN40Xv82hQ4eePHly 6NAh80C5XO7j4yOVSj/exAIA4O3tTVhTEPj4+Pz9998ms4r30ahRo3379jVt2tQ8LsHp06fNp2UR QxbEdseOHSkUSrdu3c6dO9e+ffuKior3XX/FihUrVqwgto8cOTJu3DjT+PgH2LJly8iRI027Wq1W r9dDrfiMwKkQ/86pE6devHiBYMjCBQt/mvFTLa1KAQAOXIedO3YOGT6ERqGlpKbMmT3n1JlTGo0G FjWkNqxZs+bnn3/+Krc+dOjQmDFjYBV8RqA0fwjiC8+efXv0Rn3zps0HDRr0ucwqnJydVq1atWjR IpY9q6KiYu7suQcPH9TpdLDMPy+rVq0ikUjFxcWEZcW/0q9fP/M+44YNG1JTU/fs2fOvEXv06HHl ypUPnJCYmFjjgbugoKBbt25VGwW+d+/er7/+evnyZWJ30aJFer2eMJkgaNmy5a5du/r06ZOXl/e+ K0+aNGnnzp2fmp6TJ0/GxcX98ccfxO727dufP39e7cUCUkvggMaHkMvli5YsKikpISGkxUsWv2/A rmZwOJxxP4xzdnbesGFD1pusX1b+guDImDFjKGRKvS0wi4MYisVxnEajvfNoQUFBTEwMMfUfALBt 2zaTT9o1a9asWrXKYDCYGyMHBATcu3ePyWQWFBQ0atTI5C1g9+7dpojvJDQ0dP/+/ebyeunSJXOz 6w+Aoqi/v/+dO3c8PDwyMjIYDAYAwM7O7tixY1OmTPnhhx8AANOmTfvxxx/Nh54xDKPRaCqV6gOj Lr/99tuKFStMqerRo8f+/fvfd3KbNm0wDDtz5kyrVq02bty4ZMkSIuKwYcPWrFnzzhKG1BjENDhV 7yBmA27duvXL3eLw0cNTJk1BUGTK1Cm/rPzlC93l/LnzU6ZMkcvldiy7vy/+XV88EuzYsaO4uHjV qlWWlrCCggIul2vSo4qKCoPBwOPxiF2lUikQCHx9fU3nZ2Zmmuagenp6isViJpPJZrOFQiFhbm8O hULx8/MDAOA4brLQAAB4eXlVVVXZ29uz2ey3b0qg1WrN7ZrfZ6FRWVmp0+lMdtYmDAbDmzdvgoL+ 30fjoqIiYrKMs7OzyeGBCbVaXVxc7O/vbx6Ym5vL4/FMzngFAoFIJCK2zS00NBpNYWFhQEAAsZuV lUWMJnt5eRFxy8rKxGIxAMDBwaFaTmtJRkbG6NGjnzx58oVaiFKhfPLkScdOHS35+YK95veSl5+3 e8duHODh4eGxo2K/3I169e5lxI1zZs+pqKyY9OOkcd+NG/fDOOgRqcZ4eXmZ71azN7CzszPXZQBA NfeHRJ8UAODs7Ozs7Py+uyAIUi2iuefxdxo5UCiU9/nDM+dthSXAMOzt6B4eHh+4FI1Gq6bLAIBq 2efxeO8UViqVatJlAID5NoGrq+vb/x+QzwV8/t/LzbibhOXmjOkzqj2EnxcKhdKrV6/JUyeTyeT0 tPQlS5Zkvcmqv28zEAik9kBpfjeCcsEvK3/R6DQBQQF14DaaRqNNnzZ90+ZNbDZbpVINHTb02dNn sBYgEJsFSvM7EIvFC+YvqKiqYDPZy5cuf98L5ueFRCINGzpsxcoVHC4nJytn8eLFCqUC1gUEYptA aX4HOTk5f13+CwNYz949u3btWmfDviQSacTwEaPHjDYixoRXCevWrZPKpLA6IBAbBErzOygqKNIo NUbEOHLkyGoTYb80FApl6pSpzZs0V2lVmzduXvXLKqjOEIgNAqW5OqkpqUuXLTUCY4OQBh6eHnWf AGcn5wN/HhjQd4DeqN+7d+/Pc3+2vEKCQCBfFijN/w+NRrN1+9acvBwajfbTzJ+8vby/SjI8PDxW r13dvWt3vUF/+uzpZ0+ffXg6AwQCsTKgNP8/ZHLZxYsXcSM+sP/AwYMHf8XV/Nzc3GbMmMFms9Vq 9Xfff0cslgGBQGwEKM3/D2G5UCFTIAjSKqbVV5/0EdM6Zsf2HXxXfn5B/oL5CyRSCawgCMRGgNL8 PzRazZ7de4zA6OTs9Pbcp69Cjx49Jk6YiAEsJS1l6dKlKrUKVhMEYgtAaf4fKSkpV65dQQHaoUOH Jk2bWEKSSCTS2O/Htu/QHtfjR44deRX/6l9XHIdAIFYAlOb/kZ+fX1ZcZgTGCeMnUClUC0mVA8dh 0aJFLjwXnUo3bvy4WzdvwZqCQKweKM3/4/at2zjAWfasj1mApy6Jio5a+/taJxenosKin+f9LJPL YGVBINYNlOb/kJqeeuH8BQQgXbp3cXZxtqi0YRjWq2evyVMmk8ikrJys5cuWCyuEsMogECsGSjMA AKjV6t27doulYnum/Y8TfmQymJaWQhKJ9N2Y77p06mIwGv7Y+8eGTRtgrUEgVgyUZgAAKCgouHTx EoqjA78Z2LRpU8tMJIfD2b59e49uPfS4/szxMzdu3MCN0HEoBGKdQGkGAICqqqqqyioDMHTr3g1B EItNp5Oz0/Tp0x0dHMuEZfPnz6+orIB1B4FYJRYnzc+ePRs/fvz48eNLSkrq7Kanzp4yAqMjx9HR ydHSCqQarWJazZ49m06hZ2RmbFi/QSqFzo8gECvEsqT57t27bdu2FQgENBqtT58+KSkpdXDT3Pzc G9duIADp2q1ro8hGFl5hCIIMHzW8V69eKEB37Nyx4OcFsBFDINaHZUlzYmLilClTjh49umXLFoVC 8fjx4y99RxzHb9+8XVZWhgN88JDB9WJVYC6H++vqX7v36I4D/MKlC3fv3IXOj8yZMWPGB1pOUlLS uHHj6kVGHjx40P6/DB48+GOinDlzZt26dR9z5ty5c+/evVv7RP7555/btm2Dre6zY1nLtk6dOhUA 8Ntvv7169YpGo8XExHzpO2o0mqOHj6rVaj9/vxbNW9SXauPz+dOnTX/y5IlIJPrxxx937NjRrn07 2JoJEhISHj9+vHbt2nbtqpfJixcvZsyYQSxBbeHcunXr/PnzM2fOJHYVCsXQoUNPnDjx4VjR0dEf 6WNg4MCB1da3rRn5+flVVVWw1X12LPEzoKenZ2hoaFFR0fz587/0vGStTvss/hkCkNjhsUymxdnM fYBWMa02bd7k4upSVFS0atUq6PzInGfPnhUXF78dXl5e/vDhQ8tPf1xc3NWrV7/55pu+ZnTv3n3U qFFqtfoDEf38/Bo1avQxt2jRooWbmxtsKhaLZfWaCUaOHAkAaNmyZY8ePd5eWPrIkSOEh0ydTlf7 8QepWIoCFCCAwWJYsm3GO+nbp29GZsaqX1a9jH857+d527ZsI5EssULrnh9//DEpKenevXtt27Y1 BT5//vzOnTuzZs2Ki4urdv7ChQsrKyuJ7fHjx0dHRwMALl68+M8//1Q709XVddmyZabduXPnmr7E Tpo0KTIykti+fPmySqVydXU9cuQIACAgIGD27NlCoXDx4sWmuKtWrXrnspPXrl27f/9+9+7dzdcL ZjAYw4cPV6vVM2fO/PXXXzkcDgBgw4YNnTp1evHixfPnzwEAvXr1srOzKykpGTVqlCmi+U3Xr1// 66+//vjjj+7u7lu3bo2JiTHl1Gg0crnc48ePE2f6+Pj8/HP1NRyWLl0qEAiI7bFjxzZv3hy2tC+H ZT3J27dvLygoWLJkCYPBeF/vYOTIkYR2y+Xy+fPn1+Z2RqPx8KHDRmBks9i+3r71rvIwDBv3/biX z19evX713OlzsSNim7do/hV9TH9kmSvkinJhuUwmQxHUiBsxBNPjehJK0hv/+4uQDLiBOIoiKI7j gPjTxAGCIERgtYgOHAdnR2c6g064cu3Ro8exY8dSU1PNpTk7Ozs5OXnBggXVpHnZsmVMJpPNZhO7 58+fNxqNTZo04XK5fn5+ptPevHlz9erVpUuXmjKyZMkSLpdrmtZ/+vRpo9EYFRUFAIiPj//rr796 9OhBXMHNza2kpGTr1q3mF/z999+nT5/u6uparYhevXpVVVXVsWPHauEUCmX8+PEsFmvRokWENF+6 dOnBgwdRUVHEZR0cHF68eJGcnGyS5mo3XbFixa5du4YNG+bu7n758mU+n09I8/Pnz+Pi4rp27Wo6 U6/X//7777Nnzzbd/ZdffqHRaKYT/v77bxzHW7SoN2OAUJprRYMGDWbNmpWZmenr63vw4MEhQ4Z8 UafJAoHg+o3rKECjoqLatm9bH+vPydFp1qxZr+JflVWUTfxx4pHDRyIiIiw5wTK5rCC3oKiwSC6X owhqwA0YghG/evw/okyEEKKMIAjxCwAw3yWk+T8nAwOHxVG4KQJDAilUCnGj/v37p6WlPXnyhJCP V69eZWRkDB061Dwxer1+7dq1BoNh4sSJDg4OROCgQYP8/f2bNGnSpk2bNm3aEIEZGRknT55cuHAh 8QlRo9EQX9smT55sb29PnNO3b98GDRoQ0gwAwDAsKipqwIABxG5CQsLJkydzcnLMpbn2L2okEqlv 376m3vqLFy9MhwoLCw8cOODk5DRr1iwiZNWqVe+7I4qiTZo06du3L7H77Nmz2NhYkzSvXbtWo9FM nz7d9D80cuTIhIQEKM1fDssaa+7QocPt27e5XK5EIpk5c+bRo0e/6CBDZmZmRlqGERiHDx1Op9Hr aRU2a95sw5YNPCdebm7uxvUbLTy1Uom0uKRYIVcA5D+9YICDd24jOPL/wv97CCAAwRHzkwEAMoks vzBfp9OZbvTtt9+WlpY+ePCA2I2Pj09LS4uNjTVPDI7j5eXlP//8M6HLp0+f3rJlS1ZW1tvJTktL u3fv3sSJE00RiYECQpdPnDixZcuW3Nxc8yitWrUy6fI7mT17No/Hq2V5jhw50qTL1cjPzz937pxJ lwEACxcuJLrbb9O2bVuTLr+NUCicPXs2octnz57dsmVLRkaGDctmXWBxQ5MtW7Zs2bJl3dxLqVLK VXIEIA0aNKi/VYggSPeu3eN6xR3488CtO7eeP3veuEnjr75Ey/sgk8l0Gl2pUOr1ehzBzYcsqv3i CG7qJpsGNMwP/b8oJECzoyHou//Ik5OThUKh+dCtKTGbNm06evSoRqMBACQmJkqlUomk+gfVrKys N2/edO/e3RRCo9E2bdp0+PBhvV4PAEhISJDL5W9HNIfL5Xbv3n3//v2mkMGDB5t63BbOunXrTpw4 oVQqAQBJSUkSiUQkElmHAlosNv3VKD8vHwc4CSPV969nZAq5X/9+x08eF4lEP4z/4Y99fzRu0tgy k+rIdQwMCGQwGHq9HhgBQMG//L7tJgR512kY8HL3olAo5idGR0eXl5enpKRcv349Ozt737591a5k MBguXLhw+fJlrVYLAFi1alVwcPCgQYPMz8nOzr5w4QKO43PmzDEF6nS6CxcuXLlyhZDmNWvW+Pv7 f6DXCQDw8vJaunTp5MmTTSEYhvXv3980xm3JEKWkUqkAAMuXLw8LCyO+90C+HLYrzUqlctfOXRjA mjVrVvv3yq9Ox04dN27euHDhwtyc3OXLlx89ftSeaYk9MjKF7Obp5uZZF2Zb48ePnz179smTJ9/3 Fq/T6YYMGVJeXs7lct93kWvXriUmJh46dMg8UKVSDRkyRCqVfpLBJY/HO3PmjGnXx8encePGb0uz r69vVVVVUlJSw4YNzcP1ev3Nmzfbt29Ppdb1Og8jR47MzMyExnZ1ie26N3pw74GgTICQkG+Hfmv5 rjM+hiGDhwwfMdwIjE8fP12xcsXbdoc2iI+PD4IgWq3W39//Y85PTU01WdEBAIqKipRKZWBg4L9G TE5O/vA7vkKhiI+P/6h6HDKkRYsWe/bsSU9PNwVqNJp79+6tXLny1KlT7zS5ext7e/uAgADzmz57 9owYuqklaWlpQiH0GP5lsdFes1arvR53XaFWcOw53bt3r3cWze+uSxJp8qTJifGJ9x7cO3zwcOyI 2LDwMIsddK4bpkyZsmLFivLy8g0b3uHhGkGQ8PDwzMxMU+f3119/ffny5ejRowEAAoFg/fr1paWl ixYtSk5OJk6gUqmBgYEoioaHh6enp5ss61esWPH69esPpKSwsHDu3LmbN282hfj6+r6v/ztw4EAS ibRmzRrTR7zKysoFCxY8efLk4/MeGRn5yy+/TJ482XTTadOmmf/xfDwNGjTIzs42zfpbt27d06dP P/yRE1Lbx9k2s11RUXH7zm0UR9u0a+POd7eafLm7uc+dNzc5KblSXDn428F7d+9t066NrVUuj8ej 0/9nb8Nms83/eqlUKp/PN20nJCRERESIxWIi5MiRIywWi8FgAAAOHTp09uxZAEDPnj1N0QMCAm7d usVkMhMSEsLCwhQKBRF+8uRJe3t7Ozu7d94UABASEnLgwIHWrVubQh4+fOjp6fm+XPTt25dKpZpu zefznz59+uGcAgDs7e3NB2eq3TQxMdE0V9DFxcU8tdXcsFAoFPPhi2fPnjVt2tQ03+SPP/7gcDjE /xmbzYbvZ18EvN4ik8mmTJlSs7gZ6RlsNtve3v7w4cP1twTeiV6vP3T4kKe7J9Oe2aVzF6PR+IVu tH379gULFlhZ6VkTWq1WLBabh1RVVTVs2DA1NdXCU56ent68efMvd32FXHEz7qaFF4KNvu3q9XrC O4c9q35YL308GIZ9O/jbUaNHIQiS/ib96dOnOOzU2CTPnj3r2LGj3ozg4OBLly6FhobCwrF8bFSa X756iQPc3s7enmFt0gwAoFKp4yeMZ9AZ4irxtGnTMtLh7ABbpEWLFjt27GCZ8erVq8/ibQ5SB9ii NOu0ujOnzqAADQwNDGsYZpV59PbyXvnrSjaHnZGesWzZMmKyAMSmwDAsOjo6zww+n2/jn4XrEbZY T0kpSWlv0ozA2K5NO3uGfU5Wzp2bd25ev5mUlCQSiQxGK3FLHzsydsDAAUZgvHfnHlyB2zYhk8ku ZkBdrkfYYlXFv4ovF5STUFJMm5jnT5+/jH9ZUVEhEokyUzMf3X+UmZFp7oqh/kKhUGZMn9G0cVOZ SrZ75+78vHw46AyB1BdsTpoNBsOje49wI946prVEKBEKhQAFHEeOPdseAKBSqVISUx7ce2AdLgL8 fP3mz5/PZrLFEvHgoYMTEhJgi4dA6gW1smu+efMm4XyA4Pr16xs3WrrnM6PR+PDhQ2dn5x7deyAY Qreje3p6BgYFohiqVCjTUtJKS0srKioy0zKjm0aTyeT6XsEdOnZYuGThb6t+S0tN+2XlL2fOnrGO +TUQiHVTQ2nW6XS7du2aM2eO+bzPerEaphE3yuSyEcNHOLs4YxgWFh7m4+tDHKJSqVGNo7BXWGFx YUFhAZlMbtCwQb1YyPVDFUwifTf2uzeZb/bu25uYnJiYlBjRMAKqMwRi4dRwQCM7O3vatGm9e/em Uqm//vorsdzq+vXrLT/DSrmybdu2TRo3QQDi4+3j7v7/pgLS7eiNmjTycPcAAOTk5LyMf6nVaOt7 HVOp1AkTJtApdIFAMGXylPy8fNjuIRALp1ZjzT/88IOXl1e3bt02btw4YcKEKVOmWH6GL/9zuWOH jiSM5OLiEt4onEypPmRBpVKjmkQFBAQgACktKn3+/LkVfBUMDAyct3Aeg8FISkz69ddfP7z0JwQC +erUSpqjoqIiIyM3bNiQlpamUChM/gQsFq1Om5uf6+jgiCCIK9/1fUPJVCo1PCLcw9sDACAoFWjU GgvP179XM4r+OPHHbt27GXDDP1f+2fvHXtj0IRCLfmZrFo3H43Xp0uXIkSMjR448evRow4YNjxw5 Yr6Or2UiLBd6uHgAAKg0Ks/1Qz6ayWSyh4cHiqJGozEz3RrM6eh0+pzZc8JCw8Qy8ZaNW8oF5bD1 QyAWSw2l2cHB4fr1687Ozv369bt169akSZNu3rzZv39/C8+t0WikUCg4wB1dHNmcf1ldwsXFxdPb EwCQl5dXVFhkBZUd1iBs4cKFDBqjrLzsm8HfpKWmwQcAArFMaiLNZWVlDx48ePDgAbFSeocOHXbs 2PH22uwWCIIgxPJxgf7/7hydTCGHhoUymAyD0ZCanFpRUWEF9d2tW7fpP023Z9i/fv36119//SyO 1SEQyGfnk6VZJpP169ePWAe+a9eud+7cqWc5xgEA4CNnrNrZ2TWMaEihUJQqZVpqmhUIGYVKmTFj Rv+B/XEcv3nr5t69e6s56oVAIJbAJ9s1T5o06dmzZ46OjoGBgU+ePOnbt69UKq1HGUYAgoCPtepF EMTD00OlUb2Ofy0UCCsrK61geTQ6nT5n7pz4F/FpaWnLli1r07ZNZERkzS6lUCji4uLgUwT5vFRU VEDT+xpOOTl06FBMTIy/v7/5bEBrxcXZxc7OTqVUZaRkODk5VVu2uT7i4+Wze8/u4cOHFxcWb9++ fevWrVTKJ68EGhoaeufOnT179kApgXx2vvnmGxsvgRpKM5fLZbPZGIbVs+wiAMXQT/XyY29v3yCs QfzzeLFYnJ6eHh4eXt89eCEIEhkRGREZUVhYeOPqjeMnj48ZNeZTL9KhQ4cOHTpAEYFAvgQ1lObt 27efP39eLpfr9fp58+YRgeHh4RZuP1dcWkzCSEqNUq/Xf3wsFEU9fTxzc3OrKqpy3uQEBwVTaVRL zubHgCDInNlzMtMy32S/+X3N73169LGOZcUhEOughtJ85MgR0/batWuJjYEDB36MNJeUlNy8eRMA wOFw+vTpU+3o8ePHTbrZsmXLgICAz5hbQbEABzixXN4nRcRQLLRB6PMnzzVazZs3b0IbhNa/N4a3 iI6Knjt37pQpUwoKC0bGjtyxbYevny98JCAQS+CTpXnZsmWTJ09+5yFHx3/vdpWWlg4aNKi0tNTB waGwsHDevHkzZswgkf6XjPHjx7u4uLDZbAAAk8n8vNIsl8spJAqFQsFInyysjs6Ojk6OJSUl2dnZ rq6uTs5O9b3uEQTp379/wuuEA/sPPHz4cN26dZu3bLYCZ3sQiBXwydLs5+fn6+v7vkf9X6Pv3LlT JpPduHEjICBgx44dkydPHjt2rEnTjUYjgiDbtm3r0aPHl8gtYZvB4rBq4E+OTCIHhgSWlJRoNVpR pcgKpBkAQKPTFi1aVFxSfOHChb8v/92iZYuRI0fCtTAgkK/OJz+EsbGxpPcwePDgf42+YsWKpKQk oi/crl27akenT5/evXt3vV6/bdu2M2fOfN6sajQahh0DAYiTgxODwajBFVj2LK4DFwFIYlJiUWER Dqxh0RAmk7lg4YIA/wCxWDxt2rQLf12ATwUE8tWp4VhzdHQ0i8WqFhgW9glLoJaUlMyfP3/Lli0c Dsc8/OXLlyqVSi6X63S6zMzM+fPnV+uMZ2RklJaWAgBUKtUnpbmstMxgMOA4rlKramY1SaFSIhtH Pn/yXC6XZ2VkOTk71XdvzgQhQSH79u37bsx3efl5O7btiAyL9A/wh88GBPIV+WRpZjKZAAAHBwdi FOKHH36IiooCADAYjI/XKZFI9O23344aNWrChAnm4d99993w4cNbtmwJAHj06FFMTMy8efOqfXCT SqXl5eUAgE/1bCmuEhv0BgAAitTwhR1BEEdHx5DQkBfPX1RVVcnkMuuQZgRBGjduPCp21K+rf41/ Fr9i5Yr9+/dbwXdOCKT+8snSvH37dhcXF2J7w4YNp06dIrZ79uw5duzYQYMG/esVcnJyBg0atHz5 8rfNMwQCwb96Fm3atGnTpk0BAHK5/Pnz5x+fcqVGaTQaMQyzt7evTZFxuByaHU2tVOe8yeGwOVbz 3ezHyT9m52UfPXz0xrUbR44dGT50OPwkCIF8LT5ZmjEMW7FiBbHt5+enUqlu3759+vTpK1eu0Gi0 f5XmtLS03r17d+jQwWAwXLhwAQAQHR2dlJTUq1cvAEBhYeHMmTPT09PDwsIWLlwYFRX1GedrUkgU BEEQBHH3cK/Nddgsto+3T3paenFRMYvNCgkNsY5JpXZ2djN/mvnk4ZPsnOzFCxaHhYY1adIEPiEQ yFfhk6W5pKRk7NixxPadO3e4XC5h4jZo0KChQ4f+a/SrV6+iKHr37t27d+8SIatXr54+fXpRUREA 4IcffpBIJLt37wYA+Pr6Hjhw4HNZC+gNeo1eg6CIWqt2dnGuzaUQFAkKDqqorKgor8jJygkMDCSR ScAqCAwI3Lx586RJkwqLCvfs3hPVKKoGVoYQCKT2fLKmzJ079/r169OmTfP29u7WrVufPn0CAwM/ PvpPP/30008/VQu8fPmyaXv27NmzZ8/+7PnUarSCMgEAQKPV1L6TS6FSPL08q4RVKpVKIpV8jEF3 faFN2zaNmzQuKCqIuxl37sK5wYMGW03WIJB6RA37pLt37160aNGiRYsiIyPt/suwYcNqcKmkpKRJ kyZ96Xzq9XqpVIoAxHx6S23gu/LtmfYIQOJfxMvlcqtpEAiCTPtpmrend0VlxaSJk67fvA4fEgik 7vlknfL19X3fEKSXl1cNUtCwYcO6yCgOcAMOAOA6cj/L9egMuk+AT+KrRJlEJhFJCMMV6yA6Mnrn rp3jvh9XVla2dfPWBkENPDw94KMCgdQlnyzNK1euXLlyZb3LJ4qiNCoNAPC53EQgAHHlu6Ylp2l1 2tzsXDd3N2L9FCsARdE2bdoMGTJk89bND+4+WL169dZtW6H/XAikTh9DG8kngiAkEgkHONPus3Vv GXaMwOBAgACBUJCXk4cbrWFyoIm58+YO/GagHtdfvHDx9JnTcDEUCKQusTlvCZ9xdjWKoUFBQQ4c B6PRmJKaolAqrKmgmEzmzJkz3fhuEplk9szZf1/+Gz4tEEidUStpFgqFAjMkEomtFR9GxgKDAhGA qFVqsVhsZblrGNZw+7btnh6eYol4x84dxPx4CARSB9Rcmm/cuOHr6+tqxnfffWf5Gf74hQE/Eo4D h8FkAADSU9JVapXll8An0blL5++++w4H+ONHj8ePHy+qEsFnBgKpA2poSfbmzZv+/fuz2Wxz753N mze32HxqtBojbkTBJ68+9a/Ys+wbNWr0+OFjqUSamJDYrHkzK/ti9sP4HyorK3fv3X3v/r3NWzYv XLgQTuCGQL40NZRmg8GgVCqvXLnytmNPy6QwrxBFUJ1W99nXmUUQxNnV2YXvIigRlBSW6KP1ZIpV KReLxVqwcMHL+JePnzz+888/wyPDBw0YZE0ZhEAskBoOaPB4vE6dOoWGhtaXfP5nnBQB4Av0aEkY yc3NDUEQo9GYl5v32TvmXx0mk7lg0QJPL09RpWjDhg1wWAMC+dLU3D0mmUzu3r37PjPi4uIsNp9a nRYAQKfRa+ZE/19xd3d34jnhAM/KypJJZdbXUNq0aTNj+gwDMKQmpsaOiS0rLYMPDwTy5ajhgEZZ WdnVq1cBAD/88IMpcODAgZ07d7bATBoMBjqdrtVomSzmF1o3mkqjhgSHCMuFCrmiuLCYxWZZWUNB EGTY8GGJKYnHjx6/d/feli1blq9YDgedIZAvRA2lmc/n//nnn9UCazZRuw4Qi8VqjRoAoNVqqRTq F7oLi81y4jqVV5RnZWd5enkyWdYzdZuAwWD8svKX3Lzce7funTh1omGjhkMGD4ELCUIgX4IaPlds Njs2NrZ169bl5eUeHh4uLi6xsbHt27e3zExKxBKVUgUA+KKL+dHotOim0WQyWaPWxMfHf/bvjZYA y561bNEyL2+vCmHFjKkz/jz8p1VmEwL56tS8y7NmzZqYmJg5c+ZcvHhx2bJlfn5+FuuATavV6vV6 AMAXGmg2Yc+yD/QPBABUCCuUSqVVtpio6KiD+w8GBwerNKrF8xcfOX4EPkUQyGenhtJcVFS0b9++ hg0btmrVCgAwdepUoVC4adMmC83lf60ynF2dv/StnHhOJDIJx/GcNzlGo9EKWwyKNm7aeNuWbSHB IRK5ZN+uffl5+fBBgkA+84NWs2hyuTwrK+vIkSNubm4AgBEjRnz//fevXr2yzExiRoxMIhsNRi+P Lz4a7ujk6O3tDQAoKioqKCiw1nbTvGXzyT9ORgGanJo85rsxJcUl8FmCQD4jNZRmFosVGho6cODA wsLCzMzM33//fdeuXRY7GzArNwsgQK1W14E3JxKJFBwazGAytFpt8utkYG0mzv9j6LChc3+ea0ez e/HixZo1azQaDXycIJDPRQ21ys3Nbdy4cYWFhU+fPr169erixYsDAgJ+/PFHy8yksEIIAEAQBAF1 MYWaTqcHBARgKKZWq0tKS6xvBgoBlUr9acZP7Tu2RwBy7sK5vfv2EsbjEAik9tR8NaaZM2d+8803 f//9NwDAyclpyJAhFptJrUZLp9HpTDqK1YWlF4IgHt4eOVk5Mrks8XUiy57FtLc2QzoCOzu7ufPm ZmVmZbzJ+GXlLz6+Pr179oYPFQRSe2q1UJ63t/fkyZMtP5M0Mg0BiLenN4VCqZs70mn04LDg+Kfx cqlcIpZYqzQDAKIbRZ85c6Zzp87CCuG6NetCg0L9A/zhcwWB1BKbmC9gRIwAAHt7ewzD6uymXAcu nU4HAKQkp4hFYisuXh9fn4mTJtIZ9NcJr+fNm5eSkgKfKwikltjGVK6vMdjLtGeGhoeiKCqVSt9k vLHuBZwm/Tipe4/uRmCMi4sb+93YgnyrNU2BQOoGm5BmHOA4wEHdelFGUdTXzzcoKAgHeGFhoUxm hT6PTDAYjGVLl/0w/gcanZaRlvHbmt+sb1UBCKQugQ4Qviw8Po9KpRqNxtSkVJ1OZ8U59fH2Wf3r 6h49e+AAP3f23Nq1a5Uq65wPCYHUATWXZpFIdPny5V69eu3evXvt2rX5+fmfZfLbxYsXe/Xq1atX r6lTp36Wmd9Go5FwafRVjNi4jtyAgAAAgLBcWJBr5a/5ZDJ53px5MS1jVCrVrp27zp8/Dz1sQCA1 o+bSvHr16t69e1+5ciU1NfXEiRM+Pj61V9JLly4NHjyYx+O1bdv25MmTgwcPrr3clxSXYCTMaDR+ lVdsDMP8A/3ZDmydXpeammrArXnEGQAQEhqy/8B+rgNXrpAvXrh4/4H98BmDQGpADaU5MzNz06ZN y5Yt69evHwDg+PHjISEhtZ9yIhaL16xZs2fPnnnz5p04ceLq1au17+qWlJQgAAE4MBq+jkcLKpUa HBRMwkg6ra4gt8AqHWuYw3fjL1281NnRWVgp3LVt14P7D+BjBoF8KjWUZqPRqNVqe/fuTThT9/Ly io6OVqlq2y2NjY396aefSCQSAEAoFHp6etY+h1K5FACAoAiFVkdGzW/Dd+cz2Uwcx1NSUiQSidW3 quGjhq/+bTWHxcnOz57448TU5FT4pEEgn0QNpdnV1bVbt24DBw58+fLlrVu3Ro0adezYsdGjR3+u ZP3zzz+///779evX37ZENhqNhv/ycTlEAQAUMsWR6wi+EmQyuUGDBhgJUyvVWZlZRtzKO85UKnXg oIGrflvFYrDy8/O3btuqUCjgwwaBfDw1nA3I4XAmTZq0b98+YqJ2WVnZlClTunbt+lnSdOzYsQ0b Nly5csXFxeXtoydOnHj8+DEAQKfT/esCSEajkU6l4wBHMITP53/Fgnbhufj6+WZmZhYXF7sWuHp4 eSAIAqwXEokUOyr2waMHJ4+ePHLsSGpa6sYNG6MbR8NHDgL5qCeoxjH79evXsWNHwu8ljUbz9/88 03O3bt36999/X758+Z26DAAYPnz48OHDAQByuXz+/PkfvppMJqsSVQEANGpN3TjQeG9Bk0ihDUJL ikvkCnlSUpKTixMxV9C6mT9vvlKqvHzlckJCwsZNGzdt3vQV310gkHpEDdWqpKRk6NChOI6HhYWF hYX5+/v/+eefGzZsqGVqDhw4MHPmTLVaPX369KFDhw4dOrSWH81UapXlrG9NoVJCQ0MxDFMoFClJ KVqN9RuW+fr4bt68uW+fvgiCXLp0affe3dCcDgL5GD6512wwGFavXi0UCk+ePOnr68tk/sdxz+XL l/l8/syZM2uTGmdn53nz5n3G7Bn0Bp1ORyKRGKwvu/TUR+Lu5V5RUZGXl1eQV8BhcwKCA6y+hTk6 OW7cuLG8vPzRo0dbN2/NycpZu2Ytl8uFzx4E8gE+WZpRFA0MDFy/fj0AYPXq1eaHVq5cWcvU9O7d u3fvz+lVEkMxEkoCAPj5+FlCcZPJ5IaRDVUaVXlpeXpmuo+fD4lMsoSEfVG4jtzZs2dPmTalrLjs zOkzAb4Bs+fOJuxwIBDIO/nkxwNBkG+//ZZKpc6cOXPt2rWmXjMAoFOnThaXP+Q/CwM6OTtZSIqo NCrflS8sE2pV2uSk5PCIcFsQqfbt2589fXbixImJrxN3/7Fbq9eOHz/e1dUVPoEQyDup4Vhzv379 srOzk5KSbphx9OhRS8sejuO45a0B5eXt5cJ3wXE8Nye3qrLKFtoZRsIahDVYvmK5q7trlbBq46aN fx760+pn30AgNaaG/TWJRDJ69OhLly6Zz9YbOHDgZzRt/oxYmjpTqJSw8DCpWKpQKhITE9u0bUOl Um2htbVv3/70ydMTJ0xMTEn8fe3vXh5e3wz6ps7WN4BA6hE17DWXlpZevHhx+PDhT82oNvQM+QBs Njs0PBRBEIlYkp6abq3rB1YDQZDwhuGbtmzy8fXRaDULFy7cunWrLViqQCCfSg17zQiCYBi2YcOG 91kfWwgogpIwSxzJRVHUw9OjIK+gvLw8JzvH19+XxWLZQoNDEKRp06bff//96jWrKysr165d6+fr 139Af+uegAOBfLJE1CxacHDwrFmzbty4YeHZKy0rxTBMo9VYoK9kMokcEhZCoVIMBsPjB4+JZb9t hBnTZrx4+sLZ1Vmj0syZO2fNmjVKBXTuDIH8jxpKc05Ozr59+yZMmBBsxtSpUy0te2UlZQAA3IBb 5oiBs5Nzw4YNKRSKXCZ/nfDaoLdyl6HmeHh4zJw+055rLywXbtmy5fCRw7V3jwWBWA01lGaDwUAm k5lMpsQMpdLiOj7Esk9kMtlihzV8fH18A3wRBJGJZGlpada9hGA1xn439uD+g048J7lc/uuqX//8 E9psQCD/oYaCFRgYWFZWZvnZMxqNCIowWAwq3UJNIFAUDQoMqqyorCivyMrM4vP5jk624mWCTqe3 b9d+2ZJly5YuK68o375tu52d3TfffMNgWMTUTQjkayrDp0aYPHnynDlz3rx54/oW33//vUXlzag3 2tHtAABcDteeaW+xdUClUcPCw2h0mk6vi38RXymstJ32h2HY8OHDf9/wu7OTc35B/rw583bv2W1T rw4QyDv5ZGmm0+l0Oh3DMPZb2NnZWVTeSgWlxMomOp3u67qd+1ccHR0bhDUgkUgSieTly5d6vd52 miCGYb179d60eZOnp6dCpdixfcfqNavLheXw4YTYMp88oPH7778TGxkZGdUOHT9+3KLyVllZqdVp EQQxGC29F4aiqK+fr1qlTktNE4vFmemZQSFBtuNlgkwm9+3Tl0KiTJ02tVxQvmH9hsqKysVLFjtw HOAjCrFNat6XfP78uZOTE9WMs2fPWlTeNBqN0WhEAGLPstzRDBMIgvgH+vN4PAQgaSlpKckpttYW u3XvduL4iZDQEJ1Ot3///pUrVmo0GviIQmyTGkpzXl5e37592Wy2wWBo1KhRUFCQVqtdsmSJReWN jJFRBAUAuLu714vKoFKpjRo3cuY5AwCK8osqKyttZJYgAYIgUY2jtm7Z2qRxE4PRcPrk6VkzZ+Xl 5sGnFGKD1FCa1Wp1WVnZ0qVL7e3t79+/f/fu3S5duty8edNyMmY0GvUGPYqiGp2G58qrL/XBZDKD goNQFFWr1S+evqiqsgnnR/9rjgjarHmzdb+vCwsNE8vEx44eW7p0aXZWtk39RUEgoDYDGgCA7t27 d+7cec6cOVwut0GDBg8eWNCy9jqdrrSkFAe4SqmyTKPm98Hn8yObRJIpZJlM9vTRU0GpwNYaZePG jU+eOdm6ZWudUXfhwoVvBn3z+NFj+KxCbIoaSjODwfD19U1OTg4PD//zzz/9/f0PHjwYHh5uORnT 6/UiiQgAgJDqn3MGH2+f6CbRVCpVoVTYmsEGgben9+Ztm0fGjiRRSLm5uWPGjnl4/yE0qoPYDjWU Zk9Pz7///vvs2bMLFy4cO3asWq0eM2bM4sWLLShnONBr9QAAR4f6N4MDRVF3D/fgkGAUReVy+Ytn LyqEFbbWNIMCg9b+tnbwt4MpVEpZWdmPk3/8+6+/oTpDbIQaSrNQKDx27NjatWtJJNLGjRuLi4s3 bdpkWcZeCMDIGADAx9enPlYMgiA+fj5ufDcAQFFhUXx8vA06z7S3t9+1YxfRd87Ly5s6berJkyeh OkNsgRpKc2Vl5apVqxQKhcVmDAEIBjAEICx2fXW2SaFQoppEBQcHIwCRS+XPnz9XqW3RAdDqVauv Xrnq4e0hFUunTZ82fsL4/Px8+OhCrBts2bJlNYmGYS9fvnz58qWfn5/wv2g0GjabXWdJ12q1N2/e 7Nmz5zuP6nS6tNQ0MonMd+c7ONTXmQskEsnR0VGukMukMrlcLpPJuFyurS0LQiKR3NzcGjVqlPA6 obysPC09raSkJCIygusAl+WG1ASdTldUVOTr52vJiaxhr1kgENy4cWPv3r3hZsyYMQPW+meHRCaF hIbYs+xxI15aXPo6/rVao7a1QkAQJKZVzN7deyMjI41648WLFxctXvQm6w1sHhCrffBrFo3D4Ywf P75aYHR0tEXlDQeWuGZrzUq7U+dOiQmJ2TnZJWUl6jvqxs0bczgcW2usYeFhR44cmTJlys3bN6/8 dSX+efymTZt69OgBV0iBWB81lGY2mz169OimTZuSyWQiJDc3V6u1oO9UBqOBTCLjOG7ErcEFMEbC /IP9lSpleXm5SCx69epVZKNIG3yj9/D0+H3975s3bb58+bKgTDD5x8ljxo4Z9/04d4/6MeETAvlI ajKgIZPJUlJSYmJiCgsLZf9l3bp1CxYssJyMFRUVkUgkg8Gg01rc0lM1g2XPatGqhYeXBwCgsrzy xfMXYqnYBptsQEDA5i2b129c7+rqWllVuXnz5slTJpeWlMKHGfKR4AC3/DetT+41GwyGwYMHX7t2 DQDg7+9vfmjgwIEfeRG9Xr9+/frY2Fg+n1/t0MaNG0297x49ekRERNQsYyWlJQAAHMdxo/XM8cUw LKJhhEFvKCkqkYqkD+89bNK4CY9fb6ahfy5QFB3Qf4Cbq9u8efNeJry8fef22LFjZ/w0o127dnQ6 HUoP5MOIRWLLN9z6ZAsNFEX79+9fWlqakJDQuXPnkJCQwP+ybdu2j7TQePHixdChQ7/99tu3HQ91 7dpVKBRWVFTk5+eHhYUFBAS87yIfttBITU7V6/QYinl6e9ZfC423IZFITk5Oer1epVCpVepyQbkd w45Gp2EYZmsPmJubW7/+/RJeJhQWFuYX5N+Ou81kMUNDQ23NggXyqaQmptLsaDyeRfdpajLWzGQy t27dOmjQoNDQUPNpJh/ZYRk9evSrV6/eeUgkEtFotDVr1nTo0KG2GUNJAAC6Hb0u7fnqBhqdFhkV 6ezi/Cr+lVqtjn8W7+HjERkZaTv+nQlQFOVyuZu3br546eKmjZsqqip+++W3zIzM6TOme7h72OB/ FeQjqRdLUNbQeI7JZGIY1rBhQ28zJkyY8DFxmzVrdvDgwXceWrJkSYcOHfLz8+fPn79z584a50qr 1ZIpZAAAmUrmOHCsr22hKOrh6RHdJNqOaafT6wpzC58/e26ba576+vpOnTJ11apVri6uVZKqP/b9 8c3Ab+4/uG/b4gP5Nyx+mLOG/azMzMz+/fs7OTkNGDDAFNi0adOPiTt58mS1+r2WuS9fvrSzs9Pr 9a9fv05OTt62bVu1AfsnT55kZ2cDAD7gZ10sEhNraatVagy12t6Tm7sbw47x+MljpVxZXFT8/Mnz 4NBgq/wr+jAYhg0bNqxzp84bft/wx4E/MjMzp0+dPm36tOHDh8OhZ8g7QIDlm9XWUJqNRqNGozl1 6lSrVq0+Y2p++umnKVOmBAcHAwAePXoUExOzZcuWam+mTk5OhBcFlUr1voERhUKhUqvIGJkY1rDa BoYgbC67efPmL1+8lEgkBYUFUpk0Ojqaw+XY2us8iqI8V96SZUtQMnrw4MHcvNxFixbdv39/6tSp jRo1goMbkPrXpGsWzdXVtWvXrtUsNGrP8+fP7969S2y/z3t6QEBATExMTExMixYt3ncdvU5v0BsA AEw207rrDwEI15HbrGWzkNAQBEHEYvHDBw9TUlO0OpvzhQQAYDAZCxcu3LVzV3hkuFKhPHvu7OjY 0Xv37pXL5PBRh9QvatipxHEcx/FOnTpNmjTJFOjv79+9e/dPvVReXt6NGzd++OEHAACKolOmTElI SAgLC1u5cmWHDh1qZn6IklCMhAEAvLy9bKEWWSxWWMMwJpOZnJSsUqnepL4RVYrCGoRxnbgoatFL iX92mExmv/79mrdsvnPHzuPHjucX5s9fMD/uRtzGjRs9vTzhAw8BAAAcWKFdMwHhQwMAMGXKFFPg wIEDP1KaURRt166dvb09AKCkpGTNmjWENA8ePFir1e7duzc1NbVHjx4bNmyombIopUoyRtZr9TY1 X87L28vOzi4lJUVUKaoQVDwSPwoKDgoMCrTB13lXnuvixYs7dug4e9bsN9lvrsddnzBpwqKFi6Kj o2k0mm3LEqR+UENpdnNzO378eLVADw+Pj4xOoVDu3LlDbDdt2rRTp06mQyNGjBgxYkQtc5VXmAcA 0Oq01uFD4yNBUMSZ5xzjEBP/Ml5QLNBqtOmp6WqF2j/In8liIsC2HE2QSKR27dsdPHzw0KFDf+z9 4/79+6NHjY4dG/vjpB+5XC50uwGxcGroFJRKpYaHh9NotAcPHohEIgqFEhsb6+VVk9GDN2/eNG/e 3NnZ+VMjfmDKyZNHT8hkMsBBcGgwlUq1rRrFMA8PD3dv9wphhVKpFIlEAoGAwWQQ7yi2houzS9s2 bRn2jFfxryqqKh4/fHzz9k0HB4egoCBbG+qBmCgsKKRQKRa+mjNS47WKf/311w0bNlRWVgIAyGSy i4tLWlpaXT7/crl8/vz5W7duffvQwf0HGQwGnU7v2LmjnZ2dbbY/mVyWmpxaVFiEG3ESmWTHsAsK CPLy8UIxm5MknU6Xl5u3ZvWac+fP6Q16Ozu7gQMHDh06tFnTZjQ6HN+wOR7df8RgMSIjIy05kTXs NRcWFk6bNq1Ro0ZbtmwZOXJkmzZt/vrrLxzH27dvX2dJ/0CvOTUpFSNhvj6+7p7uNvvqSqVQeS48 pj1TLBJrNVq1Wl0hrJDL5Awmg0ql2lSxYBjm6OjYunVrqVxaWFwolUgTExOvXbtWVVUVGhJqx7CD PWibgug1u7q6WnIiazjWrFAocnNznzx54uLiQoQkJycnJSVZSK4MwEAGZAqFYuOPHJlC9vH1YbFZ ZUVlb9680eq0+fn5VaKqiMgIvhvf1kqD68jdsH7D6NGj582d9/Tx04rKiu3btt+9d3fhwoU9ukOn z7aF5X96qZVyPXr0iNioqqpKS0uzqHK3ta9eH4DL5YY2DO3cvbOvry+KoHKp/Omjp8+ePBMIBDa4 BGpkROSlS5eSU5NHjxiNkbCkpKTYUbHjx43PSM+ATcVWwIHly0MNe83e3t4jR44cO3bsmjVrAAAK hSIpKenly5ew0i0TBEEYDEZEowhXN9fk18lKhbIgv0BQJnB2cvYL9HPgOpiWRLAFKBSKu7v7yl9X 8lx5p86eKigoOHfu3MvXL2NjY/v26evl5QVnD0K+OjUcayaTyR4eHhiGXbp0qbS0lEajrVu3rkuX LnXZpj8w1pz4OpFEIjk7OzvznAHEVNkYxmKxHF0cSWSSRCzR6XRSmbSkqESukDs5Odma4zo6nd6u fbuYmJicrJy8gjxRhejmrZv3H9znu/L9A/zh6LMVU5hfSKFRLNwpaM0tNL4677PQUKvVly9dNuCG kJCQiMiIepq7L41Wo01OSs7NzSWWGqDQKH4+fl4+XpbvYvxLcP3q9cOHDv9z9R+NXgMA6Nal26jY UV06d7Fj2Kh5j3Xz6P4jJotp4eJQk65BSUnJ2LFj8/Pzid2ioqKxY8cWFhZaSJaKC4txgONGXKVW wVb4PihUSkSjiHYd2vH5fAqFolFr0jPS7965m/AqgXDaZ1N07d51285t8xfODw4OxjDs+o3rP078 ccA3Ay6cv2BRK15CPheWPxntk6VZr9f36dPn8OHDf/31FxFy9erVI0eO9OnTR6lUWkKWhBXC/7wK 2KL74k+AWDClRUyLiKgIJoOJYZharc7KzHry6MnLly9FVSKb+kjIZrNnzZp1+tTpX1b94u7lrtFo Hj16NG36tJEjR546dcoG/64gX5dPHms+d+7cli1b5s6da1qkNTo6GsfxkydPhoSE1KUV9/vGmt9k vVHKlQiK8N34Fj6cZAmgKMrhcAKDAvl8PgpQsVisVqtFVaKCggKJWOLCc7GpMWgHB4dmTZuNGjHK 3cM9JyenuKQ4KyvrxrUb+YX57m7urq6u0MbOCigsKKRSqRY+G/CTe80XLlwAAPTv3988sF+/fqZD Xx0ymQwQQCaRnVycYCv8eDgOnMjoyEaNG7m4uGAoZtAbiouK7968m56SXiYos5qFyT8GNpv93Xff HT169PvR33u6e6o0qjMnzvTu2/uHH36Ii4tTKeFAWT3Hio3nBALBB3a/IjqdDhgAAhC9Ue/i7AIb 4SeBoqi/v7+np6dELCkuLs7PyZfJZCnJKRgJc3Ry9PbxduW7kslkW+g5IggSEhLy+8bf09PT9+/d f+XaFUGp4PTp0zfibrRv037E6BEtm7dksWzxkymkjh7GT40wdOhQAMB3331369YtIuT+/fuxsbEA gGHDhn31/MhksnJBOQBAp9FB69SaQaFQnF2cG0Y0bN6yOdeZiyCIXq8XlAmePXn28P7DvLw8vU5v I0VBIpHCw8M3bN5w9szZVq1aoSgqEUnOXzofOzx2eOzwa9eufWApNYhFY31rA/bo0SMmJubhw4fd unUjRiH1er1er2/evHmvXr2+en70Or1SqaTSqRQ6XPG+VmAY5urmyuPzxBJxfk5+ZWWlSCyqrKis qqxKS03z9vF25jo7ujjayP9fWHjYxb8uiqpEx48dP3z4cGZW5v1b9x/cfRAWFjZp/KQu3bvwXOBX jfpDfVgb8JM/A6Io2qdPn7Zt22ZmZvJ4PB6Px+fzt23bNnfuXA6HU5dJf+dnQIVSkZOVg5EwTw9P D08PAKllG0YQOo3uynd1d3fnOHBUKpVOq9OoNcJyYUlxSaWwEsMwKo1qC58KURRlMBjNmjdr2bKl sEpYKaxUKBQCgeDWzVu3b99WKpUeHh52dtBTUj2gXrg3srYpJ0Kh8MbVG2QKuU1MG1cPiy76+ohe ry8rLct6k1VZWWk0GhGAYCjG5rIDAwJd+a5kiq3M9tbr9fEv4uPj448fO56cmmw0GI3A2LBhw4jI iG8GfNOmTRtb8+1Xv7Bmp6CWwLt7zQpFTlYOiUTy8fNhMBmwFX5eUBRlsVk+vj6uPFcc4DKpDDfi KqWquKi4tLgUN+J2dnYksk30oD08PJo2axo7OrZhWEORRFRaVFpSWpKcmHz61On79+6XlZZRaVQX Zxcb9I5t+RTmF1Jplm48Z53SjJEwbx9vKM1fDrod3dXV1cfXh81h67V6tUatVquF5cLCgsKSshIy mUyhUmxklCM4JLhnz57t27eXiqSVVZUKlaK0uPTO/TuX/7r8KuEVw57Bc+HZ2lI7Fk5hfiGFbuk+ NGzLow3kM4JhGIPBYPgyPDw8SkpKsrOzJSKJSqVSqVRVwio2h+3o4Ojl68Vis6z+UyGLxWrTtk3z 5s1fvXqVlJx0YP+B7KzsiqqKixcv3rl9p2FkwybRTUaNGuXl7QU1GvKxz5eV9ZpVKlVeTh6KorDX XGegGMrmsH18fNgObKPRKJfLjUajSqWqqqoqKigSV4kZdgwq3frHXjES5uHhER0dPWLEiAbhDdz4 bmWlZQKhoLig+NHTR2dOn0lPTxeUC9w93JkMJmw2X5F6sTagtUlzTn5OlbBKo9V4envCGQF1CYIg 9vb27u7uAUEBDCZDb9CrVCqDwSCTyQoKCiqFlbgBByigUChWr9EkEik4OLhjx45Dhgzhu/JpNJpM JiuvKE9JSbkVd+vAwQPXrl7TaDU4jnMdubbmi9USKCwoJFPJFm6hYW3S/DrhtUal0eq0Pj4+bDYb tsI6BkEQDMMcuA7u7u58Pp9hx1Cr1WqNWi6Xl5aUlpaWSqQSCoWCoRhGwqxbo4nlC5o1a9anb5/O nTsDFKhUKq1aK5VKi4qKrl279s8//7xOfO3EdcIwDFrd1SXWvDagxSKWiBGAkDAS/DL+dSGTyY5O jo5Ojj7+Pvl5+bk5uQq5QqVUFeQW5Ofms+xZnl6efv5+trCgNYVCCQ8P37R+k1arffTg0Yv4F8dO H8tKzxKUC86dO3fh3AUvL6/WrVu78Fz69OnTpEkT2HjqAMtfoM7a7JrPnDqD4AiZTm7dpjXXgQub oIWA47hGpcnIyCguKjY5j0URlMlm+gf48934dnQbclpvNBrLBeUH/jhw6syprJwsDGAGYEAQBEMw DpczbMiwESNHhIaGwn70F+LRvUdMDjMiwqJd6VvigEZlZWXr1q27dev24emFbw9oGAyGvNw8g97A deQGBAZgKPShYSkgCEIik1x4Lm4ebjQqzWA04AZcr9dr1VqBQFBSXFIhqCBTyBQKxRZmfiMIwrRn topp1atXL8K9AQkjSaVSjVajUWqexT/758o/J06euH37Ns2OhgCEyWRChzCfkXqxAJXFDWjI5fJt 27a9evVKo9F8atyKigrcgAMA9Do9mWRD65DWF1AUZTKZIWEhQaFBoipRTk5OaVGp3qCXy+RymVwg EDg6OvoF+jm5OJEwktX3GTEM8/L28vL2atu2rVKpvHfv3pvMN1u3bpVKpMWlxcUlxcmJyRcvXvTx 8omMinTjuw3oPyCyUSSVSoUybQtYnDTz+fw2bdrULG5FRYVao0YQxGiEC5xYNCiKEiPReFO8uLi4 IK+gtLRUp9eVCcrKBGUYCePxecFBwQ5cBxt5qbezs+vevXv37t2nTpuampJ64cKFyqrK2zdvZ+dk 5xXkFRQUGIFx566dzo7Ovfv2DvALaNykceMmjWlU6x+p/yIg1uh57kuTnJyM47ivr28N4mo0GoPB QCKRoEVzvXlGEMTDw4PvytdoNcXFxYX5haIqkV6vLy4sFgqENCrNzc3N28ebyWLazsBrg7AGDcIa GAwGUZUovzD/yNEj6Wnpr+JfKVXKisqKPw/8iQOcxWKxWCxXV9eh3w718ffx9/P39vaGdngfj+V7 nrO4uvT29v6wY/6qqiqFQgEAeHspQhRFCXssPp8PG189AiNhdiS7wMBAT09PiUhSVlZWWFioUWtk WllGRkZRUZGrq6ufvx+dQbcRR/4AAAzDnJydnJydGkc3VigVL1+8lMlk5y+cf/r4qUKlqKqqIozw 4l/E4wD38/fz9fX1dPccOnSot483iUTicDhw5mG9pv79zT55/OR14msAQLWljnEcNwIjhmE6nQ66 A62n0Gg0Gp/G4/NCQkMKCgokVZKioiK5Qp6VnZWdnW3Ptue58HiuPBeei02NtzLsGG3atgEA9OzV EwBQLii/ePGiSCy6fvX6i5cvgBFkZ2dnZ2ejAD3w5wEUoCwOq0unLl7eXvZM+y7du0SEW7QpwlcB Gs/VBIFA4Orqmp6eHhwc/IHTqhnP6XS6q9euahVaiUwyeuxo+KnECjAajTKZLOtNVllpmVqpBgDg AEdR1IHj4O7j7sh1dOA42LIBu0ql0mq1hQWFB/44UCWuevnqZUFegR7XowDFAY4DnISQyHQyjUxr FNWoT78+HBbHxcWlSZMmDIZNj/jVC+M56xmcMhqNUpGURqFBa1CrAUVRNpsdFR0ll8vlMnluTm5V RZVGq6msqqyqqqJSqQwGw83Dzc3djcFk2GC90+l0Op3Obshev2m90WjMzc0VlgtLBCU7tu1QKBQ6 rS63IFer1KqA6s6dO3fv3DUCI5fN9fH3odPonu6eQ0YM4fP4AAAHBweeCw8jwd6MBWGJ0sxisXbs 2PGpVoc4jqs0KhqFxmDDb4BWBYqi//nqxXetrKisqKzIz8tXSBUajUaj0VRWVeZk5Ti7OLvwXdzc 3Gz2Uxix5K6/vz8AYGD/gQAAqVR67fo1qVgqrBAeO3osryAPw7EqSZX4pZjoU58+fdoADChAA4MD mzZtakezwyhYr569YlrFYJiVT6O3fKxnNqBGrTl14hSdTvcL8IuKjoINy4rBcVxQKigtLRWWCyVS Cfjv0CHdju7j6+PsaEOLFn4SYon45KmTGWkZGo3m8cPHWTlZCECMwEiUHg5wFKCmXS6XO/ibwUGh QQhAUBRt0rhJg7AG1vHP9+j+IyaLGREJBzTqDAQAAFhsFtRl6wZBEGJJWY1aU1hQWFxSLJfJNSqN SqlKTUklk8lcB66Pjw/LgcWyZ0FvKiY4bM6EHyYAAAwGg6BMIJaKERwRCASH/jxUUlYCAKiqrMrK ytIZdACAqqqq3Xt3AwBwgCMIwnPmcRw4GIrhAA8KCho+dDjLgUWIuIODg5+/H5VSnwxCoPFcXZc3 xHZAEIRGpwUGBwYEBUjEErFIXJBfUFFZodPpysvLy8vLKVSKK9/Vx8+Hy+FavaO7TwLDMDd3Nzd3 NwBAaIPQ9h3aE+ElxSXxL+K1eq0RN/514a8HDx8YDAYjMOr1eqFQWFZeRnSrU9NSL128ZARGYpfv yo+KimLYMQAAOMApVEqvnr1atWpl6mITrvXge8wnYW0DcwhALN8sBvKZKx1BOA4cjgPHx8+nUlhZ VlZWWloqEUt0Gl1BXkFBXgGdRvf08fTx9mFxoAvvD2HSawDA4EGDTeF5+XmnT53WqDQGYFDKlVev Xs3Jy/mPVyaAlJWVXfnnCrFLGIccO3bMfNeF5zKw/0AXnoupr4oAxNfXt1u3bkzm11lVwPJVAk4f glgVjs6Ojs6OgcGBGrWmML8wPz9fqVSq1KqsjKz8nHw6k+7t5c334MN1Rj4JH2+fOXPmENsGg2HO 3DkmFzeiKtGpE6cyszJNneiysrKU5BStTmvSbqFAuHP3TtMuMcDNoDHsHezJGBkAYMSNxNHWMa27 9+hOdMDNcXNzCwkN+WxjJjiw/P6bVRnP2cJazpCPgUKhUCiUBg0beHh7yGSygvyCCkGFVqvVVGkk Yklubq4D28HD08OJ50QmQzdYnwaGYU5OTqZdd3f38Ibh5ieUCcpSU1MNOgMAAAd4WmrakSNHNBqN ARgwgBHGIQqpolJcqSpVEbumLvapU6dOnjpp3uMmjrrwXUKDQ0kUEgAABShxKeKLpSvPddC3g3x9 /ufawfRVk9glYSSOA6femXJbj4VGdlb2q/hXBr2hYaOGDcIa1Piyx48fP3/+PIIg1VyS2tvbm3+e ptFodDrdvL1WW++KzWabW9ra2dm1aNHC0dERPttfBVGVqEJYUVxcXFlRieM4AhAEQZycnBydHflu fK4jdO1dp7x6+erRo0c6vc4UYtAbrl+//vTZU9yIG4GxWhfbtAsAMJfyasr+zl0WgxXTNiY0OJTY RQHq6+0b3SQaWmjUESVFJQAAHMcNRkNtrpOQkHD69OkvkcIbN2507ty5NlfYuXPnwoULSSSSvb39 B05jMpkf6Ay+/S8CANi7d6+Pj09t0pacnJyWlkZsU6lUO7v/ucYnZo6Yn8xi/b9ltul0Oo32Pydq /5rBGuDAdXDgOvgH+peXlxcWFoqqRDKJTCAUCISCjPQMOo3u6enp5edlb28PvxbWAVHRUVHRUdUC p06dqtPrAA5wgCMAIbq9OI5fu3rt1q1beoOeCDENE+MANxgMCS8TsnOyURw1AiNxlNBl065UIb32 z7V//vmH2MUB/tO0n6KaRFl4EVmPNMsVcgAARsJqOSBlMBi+UAprbxOqUqlEIhEAQCgUft60qVSq Wl7h6NGjq1ev/hLldu3ata5du9bmCqdOnVq7di2DwaBQKKZaxnEc4ECv15tqnM1hE24LmQwmhmHm 5wMAKBSK+Usx8V71zTff1PJNqKSkpLS01LT7qf9q1gSFSqFQKW+HDxo8aNDgQe+MYjQaCwsKy4Xl AAc4ggMAEBz5n7IjAMGRuLi4uBtxap0a/FfWP/sf/xeRC6upV6KzQ6PS2Jxardb65aS59k/Ul/ND XfuuoiX/pZWWlsbHx3+JtLVs2bKW0rxjx45Vq1bVOPoHXjgOHDjQtm3b2qTt2rVrf/zxB3jrPaza /8e/jua9/SfXsWPHz6KPKIp6+3h7+3h/4JymzZrOXzDfPOTR/UfA4rESadbpdTQaTS6TU6gUZ2fn 2lyqQ4cOer3e3K2dVqsl3JCaILquJuRyuU73v1EzjUZj7rDUaDRKJBKiQdcym1/uw4AlS3Pt/9L0 er21pk2lUlV74zG9UVVzzVgDMjIyvtDgXkJCQmRkZG2u8Ntvv/3+++81+yBUKawkkUlsDvvtD0JU KnXs2LEfdqz2r2RnZ798+ZLYrvbfaX7Han9p1f9lgVUgloglMgkCEJVGVUs3N3379u3bt69lZrNv 374fGBFWKBQfeBpN/xDvpJb/ZwAADofj5+cHABCLxeZ/IR9O1cdQe/mz5B49TFvNkMlkVVVVVVVV nz1tHTt2rKU0//PPP1OnTq1tEVmI6NQSpVypVCgpGMU6svM+goODa9lovhyLFy9evHjxv55W7RUE x3GxWFztkTPvSKrV6vDw8FqmrVOnTtXGwSUSifnokEqlUqvVpl29Xi8Wi7VarUatUSqVRqNRqVTi OA4QQCaR6XZ04r0KQRDzTlnNgG8bllZuFvKXZiXSbNAbDHoDjuHVvplALA3C4tg8hMv94oZrjRs3 bty4cc3iisXi4sJisUQsKBUQxj8IQEgYiefCc3J14rA5tUzbhg0bNmzYQGzXbKDMhFQqNReF0NDQ WqatWbNms2bNkslk1QrE/K3ow4k0GAxSqdQ8OvGnWHtzcqv/S7MSaUYxFEERAADfEy49BfmccDgc DodjMBj0On1JaUlBXkFFRYXeoC8uLS4uK04hpdgz7H18fFw9XGs/qcHBweEDu3VPu3bt2rVrZ5n1 MmrUqObNm5t2P+mDUHFRMQ5w8/oy/59zcXGpZdrs7e2JwT3zlzO9Xl/tT+7DWMmUk+Sk5NTUVKPO 2KVnF0cunNYB+VLotDqxWCysEJYUliiUCq1WS/jMZDAZ9mx7Ty9PJ64ThUqBrnwsmUf3HzFYjFp+ h6wlSqXSNNkdvEvEraTXXFhQiABEo9VA53OQLwqZQnZ2cXZ2cW7QoEFVZVVlZWVRYZGoUiSTyqRS aXFhMY1Cc3Z15jpyvby9aFQaLDHL5Ku7N7KzszM3QHz7DclKpLmqqopKoZJJZLj6FKTO4DpyuY5c /wD/ckF5aXFpRUWFVCrVaDXFBcXFhcXJiclcDtfb39vdzf2dMykgXw3o3qjOIL4JsOxZ0FsNpI5B UdSV7+rKd1UqlUqlsrCgsKqiSiFXaHXaisoKsViclZ7FcmD5ePsw7Zl2dnbERxEI5MNYiTQTPud4 fF7tjZkgkJpBvKI6OTkZDIaKioqqqqr83HyFXCGVSqVSaWF+IZPBdHR05Lnz+K58EpkEnXVAPoC1 TNTGAQ5wGp0GP79AvjoYhvF4PB6PFxwcXFJUIhQKy8rK5HK5TCGTK+T5BfkogrryXV1cXZxdnKG5 51cAqQcrIlmJNFv+Sl8QGwRFUQ8vD3dPd2LqSl5OnlgiloglBoOhuKS4pLSEQqXY29l7enm6e7rT 6DTYj4aKYQL6nodAvizEGoY0Oo3ryNXr9GVlZbnZuSKxSKfVadQarVpbJarKzc21Z9u7e7q7OLuQ SWS41CzESqQZrgcIqR/PG5nk4enh4emh0+mKCoqkEmlubq5er5dIJGKJuKigiEKmuPJdHZwc3Nzd 3l6HCWI7imEN0qzVaSk0CjAAg95gBdmB2AJkMtnX3xfH8dDwUJFIVJBbIJFKJGKJTqcrLCgsLCxM TU5FUZTvxufxeA5ch6+1vKl1Ao3n6oaikiIERwy4QaVRWUF2ILYDgiAUCoX4ZqhUKhUKRWFhYaWg UqlS6rQ6AEB+Tn5BbgEx1dDd092J6wS/ddsIX0Ga09PTd+zYAQDg8/nz58+vdnTOnP8t1jts2LCW LVv+6wVF5SKj0QhwgBvhx0BIfYWwvXN2djYajUKhUCqVKhXKnOwco94ok8lkMllJUQmVTHXmOTs4 Ofh4+VDpVFhoNQdaaLxN165dAwMD/f39N23aRKVSZ86caX50165drVu39vT0BB/tXEqhUhiNRhRF 7eztYJOD1HdQFCX60QCAkNCQ3JxckUhUVlqm1+s1Ok1RUVFRUVHS6yQOi+Pl7eXg5MDlcmE/+tNA oIXGW2zfvt3X1/fMmTMODg4DBgwYN27cd999Z1qqIDc3l8PhLFmy5GM6yyYoJAqCIBiG8V2h2zmI VUGlUkNCQ4xGo1wul0llWW+y9Hq9UqFUa9QiiUicKKZQKTQajUKleHt5cx25DCaj9u6GIZZAXddi aWkpjUYjfHl4eXmVlJSYd403bNjQtGnT+/fv79q1y8/Pj1g9+sMX1Ov1OI4jCIIb8dov1QGBWCAo irJYLBaL5e7hbjQaRZUisVhckFcgloh1Wp1Wo8UBLiwXUslUrjOX48Dx8fWxo9khGAItl+ovFvcH m5qa6u/v7+LikpmZOWzYsFOnTlWzw7929VpSchIAgBiSVqlUwnIhAhCFSgF9G0GsHhRFHZ0dHZ0d /QP9tRptfn6+XCIvKCjQ6XVanVZQIhCUCNJT0tlsNs+dx6AznF2cq62pCiHW2rbwNFqWNC9btmzx 4sWEK+tHjx7FxMQYjcZq42iNGzcOCg4CACgUit27d+u0OoVMQaaSKSTo3AtiW1ColMCgQNyIB4cF y6Xy7OxsnVYnlUjVGrVEIpFIJCiCUigUOpPu5e3FdeCy2WzC2wwEGs9Vh8Vi6XQ6pVJpZ2cnEomq rWh79uzZ0tLSefPm0Wi0aosUmHBydnJydgIAyOVyAIARN+oMOjIgO3C+8pIQEMhXAUERwrrDxdXF aDSKxWKxWEx4VtJqtBqNRq1RiypFFDKFw+FQKBQ3dzdHF0cqlQpHpS2Zuq6buXPnbtmyZcSIEQ0a NDh48OCiRYsEAsG2bduIFT99fHymTp2alpbm7++/e/fuAQMG/OsYBYqgZIwMAPDx84HVCbFxUBTl crlcLtfPz0+r1RYWFEokkrycPKPRqNVphUIhAKCouAjFUGcXZ54zj+/Gt2fb21wx1Qf3Rl9hcPbM mTM0Gi0nJ2fIkCFTpkxRKBSnTp0iDnXt2vWff/5BECQnJ2fChAnHjx//V4cvOMCNwIgDnMWGA2oQ yP+gUCj+Af5R0VF9+vfp1a9XRFSEh7eHo4sjgiIGg6GstCwpKelm3M2L5y8+vPcwLzuvrLjMfFlx 6wYaz72DFi1atGjRwrQbFBTUsWNH027Hjh3Nd62jlCGQrwWCIGQymUwmBwUFAQC0Wq1MKhMKhYWF hWqlmrDuKCktKSktIWEkJpPJZDO9vL3sGfZUGpVCoUBneF+Lrz/YVFlZOX36dFgTEEgdQKFQHJ0c HZ0cQ0JDKisrpWKpWqXOzclVqBQGg4H4eFhUUAQA4DpyORwO3Y7u6+NLt7O2FSqghca/4+PjU/tS RgACu84QyCfh6Ojo6OgIAAgND9VqtBnpGTqtrkJYIZVJAQDiSrG4UowDPDUplWXP8vLxotFpXC6X xWLVe2tp6N6oDjAajRQyBcdxHIfaDIHUEAqV0jCyIY7japVaq9MqFcrsrGyVUiWTyoy4USqTpiSl IAhCo9HIFDKbxXbzdrOj2dnZ2dHocNXwL0K9l+bCkkIURdVatVavhdUJgdQGBEHodnQ6oLPZbL4b X6VWVQmrVBpVQX6BXCI3Go0qlUqpUkokksLCQhRFORwOw57hwHZw93Ynk8kYhsFpX5+Lei/NZSVl OMCNuBEOaEAgnxc6je7u6Q4ACAgIAABIRJKSkhKlWllWWqZSqAxGQ2VVZUVVRT7If534mkwi83g8 B0cHe3t7J54ThWzBU8Dg2oB1gFqhBgBQKBQKBc4GhEC+IGwHNtuBjeO4Vqs1GozCCmFpUalYIpbJ ZAAHOr2uqLiosLgQwzAyhUwj09zd3R2cHOzodvYse0tbUgsaz31xEBQBBsC0Z9oxoUdQCOTLP3EI QqVSAQBeXl5eXl5KhVImk+E4XlleWVxcrNVrNRqNRqXRqDQSqQQHOJ1Gt2fbYxjGZDJ9fXwpVAqZ QoYTEf+V+l1AGo2GTqPLdXKGHYNlD6ecQCB1jR3Dzo5hBwBw5buGRYZptdqy0jK1Sl0uLBeWCfVG vUqtMs1kycrMQjHUydmJw+EwWUx3d3cq5essCACN574swnKhWqlGAKJSqeD3Bwjkq0OhULy8vQAA AUEBRqNRrVbn5eapFCqFTCESiQy4wWgwlpeVC8uECIIkvkxEEIRhx/D286bRaBwOh2nPrItJLtB4 7ksjlUm1Wi2GYSQMvh9BIBYEiqIoijKZzPCG4QAAjVqjUCiMuFFUKSosLDToDEqlUqfXAQDEErHk lQRBEDs7OyqNiiCIq5uri4sLiqFUKpVGo9nmjMT6rWg6nY7wGspms+HDAIFYLFQalUqjAgCcnJwC gwP1en15eblKpRJXiQsKCnADjgNcrpDLFXIAQGVFZQpIwQHOYXMcuA4oinIcOR4eHiQSyXZkun5L M5lMRlEUB7intyds/RBIfYFEIrm5uQEAgD9o3LQxAEAkERXlFekMOo1aU1pSajQYiUCRRIQABGSD +GfxJDLJ3cOd68DFUMzRybHmPvOg8dwXBUEQNoeNYqhKreJyubC5QyD1Fwe2g0OkAwDAYDAolUqj wVhUWCSsEOI4rlQo1Uo1DnCdTpeXm5efm0/MS8TIGIqifDe+i7MLhmIMBoNm97GjH9B47guCoijP mQcA0Ol1cA00CMQ6wDDM3t4eAMDm/GeUUiKWyGVyHOClJaVlZWU4jhsNRpVKhatwAIBULM0AGQAA FpvFYDJQFKWQKe7u7lxHLkAAhmH1dLnx+i3NLi4uCEDIJDJUZgjEWmFz2IRMe3h6ECFVVVXlpeVG 3CiVSkuKS3AjjgNcKpFKJVIAAAKQvJw8HOAohrrwXLhcLkAAmULm8/lMBpO4AjSe+4IgCOLk6AQA 4DhxoOUcBGI7ECu5AAAMBoNOpwM4kCvkOVk5BoMB4EAul8ulcsJQr6ykTFAiAAAABKSR0zAMAzjQ arVMNtPC81jPe81OLgAAXy/fevrOAoFAaoNpvIJGpzk5ORGBCqVCIVcYjUaJSJKfn0+Yf2g0Gq1W C+pDf5mgfltoYCQMAEChwrUYIBDIf2DYMRh2DACAq6trcGgwAADH8fLycolEguO4QWcoLCiEFhpf HLj6FAQC+TAIgvB4PB6PR+x6+Xg9f/bcwtMMh2ghEIhtgSKo5a+8YRXSDPvNEAjEuqjH0mwwGFJS UhQyRUVlBaxICARiTdRjadbr9bv27fp94+9QmiEQiJVRvwc0VHKVUq3k8/iwIiEQiDVRv6XZAAz2 DHtXN1dYkRAIxJqwOGlesmQJYebSokWL3Nzcf0k9goZHhPNceLAiIRCINWFZ0iwQCPbs2bNo0aLj x48bjcajR49+4GQcx7t167Z2zVq4YCsEArEyLGvKyS+//NK2bdupU6cCADZt2hQTEzN//vwPTMLm 8Xhu7m6wFiEQiJUBp5xAIBCIxVH/Jmrn5OSUl5cDAFQqlUAgePLkCaxFCATy8ajVaqlUauGJrH/S XFZWlpWVRZSvSCTKzMyETY1g375948aNg+VAkJaWVlVVFRMTA4sCAFBcXJyYmNijRw9YFAAAqUxa XFzcf0B/S06kZUlzp06dfvnll5ycHD8/v6tXr3br1u1tl3KtWrVq1aoVAEAulyclJcXGxsKmRnDn zh1YGiZu375dVFQ0atQoWBQAgJSUFDKZDJsHQXl5+fr16y08kZYlzf3791+zZk3r1q3pdLpMJjt0 6BD0kQ+BQGwQixvQOHv27PPnzwEAXC63TZs2HzgTRVF3N3dYhSY83DxgIZiwY9ix2CxYDgQ0Gs3Z 2RmWAwGJRLL8KcSI5TvHg0AgEFsDDhdAIBCIxQGlGQKBQCwOKM0QCARicXz9z4AHDx5Uq9UAgMGD Bzs6OlY7umfPHqPRCAAYOXIkk8lMS0u7e/eu+QmOjo6DBw9+55Vfvnz57NkzAEBwcHCHDh2IwJs3 b7558wYA0LJly8jISAusknv37qWmphLbbm5uffv2NT+q1+v37dtHbI8dO5ZKpSYmJj569Mj8HFdX 1/79+5uHGI3GPXv2ENujR4+m0+mmQ7m5uSiKent7W3IzvXnzJplMbtu27duH/vjjD51OBwAYOnQo h8N58+bNzZs3zU/gcDhDhw6tFuvAgQMajQYA8O2333K5XADA5cuXCwsL+Xx+v379LP+53b9/f6dO nd6utWPHjpkmUzRr1iw6OjouLo6YB2AiIiKCMD81IRAIzp8/DwCwt7cfMWKEeYNp0aJFo0aNLLYc lErloUOHiO0JEyZUs7UVi8UnTpwAAFAolO+++w4A8PDhw6SkJPNzAgMDO3XqZB4ikUiOHz8OACCR SKaJAoRMvV10XxD8q7J+/XpnZ+eYmBhfX99+/fpVO7ps2TIXF5eYmBhPT8/Ro0fjOL5nzx46nR5j BhH+NgKBwNXVtXHjxjExMVwu98WLFziOP378mMvlxsTEREVF8fn8qqoq3PIYP348USYxMTFTpkyp dnT27Nl8Pj8mJsbd3X3y5Mk4jm/YsIHJZJqXycSJE6vF+vnnn11dXYlY5kdzcnJCQkL++usvCywH EyKRqEuXLhMmTHj70OrVq4kW4u3t/e233+I4fvjwYSqVal4aQ4cOrRZr3bp1RCxfX98BAwbgOL51 61ZHR8eYmJgWLVqsXbvWkkuDqDUGg/HOWvPz8wsMDCQyfvDgQRzHhw0bRlS9ic2bN1eL1blz54CA gJiYGGdn5507d4rF4nHjxvF4vJiYmCZNmjx58sQyy0EoFH7zzTceHh4xMTE8Hu+HH34Qi8XmJwwe PNjHxycmJsbFxWXNmjU4jk+bNo2oaBPLly+vdtlhw4Z5e3sTsVatWqVQKH766SfikWzatOnly5fr JndfU5oLCwtDQ0OJFpaWltaoUaNr166ZjmZmZvr7+z948ADH8devX4eFhT148GDPnj3BwcHvvJpM JhsxYkRhYSGxu2TJkn79+kmlUhzHJ0yYMHz4cBzHBw0aNHXqVBzHxWJxr169fvnlF0trbXq9fsyY MePGjXvn0devXwcGBj579gzH8fj4+JCQkBcvXmzYsKFx48YfuGZycnJAQMDTp09xHH/58mVoaCix TZQ5giCWLM2nT5/u2rUrmUx+W5pzc3ODg4Nv3LiB43hKSkpERMStW7cOHz7s5eX1gQsWFBSEhIRc uXIFx/HU1NTIyMgbN27weDyiMdy/fx8AYDAYLLZAFixY8L5aU6vVAQEBR48erSY0kyZN+sAFL126 1Lhx4zdv3uA4fvz48YiIiLNnzzo4OBCKPG/evJ49e1pmUZw9e9bT0zMhIQHH8cePHyMIcvv2bdPR mzdvRkREpKSk4Dh+9erV4ODgvLy8adOmDRo06APXvHPnTsOGDZOTk4krBAUF/f3332w2m2gw//qs fUa+5lizRCJJS0tr2bIlACAkJMRoNJrPuhYKhdnZ2S1atCBewWQy2YfdN2s0mqNHj0okEmL3yZMn 4eHh9vb2xEsZ4WrjyZMnxAXZbHaDBg0s0P/G8+fPDx48OHny5NWrV69evdqUHYLS0tKioqKmTZsC AKKjo8vLywsLC//1mgKBoKCgoFmzZgCAqKioysrKgoICAMDw4cPHjBlDFJHFwmazv/3223eOWYlE ooyMDKJCGzRooNFoqr25vxOxWJyenk7ECg0NNRgMmZmZZWVl06dPX7169ZEjR3r27Pn2HFTLwdXV ddu2be+stXXr1rm7u7PZ7NWrV+/evfsjL5iamkqlUgMCAognJTExsUmTJlVVVTQabfXq1U+ePOnZ s6dlFsXAgQMLCgqIYckWLVpUq7WsrCytVtugQQMAQMuWLTMyMkQi0b9eMzs7W61Wh4WFEbEyMzNd XFzEYnFAQMDq1atv3rzZq1evusldvXRvZD7EdvnyZRRFc3NziSG2u3fv5uXlubnVb0+h69evJ5rR vXv39uzZ4+HxL3NJkpKSzMvkzp07vr6+HzjfYDDMnj07IiLiu+++W7JkiSUXRZcuXQAAt27d+vgo JSUl5qVx9uzZJk2a/GssrVb74MEDkUiUnp6ekJAQFRVlmQVCuMx9H2/evDl8+LBcLtdqtUlJSb// /jsA4PDhw5cvXyZOsLe3T05O/pgblZWVPXjwoKio6NKlSwMHDuTzLXeORlVV1eTJk5cvX0708z7M lStXzJtHVlYWmUz+mFs8ePAgNze3oqJi7NixPj4+XzpT9U+aeTzezp07Tbuenp6bN2/ev38/8bVw 1apVZDK52qezekRISMjly5e7d+9OzFD38/O7efPm6NGjPxzLy8tr8+bNpt2KioopU6YQZbV///63 z//111+5XO6WLVuI0fby8nKRSOTg4FBPC60aXC7XvIXQaDSip0Oj0c6ePfuBWH///bdIJBo6dOjm zZsPHjxY7zI+dOjQzp07Ey8E2dnZAQEB8+fPBwC0bdt28uTJ/3ngSaSLFy8Sn/hat25NnPBOunXr 1q1bN+K95MGDB+/72P7VkUgkkyZNCgwMXLhw4ce87kRFRS1YsMC0e//+fcKfRsOGDVevXv2+WM2b N//7779zc3M7dux4+fJlU3l+OeqfNDMYjGpvWEuWLFmyZEllZaWTk9P169eJl5Fu3brVR1mRSqX3 79//1MSz2WzzMikqKiLmuLPZ7Heen5iYCACIiIggdr///vv09PS1a9fWxxJ7GxqNZl4aVVVVRGl8 oHO0ZMmSkSNHBgUFOTg4eHh4GAyG+pjxgoKCrKwsQprN8fb2Ni+Q58+fEwUSEhLyzutkZ2fv3r17 1apVAIDg4GAqlWqxWZbJZP369RswYMD06dM/MgqfzzcvjZSUFKI0vLy83nm+QCCYP3/+4sWL7ezs fH1962wA8GtKc2ho6NSpU/v16zdp0qTbt2+TSKTx48efOnWqdevWbm5uzZs3j42N7dGjx+jRoy9f vuzn5zdkyJCDBw9KpVLzhakcHBzeORa2ffv28PBwZ2dnJyenH3/88dy5c0TgyJEjcRwvKyvbsmUL YUVnUWi12jNnzrx48WLMmDH//POPWq329fU9evRo165dnZ2dO3Xq1LNnz759+w4ZMuTcuXMtW7bs 1avXtm3bqqqqzMvE2dn5559/Nu22bdu2f//+vXv3HjZs2IULF6KjowmLIgJPT899+/bVo/eMs2fP NmvWzNPTMyIiYsKECX369Bk3btz169e5XO7o0aNPnTqlVCrNS4PFYpmXRoMGDSZPntyvX78JEybc vHmTRqONGzeuR48e+/btW7duXXZ29pEjR8xfQSycioqKa9euDRs2DEVRqVQ6b968pKSkFi1arF+/ PjIy0s7ODgCQmZlpXiAhISHmBTJjxoyDBw/++OOPMTExGzdunD9/vrOz8/HjxxMSEoYPH37x4kUS ifQ+2fq65OfnDxkyxMHBgcvlEhls2bLl48ePBwwYYGdnN2bMmP37948ZM6ZLly579uyZOHFiw4YN AQAFBQXmpeHr62teGiNHjty/f39sbGy3bt3++OOPcePGNWzYcO7cuQ8ePJg4ceKtW7fKysqCgoLq Intf9xtrbm5uy5YtIyIiIiIi/v77bxzHiTd64uibN28aNWpEHL179y6O42fOnIn4/5i+t+p0ugcP HigUCmJXo9EsWrSIOGfChAkSiQTHcZFI9P333xOBS5cu1Wq1FvjdOSsrKyoqikjk7du3DQaDh4fH /fv3iaNJSUmmvBMWgYcOHapWJrGxsdWumZqaajpKmGeYaNWqFVG2lszPP/+8cuVKYjsqKurs2bPE dnZ2dtOmTYl8Xb9+Hcfxv/76q1pp9OnTp9rVcnJyWrRoQRwlvrwLhcKhQ4cSIZZvPGdea4mJiY6O jmq1mggnTCwiIiI6depUUFBAmFhUK5C3M3j69GniUIcOHYhYaWlppvMt1nju6tWr1bJ24cIFHo9H ZAHH8WvXrhHhzZs3z8nJwXF89erV1aLMnz+/2mXj4uKIQ02aNMnKyiIajEmm6sx4zuLcG50+fZrJ ZEKf3+b88ccfwcHBrVu3hkUBAPjrr790Ot3AgQNhURBMmjRp06ZNljzsUJcsXbp03Lhxnp6e9T0j FjdRW6PRQF02B8dxGo0GddmERCKBumwiLy9vxIgRUJcJKisrW7RoYQW6DKBTUAgEArFAoHsjCAQC sTigNEMgEIjFAaUZAoFALA4ozRAIBGJxQGmGQCAQiwNKMwQCgVgcUJohEAjE4oDSDIFAIBYHlGYI BAKxOOqfU1BI/eXBgwdarda06+zsTDgDM/H9998XFxcfPnzY2dmZCMnJycnLywMAuLu7BwcH11lS X758KRaLW7VqRaPRYMVBvgKW72QLYjXweDzztufu7n7r1i3T0efPn7du3ZpYlo2grKwsNDSUQqG4 uLjMnj37SydPoVCYljTt37+/i4tLUVERrDXIVwH60IDUHa6uriKRyLSyxpo1axgMRkVFxfvOz8nJ 8ff379Kly/Xr17902mQy2YABAzQaDbFyKwTylYH/TpA6g8fjMZlM026nTp1QFF22bBmO4y9fvpw/ fz6Px+PxeLt27crLyztx4oSTkxMAgEKheHp64jh+69atESNGEOcMHTo0Li4Ox/FLly7xeLxRo0ZF RETweLzjx4/zeLyxY8eGhoYSZ65duzY2NpbH43l6er569Yq49cqVK3n/Zdq0aXq9nlhgiUwm83g8 g8EwYMAAHo9XVFRkMBjOnj3bokUL4uRFixYRSzgvXLiQx+MtX758woQJxKHHjx/DKoZ8LqA0Q+qO atJMLD0ze/ZslUo1bNgwe3v7rVu3zpo1i0wm//rrryUlJYcPHwYANG7c+NatW2KxODIy0tnZ+cKF C3/99Zezs3ODBg1EItGpU6cAAMQ6F3FxcYcOHQIAODo6njx58tq1a4Syz5kzJy4url27dh4eHhkZ GWfOnBk2bFhcXNzp06fnzZsHAFi+fHlcXBwAIDw8nFD89u3bAwAKCgqI1cebNm0aFxe3adMmJpMZ GxurVqunTZsGAAgJCYmLi9u7dy+bzXZ1dY2Pj4e1DPksQGmG1B3vk+anT58CAIKDg2fMmDFjxgxi SUOj0ZidnQ0A6NKlC47ju3btAgCYVujYtGkTAGDz5s2ENM+bN48IJ9R86dKlOI7r9XoAQFBQEHHo 22+/BQAQS8MkJibOmDGjbdu2xLvjkCFDSkpKAACtW7cmTjZJ84gRIwAAph4x4Sr61atXhDQTS/Pg OD5+/HgAACHrEEjtgcZzEEtBp9PJZDKZTDZo0KDvv//+Y1ZHrhlPnz4lvjdOnDjx4cOHsOQhFsj/ Adsof2/TyoT5AAAAAElFTkSuQmCC "
       id="image858"
       x="41.841965"
       y="105.80074" />
    <g
       transform="rotate(-90,33.511733,133.9701)"
       id="g870">
      <rect
         style="color:#000000;clip-rule:nonzero;display:inline;overflow:visible;visibility:visible;opacity:1;isolation:auto;mix-blend-mode:normal;color-interpolation:sRGB;color-interpolation-filters:linearRGB;solid-color:#000000;solid-opacity:1;fill:#ffffff;fill-opacity:1;fill-rule:evenodd;stroke:none;stroke-width:0.5;stroke-linecap:butt;stroke-linejoin:miter;stroke-miterlimit:4;stroke-dasharray:none;stroke-dashoffset:0;stroke-opacity:1;color-rendering:auto;image-rendering:auto;shape-rendering:auto;text-rendering:auto;enable-background:accumulate"
         id="rect865"
         width="34.307419"
         height="6.6861095"
         x="1.8349154"
         y="145.04054" />
      <text
         xml:space="preserve"
         style="font-style:normal;font-variant:normal;font-weight:normal;font-stretch:normal;font-size:5.64444447px;line-height:125%;font-family:'Liberation Sans';-inkscape-font-specification:'Liberation Sans, Normal';text-align:start;letter-spacing:0px;word-spacing:0px;writing-mode:lr-tb;text-anchor:start;fill:#000000;fill-opacity:1;stroke:none;stroke-width:0.26458332px;stroke-linecap:butt;stroke-linejoin:miter;stroke-opacity:1"
         x="2.8213902"
         y="149.75369"
         id="text863"><tspan
           sodipodi:role="line"
           id="tspan861"
           x="2.8213902"
           y="149.75369"
           style="stroke-width:0.26458332px">Stress (MPa)</tspan></text>
    </g>
    <g
       transform="translate(92.728673,42.308827)"
       id="g881">
      <rect
         style="color:#000000;clip-rule:nonzero;display:inline;overflow:visible;visibility:visible;opacity:1;isolation:auto;mix-blend-mode:normal;color-interpolation:sRGB;color-interpolation-filters:linearRGB;solid-color:#000000;solid-opacity:1;fill:#ffffff;fill-opacity:1;fill-rule:evenodd;stroke:none;stroke-width:0.5;stroke-linecap:butt;stroke-linejoin:miter;stroke-miterlimit:4;stroke-dasharray:none;stroke-dashoffset:0;stroke-opacity:1;color-rendering:auto;image-rendering:auto;shape-rendering:auto;text-rendering:auto;enable-background:accumulate"
         id="rect876"
         width="28.827"
         height="7.7821937"
         x="0.95804709"
         y="146.79427" />
      <text
         xml:space="preserve"
         style="font-style:normal;font-variant:normal;font-weight:normal;font-stretch:normal;font-size:5.64444447px;line-height:125%;font-family:'Liberation Sans';-inkscape-font-specification:'Liberation Sans, Normal';text-align:start;letter-spacing:0px;word-spacing:0px;writing-mode:lr-tb;text-anchor:start;fill:#000000;fill-opacity:1;stroke:none;stroke-width:0.26458332px;stroke-linecap:butt;stroke-linejoin:miter;stroke-opacity:1"
         x="3.2598243"
         y="152.27469"
         id="text874"><tspan
           sodipodi:role="line"
           id="tspan872"
           x="3.2598243"
           y="152.27469"
           style="stroke-width:0.26458332px">Strain</tspan></text>
    </g>
    <g
       transform="translate(104.56638,-23.017756)"
       id="g898">
      <rect
         style="color:#000000;clip-rule:nonzero;display:inline;overflow:visible;visibility:visible;opacity:1;isolation:auto;mix-blend-mode:normal;color-interpolation:sRGB;color-interpolation-filters:linearRGB;solid-color:#000000;solid-opacity:1;fill:#ffffff;fill-opacity:1;fill-rule:evenodd;stroke:none;stroke-width:0.5;stroke-linecap:butt;stroke-linejoin:miter;stroke-miterlimit:4;stroke-dasharray:none;stroke-dashoffset:0;stroke-opacity:1;color-rendering:auto;image-rendering:auto;shape-rendering:auto;text-rendering:auto;enable-background:accumulate"
         id="rect893"
         width="40.993523"
         height="5.8092427"
         x="-0.35725132"
         y="149.8633" />
      <text
         xml:space="preserve"
         style="font-style:normal;font-variant:normal;font-weight:normal;font-stretch:normal;font-size:5.64444447px;line-height:125%;font-family:'Liberation Sans';-inkscape-font-specification:'Liberation Sans, Normal';text-align:start;letter-spacing:0px;word-spacing:0px;writing-mode:lr-tb;text-anchor:start;fill:#000000;fill-opacity:1;stroke:none;stroke-width:0.26458332px;stroke-linecap:butt;stroke-linejoin:miter;stroke-opacity:1"
         x="0.51961297"
         y="154.13803"
         id="text885"><tspan
           sodipodi:role="line"
           id="tspan883"
           x="0.51961297"
           y="154.13803"
           style="stroke-width:0.26458332px">Mazars original</tspan></text>
    </g>
    <g
       transform="translate(104.12794,-41.980002)"
       id="g903">
      <rect
         style="color:#000000;clip-rule:nonzero;display:inline;overflow:visible;visibility:visible;opacity:1;isolation:auto;mix-blend-mode:normal;color-interpolation:sRGB;color-interpolation-filters:linearRGB;solid-color:#000000;solid-opacity:1;fill:#ffffff;fill-opacity:1;fill-rule:evenodd;stroke:none;stroke-width:0.5;stroke-linecap:butt;stroke-linejoin:miter;stroke-miterlimit:4;stroke-dasharray:none;stroke-dashoffset:0;stroke-opacity:1;color-rendering:auto;image-rendering:auto;shape-rendering:auto;text-rendering:auto;enable-background:accumulate"
         id="rect891"
         width="40.00705"
         height="7.1245432"
         x="0.41000643"
         y="159.39923" />
      <text
         xml:space="preserve"
         style="font-style:normal;font-variant:normal;font-weight:normal;font-stretch:normal;font-size:5.64444447px;line-height:125%;font-family:'Liberation Sans';-inkscape-font-specification:'Liberation Sans, Normal';text-align:start;letter-spacing:0px;word-spacing:0px;writing-mode:lr-tb;text-anchor:start;fill:#000000;fill-opacity:1;stroke:none;stroke-width:0.26458332px;stroke-linecap:butt;stroke-linejoin:miter;stroke-opacity:1"
         x="0.73883003"
         y="163.89317"
         id="text889"><tspan
           sodipodi:role="line"
           id="tspan887"
           x="0.73883003"
           y="163.89317"
           style="stroke-width:0.26458332px">Mazars revised</tspan></text>
    </g>
    <text
       id="text907"
       y="170.57927"
       x="170.63179"
       style="font-style:normal;font-variant:normal;font-weight:normal;font-stretch:normal;font-size:5.64444447px;line-height:125%;font-family:'Liberation Sans';-inkscape-font-specification:'Liberation Sans, Normal';text-align:start;letter-spacing:0px;word-spacing:0px;writing-mode:lr-tb;text-anchor:start;fill:#000000;fill-opacity:1;stroke:none;stroke-width:0.26458332px;stroke-linecap:butt;stroke-linejoin:miter;stroke-opacity:1"
       xml:space="preserve"><tspan
         style="stroke-width:0.26458332px"
         y="170.57927"
         x="170.63179"
         id="tspan905"
         sodipodi:role="line">Asymptote for</tspan><tspan
         id="tspan909"
         style="stroke-width:0.26458332px"
         y="177.63483"
         x="170.63179"
         sodipodi:role="line" /></text>
    <g
       id="g945"
       transform="translate(135.0375,137.22967)">
      <g
         word-spacing="normal"
         letter-spacing="normal"
         font-size-adjust="none"
         font-stretch="normal"
         font-weight="normal"
         font-variant="normal"
         font-style="normal"
         stroke-miterlimit="10.433"
         xml:space="preserve"
         transform="matrix(0.13012077,0,0,-0.13012077,-22.771135,94.853122)"
         id="content"
         style="font-style:normal;font-variant:normal;font-weight:normal;font-stretch:normal;letter-spacing:normal;word-spacing:normal;text-anchor:start;fill:none;fill-opacity:1;fill-rule:evenodd;stroke:#000000;stroke-linecap:butt;stroke-linejoin:miter;stroke-miterlimit:10.43299961;stroke-dasharray:none;stroke-dashoffset:0;stroke-opacity:1"><path
           id="path934"
           d="m 469.82,440.23 v 0 0.01 0 0.01 l -0.01,0.02 v 0.01 0.02 0.02 0.02 l -0.01,0.02 v 0.02 l -0.01,0.02 -0.01,0.02 -0.01,0.03 -0.01,0.02 -0.01,0.03 -0.01,0.02 -0.02,0.03 -0.02,0.02 -0.02,0.02 -0.02,0.03 -0.01,0.01 -0.01,0.01 -0.02,0.01 -0.01,0.01 -0.02,0.01 -0.01,0.01 -0.02,0.01 -0.01,0.01 -0.02,0.01 -0.02,0.01 h -0.02 l -0.02,0.01 -0.02,0.01 h -0.02 l -0.02,0.01 -0.02,0.01 h -0.03 -0.02 l -0.03,0.01 h -0.02 -0.03 l -0.03,0.01 h -0.02 -0.03 c -1.16,0 -4.79,-0.41 -6.08,-0.5 -0.41,-0.05 -0.96,-0.1 -0.96,-1 0,-0.6 0.46,-0.6 1.21,-0.6 2.39,0 2.48,-0.34 2.48,-0.84 l -0.15,-1 -7.22,-28.7 c -0.21,-0.69 -0.21,-0.8 -0.21,-1.1 0,-1.14 1,-1.39 1.46,-1.39 0.64,0 1.39,0.46 1.68,1.05 0.25,0.45 2.5,9.66 2.8,10.91 1.69,-0.15 5.78,-0.94 5.78,-4.24 0,-0.34 0,-0.55 -0.15,-1.05 -0.1,-0.59 -0.21,-1.18 -0.21,-1.73 0,-2.95 2,-4.94 4.6,-4.94 1.48,0 2.83,0.8 3.93,2.64 1.24,2.19 1.79,4.94 1.79,5.03 0,0.5 -0.44,0.5 -0.6,0.5 -0.5,0 -0.54,-0.2 -0.7,-0.9 -0.99,-3.63 -2.14,-6.17 -4.33,-6.17 -0.94,0 -1.59,0.54 -1.59,2.34 0,0.84 0.2,1.98 0.4,2.78 0.19,0.86 0.19,1.05 0.19,1.55 0,3.25 -3.14,4.69 -7.37,5.23 1.54,0.91 3.14,2.5 4.29,3.69 2.39,2.64 4.67,4.78 7.13,4.78 0.29,0 0.34,0 0.44,-0.05 0.6,-0.09 0.65,-0.09 1.04,-0.39 0.11,-0.06 0.11,-0.11 0.21,-0.2 -2.4,-0.16 -2.85,-2.09 -2.85,-2.69 0,-0.79 0.55,-1.75 1.89,-1.75 1.3,0 2.75,1.1 2.75,3.03 0,1.5 -1.15,3.14 -3.39,3.14 -1.39,0 -3.69,-0.39 -7.28,-4.37 -1.69,-1.89 -3.62,-3.89 -5.52,-4.64 z"
           inkscape:connector-curvature="0"
           style="fill:#000000;stroke-width:0" /><path
           id="path936"
           d="m 528.31,439.93 0.02,0.04 0.01,0.03 0.02,0.03 0.02,0.03 0.01,0.02 0.02,0.03 0.01,0.03 0.02,0.03 0.01,0.02 0.01,0.03 0.02,0.02 0.01,0.02 0.01,0.03 0.01,0.02 0.01,0.02 0.01,0.02 0.02,0.04 0.02,0.04 0.02,0.03 0.01,0.04 0.02,0.03 0.01,0.02 0.01,0.03 0.01,0.03 0.01,0.02 0.01,0.02 v 0.02 l 0.01,0.02 v 0.02 l 0.01,0.02 v 0.02 0.01 0.02 l 0.01,0.01 v 0.03 0.02 0.03 c 0,0.36 -0.3,1 -0.98,1 -0.62,0 -0.75,-0.3 -1.12,-1 l -22.35,-43.48 c -0.41,-0.71 -0.41,-0.8 -0.41,-0.96 0,-0.39 0.36,-1 1,-1 0.59,0 0.75,0.3 1.09,1 z"
           inkscape:connector-curvature="0"
           style="fill:#000000;stroke-width:0" /><path
           id="path938"
           d="m 531.15,422.5 h 0.14 0.15 0.14 l 0.07,0.01 h 0.08 l 0.07,0.01 0.07,0.01 0.07,0.01 0.07,0.01 0.07,0.01 0.06,0.02 0.07,0.02 0.06,0.02 0.06,0.02 0.06,0.03 0.06,0.03 0.05,0.04 0.05,0.03 0.05,0.05 0.04,0.04 0.04,0.05 0.02,0.03 0.02,0.03 0.01,0.02 0.02,0.03 0.01,0.03 0.01,0.04 0.02,0.03 0.01,0.04 0.01,0.03 0.01,0.04 v 0.04 l 0.01,0.04 v 0.04 l 0.01,0.04 v 0.04 0.05 c 0,1 -0.95,1 -1.64,1 h -29.84 c -0.71,0 -1.65,0 -1.65,-1 0,-0.98 0.94,-0.98 1.69,-0.98 z"
           inkscape:connector-curvature="0"
           style="fill:#000000;stroke-width:0" /><path
           id="path940"
           d="m 531.2,412.82 h 0.06 0.07 l 0.14,0.01 h 0.14 0.07 l 0.07,0.01 0.07,0.01 h 0.06 l 0.07,0.01 0.07,0.02 0.07,0.01 0.06,0.02 0.07,0.02 0.06,0.02 0.06,0.02 0.05,0.03 0.06,0.03 0.05,0.04 0.05,0.04 0.05,0.04 0.04,0.05 0.02,0.02 0.02,0.03 0.02,0.02 0.02,0.03 0.01,0.03 0.02,0.03 0.01,0.03 0.01,0.03 0.02,0.04 0.01,0.03 0.01,0.04 0.01,0.04 v 0.04 l 0.01,0.04 v 0.04 l 0.01,0.04 v 0.05 0.04 c 0,1 -0.95,1 -1.69,1 H 501.4 c -0.75,0 -1.69,0 -1.69,-1 0,-1 0.94,-1 1.65,-1 z"
           inkscape:connector-curvature="0"
           style="fill:#000000;stroke-width:0" /><path
           id="path942"
           d="m 564.12,438.09 v 0.05 0.06 0.05 0.05 0.05 0.05 0.04 l -0.01,0.05 v 0.04 0.04 0.04 0.04 0.04 0.03 l -0.01,0.04 v 0.03 l -0.01,0.07 -0.01,0.06 -0.01,0.05 -0.01,0.05 -0.02,0.05 -0.02,0.04 -0.02,0.04 -0.03,0.03 -0.02,0.03 -0.04,0.03 -0.03,0.03 -0.04,0.02 -0.05,0.02 -0.02,0.01 -0.02,0.01 h -0.03 l -0.03,0.01 -0.02,0.01 h -0.03 l -0.03,0.01 h -0.04 l -0.03,0.01 h -0.03 -0.04 l -0.04,0.01 h -0.04 -0.04 -0.04 -0.04 -0.05 l -0.04,0.01 h -0.05 -0.05 -0.05 -0.05 c -3.1,-3.19 -7.47,-3.19 -9.07,-3.19 v -1.55 c 1,0 3.94,0 6.52,1.3 v -25.81 c 0,-1.8 -0.14,-2.39 -4.63,-2.39 h -1.59 v -1.55 c 1.75,0.16 6.08,0.16 8.06,0.16 2,0 6.33,0 8.08,-0.16 v 1.55 h -1.59 c -4.49,0 -4.64,0.54 -4.64,2.39 z"
           inkscape:connector-curvature="0"
           style="fill:#000000;stroke-width:0" /></g>    </g>
  </g>
</svg>
