{
    "string": [
        {
            "above": [
                {
                    "thick": "climate",
                    "surrounded": "dirty",
                    "characteristic": [
                        "mile",
                        [
                            {
                                "laugh": "essential",
                                "stairs": "already",
                                "giant": [
                                    "settlers",
                                    "regular",
                                    "threw"
                                ],
                                "doll": "worth",
                                "neck": "plane",
                                "bar": "model",
                                "effort": "stream",
                                "result": "sleep",
                                "feet": "brush",
                                "browserling": "lunch"
                            },
                            "parallel",
                            "evening",
                            "examine",
                            "history",
                            "damage",
                            "writing",
                            "neighborhood",
                            "coast",
                            "funny"
                        ],
                        "land",
                        "office",
                        "ever",
                        "yellow",
                        "telephone",
                        "say",
                        "total",
                        "coat",
                        "through"
                    ],
                    "broad": "sharp",
                    "wolf": "larger",
                    "back": "lion",
                    "wide": "opinion",
                    "pressure": "college",
                    "with": "lovely",
                    "properly": "mile"
                },
                "five",
                "family",
                "look",
                "parts",
                "boat",
                "lunch",
                "grass",
                "ants",
                "race"
            ],
            "shadow": "love",
            "answer": "rays",
            "hidden": "offer",
            "spent": "back",
            "fear": "route",
            "case": "not",
            "business": "remarkable",
            "safe": "clock",
            "ran": "completely"
        },
        "cloth",
        "dance",
        "trip",
        "lamp",
        "hardly",
        "imagine",
        "signal",
        "accident",
        "flag"
    ],
    "number":  [
        {
            "rhythm": -82159559.08283234,
            "drop": [
                [
                    2106866342,
                    -1152265177.4101098,
                    [
                        1187993326.7407925,
                        -1611444105,
                        1662157928,
                        -2015164650.4576101,
                        741109479,
                        -121828614.55038524,
                        -816240152,
                        93800754.24774766,
                        2014396654.3335288,
                        1121944430.686738,
                        [
                            -2015164650.4576101,
                            741109479,
                            {
                                "gradually": -1554688562.874263,
                                "guard": [
                                    -1676079357,
                                    1388972599.8586895,
                                    -1162376926.0188015
                                ],
                                "engineer": -367366252
                            },
                            -121828614.55038524,
                            -816240152
                        ]
                    ],
                    827568972,
                    -1412179893,
                    -1119449892.4457207,
                    1388972599.8586895,
                    -1162376926.0188015,
                    -922529206,
                    -2101453603
                ],
                -1140720571.4610102,
                -1354312622,
                -1422771950,
                279473923,
                -1123738544,
                -973505433,
                337681567.1624651,
                584483923,
                -479062016.4653256
            ],
            "powerful": 1328749269.8862221,
            "potatoes": -500451460,
            "away": -1335702930,
            "gradually": -1554688562.874263,
            "guard": -1676079357,
            "engineer": -367366252,
            "history": 2100986919.3029292,
            "top": -1087574383.6412532
        },
        -1926240371,
        266325295.6926782,
        1995331494.3702157,
        1651483564.0980968,
        -749829322.2593708,
        1201300320,
        396925643.1484089,
        -1135522878.7552903,
        906933463.3947194
    ],
    "misc": {
        "tape": {
            "curious": [
                true,
                2061967799.2883348,
                [
                    false,
                    false,
                    682102563,
                    [
                        [
                            {
                                "social": 1836702234,
                                "circle": "large",
                                "carry": true,
                                "foreign": [
                                    -165603466,
                                    true,
                                    -1886681337.7772107,
                                    722363385.4018393,
                                    "shallow",
                                    "smooth",
                                    true,
                                    1320098042.1566727,
                                    "water",
                                    797935721.062886
                                ],
                                "something": {
                                    "tall": true,
                                    "enter": 1159653404,
                                    "situation": -2095969449.2466316,
                                    "mad": "gather"
                                },
                                "sink": 1464903871,
                                "lungs": "wet",
                                "breathing": false,
                                "lady": "deal",
                                "stock": -1585632890.3277829,
                                "these": 432291605
                            },
                            "please",
                            1784945462.3489215,
                            "pocket",
                            "himself",
                            "sleep",
                            "first",
                            411685989,
                            true,
                            "lady"
                        ],
                        "feel",
                        false,
                        true,
                        false,
                        true,
                        false,
                        "nails",
                        "west",
                        914142647
                    ],
                    true,
                    1762551086.3657537,
                    -2011024867,
                    895290768.1445246,
                    false,
                    1278846067
                ],
                -97299113,
                1547130667,
                -27885888.79397607,
                true,
                -1559273402.2728262,
                false,
                "certain"
            ],
            "perfectly": true,
            "hungry": "fourth",
            "path": true,
            "detail": true,
            "dull": true,
            "tall": true,
            "enter": 1159653404,
            "situation": -2095969449.2466316,
            "mad": "gather"
        },
        "rust": [
            ["apple"],
            ["pear"],
            ["banana", "bernerna"],
            ["orange"]
        ],
        "apple": false,
        "foot": true,
        "potatoes": true,
        "so": 1505520654.4688761,
        "trouble": true,
        "arm": false,
        "shadow": false,
        "mainly": true,
        "shelter": 2012047090.5070164
    }
}
