%YAML 1.1
%TAG !u! tag:unity3d.com,2011:
--- !u!1001 &418314703222195315
PrefabInstance:
  m_ObjectHideFlags: 0
  serializedVersion: 2
  m_Modification:
    m_TransformParent: {fileID: 0}
    m_Modifications:
    - target: {fileID: 7995824383850098836, guid: d6e1298b09bce324283f5789e5211f32, type: 3}
      propertyPath: m_RootOrder
      value: 0
      objectReference: {fileID: 0}
    - target: {fileID: 7995824383850098836, guid: d6e1298b09bce324283f5789e5211f32, type: 3}
      propertyPath: m_LocalPosition.x
      value: 14
      objectReference: {fileID: 0}
    - target: {fileID: 7995824383850098836, guid: d6e1298b09bce324283f5789e5211f32, type: 3}
      propertyPath: m_LocalPosition.y
      value: 3.0901234
      objectReference: {fileID: 0}
    - target: {fileID: 7995824383850098836, guid: d6e1298b09bce324283f5789e5211f32, type: 3}
      propertyPath: m_LocalPosition.z
      value: 3
      objectReference: {fileID: 0}
    - target: {fileID: 7995824383850098836, guid: d6e1298b09bce324283f5789e5211f32, type: 3}
      propertyPath: m_LocalRotation.w
      value: 1
      objectReference: {fileID: 0}
    - target: {fileID: 7995824383850098836, guid: d6e1298b09bce324283f5789e5211f32, type: 3}
      propertyPath: m_LocalRotation.x
      value: 0
      objectReference: {fileID: 0}
    - target: {fileID: 7995824383850098836, guid: d6e1298b09bce324283f5789e5211f32, type: 3}
      propertyPath: m_LocalRotation.y
      value: 0
      objectReference: {fileID: 0}
    - target: {fileID: 7995824383850098836, guid: d6e1298b09bce324283f5789e5211f32, type: 3}
      propertyPath: m_LocalRotation.z
      value: 0
      objectReference: {fileID: 0}
    - target: {fileID: 7995824383850098836, guid: d6e1298b09bce324283f5789e5211f32, type: 3}
      propertyPath: m_LocalEulerAnglesHint.x
      value: 0
      objectReference: {fileID: 0}
    - target: {fileID: 7995824383850098836, guid: d6e1298b09bce324283f5789e5211f32, type: 3}
      propertyPath: m_LocalEulerAnglesHint.y
      value: 0
      objectReference: {fileID: 0}
    - target: {fileID: 7995824383850098836, guid: d6e1298b09bce324283f5789e5211f32, type: 3}
      propertyPath: m_LocalEulerAnglesHint.z
      value: 0
      objectReference: {fileID: 0}
    - target: {fileID: 8677836613936340959, guid: d6e1298b09bce324283f5789e5211f32, type: 3}
      propertyPath: m_Name
      value: Cube_tree_1
      objectReference: {fileID: 0}
    m_RemovedComponents: []
  m_SourcePrefab: {fileID: 100100000, guid: d6e1298b09bce324283f5789e5211f32, type: 3}
--- !u!4 &7726198837348103399 stripped
Transform:
  m_CorrespondingSourceObject: {fileID: 7995824383850098836, guid: d6e1298b09bce324283f5789e5211f32, type: 3}
  m_PrefabInstance: {fileID: 418314703222195315}
  m_PrefabAsset: {fileID: 0}
--- !u!1001 &717867332441053951
PrefabInstance:
  m_ObjectHideFlags: 0
  serializedVersion: 2
  m_Modification:
    m_TransformParent: {fileID: 7726198837348103399}
    m_Modifications:
    - target: {fileID: 2222111361404534124, guid: 88f2fd29f58b9734683512546acec310, type: 3}
      propertyPath: m_Name
      value: Tree_01
      objectReference: {fileID: 0}
    - target: {fileID: 2222111361405018444, guid: 88f2fd29f58b9734683512546acec310, type: 3}
      propertyPath: m_RootOrder
      value: 5
      objectReference: {fileID: 0}
    - target: {fileID: 2222111361405018444, guid: 88f2fd29f58b9734683512546acec310, type: 3}
      propertyPath: m_LocalPosition.x
      value: 0.1023792
      objectReference: {fileID: 0}
    - target: {fileID: 2222111361405018444, guid: 88f2fd29f58b9734683512546acec310, type: 3}
      propertyPath: m_LocalPosition.y
      value: 0.5
      objectReference: {fileID: 0}
    - target: {fileID: 2222111361405018444, guid: 88f2fd29f58b9734683512546acec310, type: 3}
      propertyPath: m_LocalPosition.z
      value: 0.09846115
      objectReference: {fileID: 0}
    - target: {fileID: 2222111361405018444, guid: 88f2fd29f58b9734683512546acec310, type: 3}
      propertyPath: m_LocalRotation.w
      value: 1
      objectReference: {fileID: 0}
    - target: {fileID: 2222111361405018444, guid: 88f2fd29f58b9734683512546acec310, type: 3}
      propertyPath: m_LocalRotation.x
      value: -0
      objectReference: {fileID: 0}
    - target: {fileID: 2222111361405018444, guid: 88f2fd29f58b9734683512546acec310, type: 3}
      propertyPath: m_LocalRotation.y
      value: -0
      objectReference: {fileID: 0}
    - target: {fileID: 2222111361405018444, guid: 88f2fd29f58b9734683512546acec310, type: 3}
      propertyPath: m_LocalRotation.z
      value: -0
      objectReference: {fileID: 0}
    - target: {fileID: 2222111361405018444, guid: 88f2fd29f58b9734683512546acec310, type: 3}
      propertyPath: m_LocalEulerAnglesHint.x
      value: 0
      objectReference: {fileID: 0}
    - target: {fileID: 2222111361405018444, guid: 88f2fd29f58b9734683512546acec310, type: 3}
      propertyPath: m_LocalEulerAnglesHint.y
      value: 0
      objectReference: {fileID: 0}
    - target: {fileID: 2222111361405018444, guid: 88f2fd29f58b9734683512546acec310, type: 3}
      propertyPath: m_LocalEulerAnglesHint.z
      value: 0
      objectReference: {fileID: 0}
    m_RemovedComponents: []
  m_SourcePrefab: {fileID: 100100000, guid: 88f2fd29f58b9734683512546acec310, type: 3}
--- !u!1001 &8814419682499744667
PrefabInstance:
  m_ObjectHideFlags: 0
  serializedVersion: 2
  m_Modification:
    m_TransformParent: {fileID: 7726198837348103399}
    m_Modifications:
    - target: {fileID: 8903058273634794869, guid: f1fc5bb90ac285e4486771552d63bcb8, type: 3}
      propertyPath: m_Name
      value: Grass_01
      objectReference: {fileID: 0}
    - target: {fileID: 8903058273634951509, guid: f1fc5bb90ac285e4486771552d63bcb8, type: 3}
      propertyPath: m_RootOrder
      value: 6
      objectReference: {fileID: 0}
    - target: {fileID: 8903058273634951509, guid: f1fc5bb90ac285e4486771552d63bcb8, type: 3}
      propertyPath: m_LocalPosition.x
      value: -0.023895502
      objectReference: {fileID: 0}
    - target: {fileID: 8903058273634951509, guid: f1fc5bb90ac285e4486771552d63bcb8, type: 3}
      propertyPath: m_LocalPosition.y
      value: 0.5
      objectReference: {fileID: 0}
    - target: {fileID: 8903058273634951509, guid: f1fc5bb90ac285e4486771552d63bcb8, type: 3}
      propertyPath: m_LocalPosition.z
      value: 0.36059773
      objectReference: {fileID: 0}
    - target: {fileID: 8903058273634951509, guid: f1fc5bb90ac285e4486771552d63bcb8, type: 3}
      propertyPath: m_LocalRotation.w
      value: 1
      objectReference: {fileID: 0}
    - target: {fileID: 8903058273634951509, guid: f1fc5bb90ac285e4486771552d63bcb8, type: 3}
      propertyPath: m_LocalRotation.x
      value: -0
      objectReference: {fileID: 0}
    - target: {fileID: 8903058273634951509, guid: f1fc5bb90ac285e4486771552d63bcb8, type: 3}
      propertyPath: m_LocalRotation.y
      value: -0
      objectReference: {fileID: 0}
    - target: {fileID: 8903058273634951509, guid: f1fc5bb90ac285e4486771552d63bcb8, type: 3}
      propertyPath: m_LocalRotation.z
      value: -0
      objectReference: {fileID: 0}
    - target: {fileID: 8903058273634951509, guid: f1fc5bb90ac285e4486771552d63bcb8, type: 3}
      propertyPath: m_LocalEulerAnglesHint.x
      value: 0
      objectReference: {fileID: 0}
    - target: {fileID: 8903058273634951509, guid: f1fc5bb90ac285e4486771552d63bcb8, type: 3}
      propertyPath: m_LocalEulerAnglesHint.y
      value: 0
      objectReference: {fileID: 0}
    - target: {fileID: 8903058273634951509, guid: f1fc5bb90ac285e4486771552d63bcb8, type: 3}
      propertyPath: m_LocalEulerAnglesHint.z
      value: 0
      objectReference: {fileID: 0}
    m_RemovedComponents: []
  m_SourcePrefab: {fileID: 100100000, guid: f1fc5bb90ac285e4486771552d63bcb8, type: 3}
