%YAML 1.1
%TAG !u! tag:unity3d.com,2011:
--- !u!1001 &418314703222195315
PrefabInstance:
  m_ObjectHideFlags: 0
  serializedVersion: 2
  m_Modification:
    m_TransformParent: {fileID: 0}
    m_Modifications:
    - target: {fileID: 7995824383850098836, guid: d6e1298b09bce324283f5789e5211f32, type: 3}
      propertyPath: m_RootOrder
      value: 0
      objectReference: {fileID: 0}
    - target: {fileID: 7995824383850098836, guid: d6e1298b09bce324283f5789e5211f32, type: 3}
      propertyPath: m_LocalPosition.x
      value: 5
      objectReference: {fileID: 0}
    - target: {fileID: 7995824383850098836, guid: d6e1298b09bce324283f5789e5211f32, type: 3}
      propertyPath: m_LocalPosition.y
      value: 2.844273
      objectReference: {fileID: 0}
    - target: {fileID: 7995824383850098836, guid: d6e1298b09bce324283f5789e5211f32, type: 3}
      propertyPath: m_LocalPosition.z
      value: 4
      objectReference: {fileID: 0}
    - target: {fileID: 7995824383850098836, guid: d6e1298b09bce324283f5789e5211f32, type: 3}
      propertyPath: m_LocalRotation.w
      value: 1
      objectReference: {fileID: 0}
    - target: {fileID: 7995824383850098836, guid: d6e1298b09bce324283f5789e5211f32, type: 3}
      propertyPath: m_LocalRotation.x
      value: 0
      objectReference: {fileID: 0}
    - target: {fileID: 7995824383850098836, guid: d6e1298b09bce324283f5789e5211f32, type: 3}
      propertyPath: m_LocalRotation.y
      value: 0
      objectReference: {fileID: 0}
    - target: {fileID: 7995824383850098836, guid: d6e1298b09bce324283f5789e5211f32, type: 3}
      propertyPath: m_LocalRotation.z
      value: 0
      objectReference: {fileID: 0}
    - target: {fileID: 7995824383850098836, guid: d6e1298b09bce324283f5789e5211f32, type: 3}
      propertyPath: m_LocalEulerAnglesHint.x
      value: 0
      objectReference: {fileID: 0}
    - target: {fileID: 7995824383850098836, guid: d6e1298b09bce324283f5789e5211f32, type: 3}
      propertyPath: m_LocalEulerAnglesHint.y
      value: 0
      objectReference: {fileID: 0}
    - target: {fileID: 7995824383850098836, guid: d6e1298b09bce324283f5789e5211f32, type: 3}
      propertyPath: m_LocalEulerAnglesHint.z
      value: 0
      objectReference: {fileID: 0}
    - target: {fileID: 8677836613936340959, guid: d6e1298b09bce324283f5789e5211f32, type: 3}
      propertyPath: m_Name
      value: Cube_tree_2
      objectReference: {fileID: 0}
    m_RemovedComponents: []
  m_SourcePrefab: {fileID: 100100000, guid: d6e1298b09bce324283f5789e5211f32, type: 3}
--- !u!4 &7726198837348103399 stripped
Transform:
  m_CorrespondingSourceObject: {fileID: 7995824383850098836, guid: d6e1298b09bce324283f5789e5211f32, type: 3}
  m_PrefabInstance: {fileID: 418314703222195315}
  m_PrefabAsset: {fileID: 0}
--- !u!1001 &1363179618773406579
PrefabInstance:
  m_ObjectHideFlags: 0
  serializedVersion: 2
  m_Modification:
    m_TransformParent: {fileID: 7726198837348103399}
    m_Modifications:
    - target: {fileID: 4661435515762455780, guid: e289bf5debb17f6459818c207d781953, type: 3}
      propertyPath: m_Name
      value: Tree_02
      objectReference: {fileID: 0}
    - target: {fileID: 4661435515762813124, guid: e289bf5debb17f6459818c207d781953, type: 3}
      propertyPath: m_RootOrder
      value: 5
      objectReference: {fileID: 0}
    - target: {fileID: 4661435515762813124, guid: e289bf5debb17f6459818c207d781953, type: 3}
      propertyPath: m_LocalPosition.x
      value: 0.23512322
      objectReference: {fileID: 0}
    - target: {fileID: 4661435515762813124, guid: e289bf5debb17f6459818c207d781953, type: 3}
      propertyPath: m_LocalPosition.y
      value: 0.5
      objectReference: {fileID: 0}
    - target: {fileID: 4661435515762813124, guid: e289bf5debb17f6459818c207d781953, type: 3}
      propertyPath: m_LocalPosition.z
      value: -0.09
      objectReference: {fileID: 0}
    - target: {fileID: 4661435515762813124, guid: e289bf5debb17f6459818c207d781953, type: 3}
      propertyPath: m_LocalRotation.w
      value: 1
      objectReference: {fileID: 0}
    - target: {fileID: 4661435515762813124, guid: e289bf5debb17f6459818c207d781953, type: 3}
      propertyPath: m_LocalRotation.x
      value: -0
      objectReference: {fileID: 0}
    - target: {fileID: 4661435515762813124, guid: e289bf5debb17f6459818c207d781953, type: 3}
      propertyPath: m_LocalRotation.y
      value: -0
      objectReference: {fileID: 0}
    - target: {fileID: 4661435515762813124, guid: e289bf5debb17f6459818c207d781953, type: 3}
      propertyPath: m_LocalRotation.z
      value: -0
      objectReference: {fileID: 0}
    - target: {fileID: 4661435515762813124, guid: e289bf5debb17f6459818c207d781953, type: 3}
      propertyPath: m_LocalEulerAnglesHint.x
      value: 0
      objectReference: {fileID: 0}
    - target: {fileID: 4661435515762813124, guid: e289bf5debb17f6459818c207d781953, type: 3}
      propertyPath: m_LocalEulerAnglesHint.y
      value: 0
      objectReference: {fileID: 0}
    - target: {fileID: 4661435515762813124, guid: e289bf5debb17f6459818c207d781953, type: 3}
      propertyPath: m_LocalEulerAnglesHint.z
      value: 0
      objectReference: {fileID: 0}
    m_RemovedComponents: []
  m_SourcePrefab: {fileID: 100100000, guid: e289bf5debb17f6459818c207d781953, type: 3}
--- !u!1001 &3577147462025940839
PrefabInstance:
  m_ObjectHideFlags: 0
  serializedVersion: 2
  m_Modification:
    m_TransformParent: {fileID: 7726198837348103399}
    m_Modifications:
    - target: {fileID: 8903058273634794869, guid: f1fc5bb90ac285e4486771552d63bcb8, type: 3}
      propertyPath: m_Name
      value: Grass_01 (1)
      objectReference: {fileID: 0}
    - target: {fileID: 8903058273634951509, guid: f1fc5bb90ac285e4486771552d63bcb8, type: 3}
      propertyPath: m_RootOrder
      value: 8
      objectReference: {fileID: 0}
    - target: {fileID: 8903058273634951509, guid: f1fc5bb90ac285e4486771552d63bcb8, type: 3}
      propertyPath: m_LocalPosition.x
      value: 0.30442715
      objectReference: {fileID: 0}
    - target: {fileID: 8903058273634951509, guid: f1fc5bb90ac285e4486771552d63bcb8, type: 3}
      propertyPath: m_LocalPosition.y
      value: 0.64189744
      objectReference: {fileID: 0}
    - target: {fileID: 8903058273634951509, guid: f1fc5bb90ac285e4486771552d63bcb8, type: 3}
      propertyPath: m_LocalPosition.z
      value: 0.31094098
      objectReference: {fileID: 0}
    - target: {fileID: 8903058273634951509, guid: f1fc5bb90ac285e4486771552d63bcb8, type: 3}
      propertyPath: m_LocalRotation.w
      value: 1
      objectReference: {fileID: 0}
    - target: {fileID: 8903058273634951509, guid: f1fc5bb90ac285e4486771552d63bcb8, type: 3}
      propertyPath: m_LocalRotation.x
      value: -0
      objectReference: {fileID: 0}
    - target: {fileID: 8903058273634951509, guid: f1fc5bb90ac285e4486771552d63bcb8, type: 3}
      propertyPath: m_LocalRotation.y
      value: -0
      objectReference: {fileID: 0}
    - target: {fileID: 8903058273634951509, guid: f1fc5bb90ac285e4486771552d63bcb8, type: 3}
      propertyPath: m_LocalRotation.z
      value: -0
      objectReference: {fileID: 0}
    - target: {fileID: 8903058273634951509, guid: f1fc5bb90ac285e4486771552d63bcb8, type: 3}
      propertyPath: m_LocalEulerAnglesHint.x
      value: 0
      objectReference: {fileID: 0}
    - target: {fileID: 8903058273634951509, guid: f1fc5bb90ac285e4486771552d63bcb8, type: 3}
      propertyPath: m_LocalEulerAnglesHint.y
      value: 0
      objectReference: {fileID: 0}
    - target: {fileID: 8903058273634951509, guid: f1fc5bb90ac285e4486771552d63bcb8, type: 3}
      propertyPath: m_LocalEulerAnglesHint.z
      value: 0
      objectReference: {fileID: 0}
    m_RemovedComponents: []
  m_SourcePrefab: {fileID: 100100000, guid: f1fc5bb90ac285e4486771552d63bcb8, type: 3}
--- !u!1001 &4045010389443400653
PrefabInstance:
  m_ObjectHideFlags: 0
  serializedVersion: 2
  m_Modification:
    m_TransformParent: {fileID: 7726198837348103399}
    m_Modifications:
    - target: {fileID: 4385080170327957909, guid: ff62b58c5a9ea164fa8ddf8038e10cd1, type: 3}
      propertyPath: m_RootOrder
      value: 6
      objectReference: {fileID: 0}
    - target: {fileID: 4385080170327957909, guid: ff62b58c5a9ea164fa8ddf8038e10cd1, type: 3}
      propertyPath: m_LocalPosition.x
      value: -0.057273865
      objectReference: {fileID: 0}
    - target: {fileID: 4385080170327957909, guid: ff62b58c5a9ea164fa8ddf8038e10cd1, type: 3}
      propertyPath: m_LocalPosition.y
      value: 0.5
      objectReference: {fileID: 0}
    - target: {fileID: 4385080170327957909, guid: ff62b58c5a9ea164fa8ddf8038e10cd1, type: 3}
      propertyPath: m_LocalPosition.z
      value: 0.14980626
      objectReference: {fileID: 0}
    - target: {fileID: 4385080170327957909, guid: ff62b58c5a9ea164fa8ddf8038e10cd1, type: 3}
      propertyPath: m_LocalRotation.w
      value: 1
      objectReference: {fileID: 0}
    - target: {fileID: 4385080170327957909, guid: ff62b58c5a9ea164fa8ddf8038e10cd1, type: 3}
      propertyPath: m_LocalRotation.x
      value: -0
      objectReference: {fileID: 0}
    - target: {fileID: 4385080170327957909, guid: ff62b58c5a9ea164fa8ddf8038e10cd1, type: 3}
      propertyPath: m_LocalRotation.y
      value: -0
      objectReference: {fileID: 0}
    - target: {fileID: 4385080170327957909, guid: ff62b58c5a9ea164fa8ddf8038e10cd1, type: 3}
      propertyPath: m_LocalRotation.z
      value: -0
      objectReference: {fileID: 0}
    - target: {fileID: 4385080170327957909, guid: ff62b58c5a9ea164fa8ddf8038e10cd1, type: 3}
      propertyPath: m_LocalEulerAnglesHint.x
      value: 0
      objectReference: {fileID: 0}
    - target: {fileID: 4385080170327957909, guid: ff62b58c5a9ea164fa8ddf8038e10cd1, type: 3}
      propertyPath: m_LocalEulerAnglesHint.y
      value: 0
      objectReference: {fileID: 0}
    - target: {fileID: 4385080170327957909, guid: ff62b58c5a9ea164fa8ddf8038e10cd1, type: 3}
      propertyPath: m_LocalEulerAnglesHint.z
      value: 0
      objectReference: {fileID: 0}
    - target: {fileID: 4385080170328260021, guid: ff62b58c5a9ea164fa8ddf8038e10cd1, type: 3}
      propertyPath: m_Name
      value: Mushroom_01
      objectReference: {fileID: 0}
    m_RemovedComponents: []
  m_SourcePrefab: {fileID: 100100000, guid: ff62b58c5a9ea164fa8ddf8038e10cd1, type: 3}
--- !u!1001 &5872153255054226085
PrefabInstance:
  m_ObjectHideFlags: 0
  serializedVersion: 2
  m_Modification:
    m_TransformParent: {fileID: 7726198837348103399}
    m_Modifications:
    - target: {fileID: 8903058273634794869, guid: f1fc5bb90ac285e4486771552d63bcb8, type: 3}
      propertyPath: m_Name
      value: Grass_01
      objectReference: {fileID: 0}
    - target: {fileID: 8903058273634951509, guid: f1fc5bb90ac285e4486771552d63bcb8, type: 3}
      propertyPath: m_RootOrder
      value: 7
      objectReference: {fileID: 0}
    - target: {fileID: 8903058273634951509, guid: f1fc5bb90ac285e4486771552d63bcb8, type: 3}
      propertyPath: m_LocalPosition.x
      value: 0.3366015
      objectReference: {fileID: 0}
    - target: {fileID: 8903058273634951509, guid: f1fc5bb90ac285e4486771552d63bcb8, type: 3}
      propertyPath: m_LocalPosition.y
      value: 0.5
      objectReference: {fileID: 0}
    - target: {fileID: 8903058273634951509, guid: f1fc5bb90ac285e4486771552d63bcb8, type: 3}
      propertyPath: m_LocalPosition.z
      value: 0.23676634
      objectReference: {fileID: 0}
    - target: {fileID: 8903058273634951509, guid: f1fc5bb90ac285e4486771552d63bcb8, type: 3}
      propertyPath: m_LocalRotation.w
      value: 1
      objectReference: {fileID: 0}
    - target: {fileID: 8903058273634951509, guid: f1fc5bb90ac285e4486771552d63bcb8, type: 3}
      propertyPath: m_LocalRotation.x
      value: -0
      objectReference: {fileID: 0}
    - target: {fileID: 8903058273634951509, guid: f1fc5bb90ac285e4486771552d63bcb8, type: 3}
      propertyPath: m_LocalRotation.y
      value: -0
      objectReference: {fileID: 0}
    - target: {fileID: 8903058273634951509, guid: f1fc5bb90ac285e4486771552d63bcb8, type: 3}
      propertyPath: m_LocalRotation.z
      value: -0
      objectReference: {fileID: 0}
    - target: {fileID: 8903058273634951509, guid: f1fc5bb90ac285e4486771552d63bcb8, type: 3}
      propertyPath: m_LocalEulerAnglesHint.x
      value: 0
      objectReference: {fileID: 0}
    - target: {fileID: 8903058273634951509, guid: f1fc5bb90ac285e4486771552d63bcb8, type: 3}
      propertyPath: m_LocalEulerAnglesHint.y
      value: 0
      objectReference: {fileID: 0}
    - target: {fileID: 8903058273634951509, guid: f1fc5bb90ac285e4486771552d63bcb8, type: 3}
      propertyPath: m_LocalEulerAnglesHint.z
      value: 0
      objectReference: {fileID: 0}
    m_RemovedComponents: []
  m_SourcePrefab: {fileID: 100100000, guid: f1fc5bb90ac285e4486771552d63bcb8, type: 3}
