
*** Running vitis_hls
    with args -f bandwidth.tcl -messageDb vitis_hls.pb


****** Vitis HLS - High-Level Synthesis from C, C++ and OpenCL v2021.1 (64-bit)
  **** SW Build 3247384 on Thu Jun 10 19:36:07 MDT 2021
  **** IP Build 3246043 on Fri Jun 11 00:30:35 MDT 2021
    ** Copyright 1986-2021 Xilinx, Inc. All Rights Reserved.

source /tools/Xilinx/Vitis_HLS/2021.1/scripts/vitis_hls/hls.tcl -notrace
INFO: [HLS 200-10] Running '/tools/Xilinx/Vitis_HLS/2021.1/bin/unwrapped/lnx64.o/vitis_hls'
INFO: [HLS 200-10] For user 'root' on host 'FPGA2-18.04' (Linux_x86_64 version 4.15.0-161-generic) on Wed Nov 03 18:15:42 KST 2021
INFO: [HLS 200-10] On os Ubuntu 18.04 LTS
INFO: [HLS 200-10] In directory '/home/via/gnn_workspace/jh_gnn_211018_kernels/Hardware/build/bandwidth/bandwidth'
Sourcing Tcl script 'bandwidth.tcl'
INFO: [HLS 200-1510] Running: open_project bandwidth 
INFO: [HLS 200-10] Creating and opening project '/home/via/gnn_workspace/jh_gnn_211018_kernels/Hardware/build/bandwidth/bandwidth/bandwidth'.
INFO: [HLS 200-1510] Running: set_top bandwidth 
INFO: [HLS 200-1510] Running: add_files /home/via/gnn_workspace/jh_gnn_211018_kernels/src/bandwidth.cpp -cflags  -I /home/via/gnn_workspace/jh_gnn_211018_kernels/src  
INFO: [HLS 200-10] Adding design file '/home/via/gnn_workspace/jh_gnn_211018_kernels/src/bandwidth.cpp' to the project
INFO: [HLS 200-1510] Running: open_solution -flow_target vitis solution 
INFO: [HLS 200-10] Creating and opening solution '/home/via/gnn_workspace/jh_gnn_211018_kernels/Hardware/build/bandwidth/bandwidth/bandwidth/solution'.
INFO: [HLS 200-1505] Using flow_target 'vitis'
Resolution: For help on HLS 200-1505 see www.xilinx.com/cgi-bin/docs/rdoc?v=2021.1;t=hls+guidance;d=200-1505.html
INFO: [HLS 200-435] Setting 'open_solution -flow_target vitis' configuration: config_interface -m_axi_latency=64
INFO: [HLS 200-435] Setting 'open_solution -flow_target vitis' configuration: config_interface -m_axi_alignment_byte_size=64
INFO: [HLS 200-435] Setting 'open_solution -flow_target vitis' configuration: config_interface -m_axi_max_widen_bitwidth=512
INFO: [HLS 200-435] Setting 'open_solution -flow_target vitis' configuration: config_rtl -register_reset_num=3
INFO: [HLS 200-1510] Running: set_part xcu280-fsvh2892-2L-e 
INFO: [HLS 200-1611] Setting target device to 'xcu280-fsvh2892-2L-e'
INFO: [HLS 200-1510] Running: create_clock -period 300.000000MHz -name default 
INFO: [SYN 201-201] Setting up clock 'default' with a period of 3.333ns.
INFO: [HLS 200-1510] Running: config_dataflow -strict_mode warning 
INFO: [HLS 200-1510] Running: config_export -disable_deadlock_detection=true 
INFO: [HLS 200-1510] Running: config_rtl -m_axi_conservative_mode=1 
WARNING: [HLS 200-483] The 'config_rtl -m_axi_conservative_mode' command is deprecated and will be removed in a future release. Use 'config_interface -m_axi_conservative_mode' as its replacement.
INFO: [HLS 200-1510] Running: config_interface -m_axi_addr64 
INFO: [HLS 200-1510] Running: config_interface -m_axi_auto_max_ports=0 
INFO: [HLS 200-1510] Running: config_export -format ip_catalog -ipname bandwidth 
INFO: [HLS 200-1510] Running: csynth_design 
INFO: [HLS 200-111] Finished File checks and directory preparation: CPU user time: 0 seconds. CPU system time: 0 seconds. Elapsed time: 0 seconds; current allocated memory: 250.176 MB.
INFO: [HLS 200-10] Analyzing design file '/home/via/gnn_workspace/jh_gnn_211018_kernels/src/bandwidth.cpp' ... 
WARNING: [HLS 207-5528] Ignore interface attribute or pragma which is not used in top function: /home/via/gnn_workspace/jh_gnn_211018_kernels/src/bandwidth.cpp:239:9
WARNING: [HLS 207-5301] unused parameter 'print': /tools/Xilinx/Vitis_HLS/2021.1/common/technology/autopilot/ap_int_base.h:792:16
INFO: [HLS 200-111] Finished Source Code Analysis and Preprocessing: CPU user time: 3.82 seconds. CPU system time: 0.45 seconds. Elapsed time: 3.55 seconds; current allocated memory: 251.840 MB.
INFO: [HLS 200-777] Using interface defaults for 'Vitis' flow target.
INFO: [HLS 214-279] Initial Interval estimation mode is set into default.
INFO: [HLS 214-284] Auto array partition mode is set into default.
INFO: [HLS 214-241] Aggregating maxi variable 'out_c' with non-compact mode in 64-bits (/home/via/gnn_workspace/jh_gnn_211018_kernels/src/bandwidth.cpp:227:0)
INFO: [HLS 214-241] Aggregating maxi variable 'in_data_offset' with non-compact mode in 64-bits (/home/via/gnn_workspace/jh_gnn_211018_kernels/src/bandwidth.cpp:227:0)
INFO: [HLS 214-241] Aggregating maxi variable 'in_rc' with non-compact mode in 64-bits (/home/via/gnn_workspace/jh_gnn_211018_kernels/src/bandwidth.cpp:227:0)
INFO: [HLS 214-241] Aggregating maxi variable 'in_col' with non-compact mode in 64-bits (/home/via/gnn_workspace/jh_gnn_211018_kernels/src/bandwidth.cpp:227:0)
INFO: [HLS 214-270] Starting automatic array partition analysis...
INFO: [HLS 214-115] Multiple burst reads of variable length and bit width 64 in loop 'VITIS_LOOP_245_1'(/home/via/gnn_workspace/jh_gnn_211018_kernels/src/bandwidth.cpp:245:31) has been inferred on port 'gmem'. These bursts requests might be further partitioned into multiple requests during RTL generation, based on max_read_burst_length or max_write_burst_length settings. (/home/via/gnn_workspace/jh_gnn_211018_kernels/src/bandwidth.cpp:245:31)
INFO: [HLS 214-115] Multiple burst writes of variable length and bit width 64 in loop 'VITIS_LOOP_245_1'(/home/via/gnn_workspace/jh_gnn_211018_kernels/src/bandwidth.cpp:245:31) has been inferred on port 'gmem'. These bursts requests might be further partitioned into multiple requests during RTL generation, based on max_read_burst_length or max_write_burst_length settings. (/home/via/gnn_workspace/jh_gnn_211018_kernels/src/bandwidth.cpp:245:31)
INFO: [HLS 214-115] Multiple burst writes of variable length and bit width 64 in loop 'VITIS_LOOP_250_2'(/home/via/gnn_workspace/jh_gnn_211018_kernels/src/bandwidth.cpp:250:31) has been inferred on port 'gmem'. These bursts requests might be further partitioned into multiple requests during RTL generation, based on max_read_burst_length or max_write_burst_length settings. (/home/via/gnn_workspace/jh_gnn_211018_kernels/src/bandwidth.cpp:250:31)
INFO: [HLS 214-131] Inlining function '_llvm.fpga.pack.none.i64.s_struct.ssdm_int.1s' into '_llvm.fpga.unpack.none.s_struct.ap_ints.i64.1'
INFO: [HLS 214-131] Inlining function '_llvm.fpga.unpack.none.s_struct.ap_ints.i64.1' into 'bandwidth' (/home/via/gnn_workspace/jh_gnn_211018_kernels/src/bandwidth.cpp:246:51)
INFO: [HLS 214-131] Inlining function '_llvm.fpga.unpack.none.s_struct.ap_ints.i64.1' into 'bandwidth'
INFO: [HLS 200-111] Finished Compiling Optimization and Transform: CPU user time: 3 seconds. CPU system time: 0.25 seconds. Elapsed time: 3.25 seconds; current allocated memory: 253.194 MB.
INFO: [HLS 200-111] Finished Checking Pragmas: CPU user time: 0 seconds. CPU system time: 0 seconds. Elapsed time: 0 seconds; current allocated memory: 253.195 MB.
INFO: [HLS 200-10] Starting code transformations ...
INFO: [HLS 200-111] Finished Standard Transforms: CPU user time: 0.02 seconds. CPU system time: 0 seconds. Elapsed time: 0.01 seconds; current allocated memory: 256.414 MB.
INFO: [HLS 200-10] Checking synthesizability ...
INFO: [HLS 200-111] Finished Checking Synthesizability: CPU user time: 0.03 seconds. CPU system time: 0.01 seconds. Elapsed time: 0.03 seconds; current allocated memory: 258.943 MB.
INFO: [XFORM 203-502] Unrolling all sub-loops inside loop 'gather_and_sample_node' (/home/via/gnn_workspace/jh_gnn_211018_kernels/src/bandwidth.cpp:241) in function 'bandwidth' for pipelining.
WARNING: [HLS 200-936] Cannot unroll loop 'VITIS_LOOP_245_1' (/home/via/gnn_workspace/jh_gnn_211018_kernels/src/bandwidth.cpp:243) in function 'bandwidth': cannot completely unroll a loop with a variable trip count.
Resolution: For help on HLS 200-936 see www.xilinx.com/cgi-bin/docs/rdoc?v=2021.1;t=hls+guidance;d=200-936.html
WARNING: [HLS 200-936] Cannot unroll loop 'VITIS_LOOP_250_2' (/home/via/gnn_workspace/jh_gnn_211018_kernels/src/bandwidth.cpp:243) in function 'bandwidth': cannot completely unroll a loop with a variable trip count.
Resolution: For help on HLS 200-936 see www.xilinx.com/cgi-bin/docs/rdoc?v=2021.1;t=hls+guidance;d=200-936.html
INFO: [HLS 200-111] Finished Loop, function and other optimizations: CPU user time: 0.06 seconds. CPU system time: 0 seconds. Elapsed time: 0.06 seconds; current allocated memory: 283.147 MB.
WARNING: [HLS 200-960] Cannot flatten loop 'gather_and_sample_node' (/home/via/gnn_workspace/jh_gnn_211018_kernels/src/bandwidth.cpp:241:14) in function 'bandwidth' more than one sub loop.
Resolution: For help on HLS 200-960 see www.xilinx.com/cgi-bin/docs/rdoc?v=2021.1;t=hls+guidance;d=200-960.html
INFO: [HLS 200-111] Finished Architecture Synthesis: CPU user time: 0.04 seconds. CPU system time: 0 seconds. Elapsed time: 0.05 seconds; current allocated memory: 277.805 MB.
INFO: [HLS 200-10] Starting hardware synthesis ...
INFO: [HLS 200-10] Synthesizing 'bandwidth' ...
INFO: [HLS 200-10] ----------------------------------------------------------------
INFO: [HLS 200-42] -- Implementing module 'bandwidth' 
INFO: [HLS 200-10] ----------------------------------------------------------------
INFO: [SCHED 204-11] Starting scheduling ...
WARNING: [SCHED 204-65] Unable to satisfy pipeline directive for loop 'gather_and_sample_node': contains subloop(s) that are not unrolled or flattened.
INFO: [SCHED 204-11] Finished scheduling.
INFO: [HLS 200-111] Finished Scheduling: CPU user time: 0.68 seconds. CPU system time: 0.01 seconds. Elapsed time: 0.69 seconds; current allocated memory: 279.266 MB.
INFO: [BIND 205-100] Starting micro-architecture generation ...
INFO: [BIND 205-101] Performing variable lifetime analysis.
INFO: [BIND 205-101] Exploring resource sharing.
INFO: [BIND 205-101] Binding ...
INFO: [BIND 205-100] Finished micro-architecture generation.
INFO: [HLS 200-111] Finished Binding: CPU user time: 1.7 seconds. CPU system time: 0 seconds. Elapsed time: 1.71 seconds; current allocated memory: 281.900 MB.
INFO: [HLS 200-10] ----------------------------------------------------------------
INFO: [HLS 200-10] -- Generating RTL for module 'bandwidth' 
INFO: [HLS 200-10] ----------------------------------------------------------------
WARNING: [RTGEN 206-101] Design contains AXI ports. Reset is fixed to synchronous and active low.
INFO: [RTGEN 206-500] Setting interface mode on port 'bandwidth/gmem' to 'm_axi'.
INFO: [RTGEN 206-500] Setting interface mode on port 'bandwidth/in_col' to 's_axilite & ap_none'.
INFO: [RTGEN 206-500] Setting interface mode on port 'bandwidth/in_rc' to 's_axilite & ap_none'.
INFO: [RTGEN 206-500] Setting interface mode on port 'bandwidth/in_data_offset' to 's_axilite & ap_none'.
INFO: [RTGEN 206-500] Setting interface mode on port 'bandwidth/out_c' to 's_axilite & ap_none'.
INFO: [RTGEN 206-500] Setting interface mode on port 'bandwidth/num_bulk' to 's_axilite & ap_none'.
INFO: [RTGEN 206-500] Setting interface mode on port 'bandwidth/num_neighbor' to 's_axilite & ap_none'.
INFO: [RTGEN 206-500] Setting interface mode on port 'bandwidth/seed' to 's_axilite & ap_none'.
INFO: [RTGEN 206-500] Setting interface mode on function 'bandwidth' to 's_axilite & ap_ctrl_chain'.
INFO: [RTGEN 206-100] Bundling port 'in_col', 'in_rc', 'in_data_offset', 'out_c', 'num_bulk', 'num_neighbor', 'seed' to AXI-Lite port control.
INFO: [RTGEN 206-100] Finished creating RTL model for 'bandwidth'.
INFO: [HLS 200-111] Finished Creating RTL model: CPU user time: 0.41 seconds. CPU system time: 0 seconds. Elapsed time: 0.41 seconds; current allocated memory: 288.214 MB.
INFO: [HLS 200-111] Finished Generating all RTL models: CPU user time: 0.67 seconds. CPU system time: 0.03 seconds. Elapsed time: 0.69 seconds; current allocated memory: 295.583 MB.
INFO: [HLS 200-1603] Design has MAXI bursts and missed bursts, see Vitis HLS GUI synthesis summary report for detailed information.
INFO: [HLS 200-111] Finished Updating report files: CPU user time: 0.47 seconds. CPU system time: 0 seconds. Elapsed time: 0.47 seconds; current allocated memory: 300.626 MB.
INFO: [VHDL 208-304] Generating VHDL RTL for bandwidth.
INFO: [VLOG 209-307] Generating Verilog RTL for bandwidth.
INFO: [HLS 200-790] **** Loop Constraint Status: All loop constraints were satisfied.
INFO: [HLS 200-789] **** Estimated Fmax: 411.00 MHz
INFO: [HLS 200-111] Finished Command csynth_design CPU user time: 10.92 seconds. CPU system time: 0.75 seconds. Elapsed time: 10.95 seconds; current allocated memory: 300.611 MB.
INFO: [HLS 200-1510] Running: export_design 
INFO: [IMPL 213-8] Exporting RTL as a Vivado IP.

****** Vivado v2021.1 (64-bit)
  **** SW Build 3247384 on Thu Jun 10 19:36:07 MDT 2021
  **** IP Build 3246043 on Fri Jun 11 00:30:35 MDT 2021
    ** Copyright 1986-2021 Xilinx, Inc. All Rights Reserved.

source run_ippack.tcl -notrace
INFO: [IP_Flow 19-234] Refreshing IP repositories
INFO: [IP_Flow 19-1704] No user IP repositories specified
INFO: [IP_Flow 19-2313] Loaded Vivado IP repository '/tools/Xilinx/Vivado/2021.1/data/ip'.
INFO: [Common 17-206] Exiting Vivado at Wed Nov  3 18:16:03 2021...
INFO: [HLS 200-802] Generated output file bandwidth/solution/impl/export.zip
INFO: [HLS 200-111] Finished Command export_design CPU user time: 10.67 seconds. CPU system time: 0.74 seconds. Elapsed time: 12.28 seconds; current allocated memory: 303.219 MB.
HLS completed successfully
INFO: [HLS 200-112] Total CPU user time: 23.46 seconds. Total CPU system time: 1.89 seconds. Total elapsed time: 24.65 seconds; peak allocated memory: 300.626 MB.
INFO: [Common 17-206] Exiting vitis_hls at Wed Nov  3 18:16:06 2021...
