{
 "session": {
  "name": "Hardware",
  "uuid": "23d5a10d-d0cb-4f0d-a3ac-1a7979c9d684",
  "description": "Vitis IDE session Hardware",
  "timestamp": "0",
  "report_file": {
   "scheme": "FILE",
   "host": "",
   "port": 0,
   "path": "/home/via/gnn_workspace/jh_gnn_211018_kernels/Hardware/guidance.html",
   "query": "",
   "fragment": "",
   "media_type": "",
   "encoding": "",
   "data": ""
  },
  "proto_file": {
   "scheme": "FILE",
   "host": "",
   "port": 0,
   "path": "/home/via/gnn_workspace/jh_gnn_211018_kernels/Hardware/guidance.pb",
   "query": "",
   "fragment": "",
   "media_type": "",
   "encoding": "",
   "data": ""
  },
  "build_target": "",
  "config_files": []
 },
 "violation_count": 0,
 "waived_count": 0,
 "affirmation_count": 0
}

