l1_cat_name,L1 ID
Health,100001
Fashion Accessories,100009
Home Appliances,100010
Men Clothes,100011
Men Shoes,100012
Mobile & Gadgets,100013
Muslim Fashion,100014
Travel & Luggage,100015
Women Bags,100016
Women Clothes,100017
Food Delivery,100531
Women Shoes,100532
Men Bags,100533
Watches,100534
Audio,100535
Food & Beverages,100629
Beauty,100630
Pets,100631
Mom & Baby,100632
Baby & Kids Fashion,100633
Gaming & Consoles,100634
Cameras & Drones,100635
Home & Living,100636
Sports & Outdoors,100637
Stationary,100638
Hobbies & Collections,100639
Automobiles,100640
Motorcycles,100641
"Tickets, Vouchers & Services",100642
Books & Magazines,100643
Computers & Accessories,100644