<svg xmlns="http://www.w3.org/2000/svg" width="42" height="39" viewBox="0 0 42 39">
  <g id="Facebook" transform="translate(-10132 -1112)">
    <rect id="background" width="42" height="39" rx="6" transform="translate(10132 1112)" fill="#0d7cf7"/>
    <path id="Shape" d="M10,0H7.273A4.405,4.405,0,0,0,2.727,4.25V6.8H0v3.4H2.727V17H6.364V10.2H9.091L10,6.8H6.364V4.25a.881.881,0,0,1,.909-.85H10Z" transform="translate(10148 1123)" fill="#fff"/>
  </g>
</svg>
