<svg xmlns="http://www.w3.org/2000/svg" width="101" height="26" viewBox="0 0 101 26">
  <g id="paypal" transform="translate(0.003 -187.6)">
    <path id="Path_56337" data-name="Path 56337" d="M356.016,221.2h-5.654a1.1,1.1,0,0,0-.831.664l-2.328,14.6a.44.44,0,0,0,.507.506H350.7a.44.44,0,0,0,.507-.506l.666-4.147a.76.76,0,0,1,.831-.664h1.83q5.745,0,6.485-5.475a4.341,4.341,0,0,0-.666-3.65,6.717,6.717,0,0,0-4.324-1.327m.666,5.476c-.338,1.991-1.83,1.991-3.325,1.991h-1l.666-3.815c0-.169.169-.337.507-.337h.338c1,0,2,0,2.494.664.338.169.338.664.338,1.494" transform="translate(-278.036 -27.345)" fill="#139ad6"/>
    <g id="Group_59862" data-name="Group 59862" transform="translate(29.905 193.852)">
      <path id="Path_56338" data-name="Path 56338" d="M160.016,221.2h-5.654a1.1,1.1,0,0,0-.831.664l-2.328,14.6a.44.44,0,0,0,.507.506h2.661a1.1,1.1,0,0,0,.831-.664l.666-3.982a.76.76,0,0,1,.831-.664h1.83q5.745,0,6.485-5.475a4.341,4.341,0,0,0-.666-3.65,6.4,6.4,0,0,0-4.324-1.327m.666,5.475c-.338,1.991-1.83,1.991-3.325,1.991h-.831l.666-3.815c0-.169.169-.337.507-.337h.338c1,0,2,0,2.494.664a1.773,1.773,0,0,1,.169,1.494" transform="translate(-151.197 -221.196)" fill="#263b80"/>
      <path id="Path_56339" data-name="Path 56339" d="M226.815,245.542h-2.661c-.169,0-.507.169-.507.337l-.169.829-.169-.337a3.917,3.917,0,0,0-3.16-1.161A6.385,6.385,0,0,0,214,250.685a4.936,4.936,0,0,0,1,4.147,4.2,4.2,0,0,0,3.493,1.327,5.322,5.322,0,0,0,3.824-1.494l-.169.829a.441.441,0,0,0,.507.506h2.494a1.1,1.1,0,0,0,.831-.664l1.5-9.29c-.169-.169-.507-.506-.666-.506m-3.824,5.309a3.208,3.208,0,0,1-3.16,2.655,2.663,2.663,0,0,1-1.83-.664,3.534,3.534,0,0,1-.507-1.991,2.967,2.967,0,0,1,4.822-1.991,2.892,2.892,0,0,1,.666,1.991" transform="translate(-200.869 -240.222)" fill="#263b80"/>
    </g>
    <path id="Path_56340" data-name="Path 56340" d="M422.015,245.542h-2.661c-.169,0-.507.169-.507.337l-.169.829-.169-.337a3.917,3.917,0,0,0-3.16-1.161,6.385,6.385,0,0,0-6.152,5.475,4.936,4.936,0,0,0,1,4.147,4.2,4.2,0,0,0,3.493,1.327,5.323,5.323,0,0,0,3.825-1.494l-.169.829a.441.441,0,0,0,.507.506h2.494a1.1,1.1,0,0,0,.831-.664l1.5-9.29c-.169-.169-.338-.506-.666-.506m-3.824,5.309a3.208,3.208,0,0,1-3.16,2.655,2.663,2.663,0,0,1-1.83-.664,3.534,3.534,0,0,1-.507-1.991,2.967,2.967,0,0,1,4.822-1.991,1.9,1.9,0,0,1,.666,1.991" transform="translate(-327.85 -46.371)" fill="#139ad6"/>
    <path id="Path_56341" data-name="Path 56341" d="M296.8,246.8h-2.835a.864.864,0,0,0-.666.337l-3.658,5.641-1.663-5.309a.769.769,0,0,0-.831-.506h-2.644c-.338,0-.507.337-.507.664l2.992,8.793-2.823,3.984c-.169.337,0,.829.338.829h2.661a.864.864,0,0,0,.666-.337l9.146-13.107c.507-.506.169-.995-.169-.995" transform="translate(-227.403 -47.636)" fill="#263b80"/>
    <path id="Path_56342" data-name="Path 56342" d="M477.531,222.084,475.2,237.015a.44.44,0,0,0,.507.506h2.328a1.1,1.1,0,0,0,.831-.664l2.328-14.6a.44.44,0,0,0-.507-.506h-2.661c-.169-.169-.338,0-.507.337" transform="translate(-380.206 -27.727)" fill="#139ad6"/>
    <path id="Path_56343" data-name="Path 56343" d="M19.124,189.531C17.96,188.237,15.8,187.6,12.8,187.6H4.491a1.413,1.413,0,0,0-1.164.97L0,209.644a.742.742,0,0,0,.666.809H5.821l1.33-7.884v.323a1.413,1.413,0,0,1,1.164-.97h2.5c4.822,0,8.48-1.931,9.645-7.241V194.2h0a5.488,5.488,0,0,0-1.33-4.667" transform="translate(0)" fill="#263b80"/>
    <path id="Path_56344" data-name="Path 56344" d="M40.567,220.4h0v.506c-1.164,5.641-4.822,7.466-9.645,7.466H28.428a1.425,1.425,0,0,0-1.164.995L25.6,239.484a.608.608,0,0,0,.666.664h4.324a.931.931,0,0,0,1-.829v-.169l.831-5.143v-.337a.93.93,0,0,1,1-.829h.666c4.157,0,7.484-1.659,8.315-6.637a6.088,6.088,0,0,0-.831-4.977,1.7,1.7,0,0,0-1-.829" transform="translate(-20.279 -26.711)" fill="#139ad6"/>
    <path id="Path_56345" data-name="Path 56345" d="M46.379,216.109c-.169,0-.338-.169-.507-.169a.612.612,0,0,1-.507-.169A8.8,8.8,0,0,0,43.2,215.6h-6.47a.612.612,0,0,0-.507.169.912.912,0,0,0-.507.829l-1.33,8.626v.337a1.425,1.425,0,0,1,1.164-.995h2.494c4.822,0,8.48-1.991,9.645-7.466a.609.609,0,0,1,.169-.506c-.338-.169-.507-.337-.831-.337-.507-.169-.507-.169-.666-.169" transform="translate(-27.254 -22.444)" fill="#232c65"/>
  </g>
</svg>
