{
    "Vehicle Detect v1.0": {
        "constant": {
            "MAX_CHANNEL": 16,
            "OUTPUT_WIDTH": 1920,
            "OUTPUT_HEIGHT": 1080
        },
        "config-classes-path": "../pipelines/vehicle_detect/models/Primary_Detector/labels.txt",
        "elements": [
            {
                "element_type": "nvinfer",
                "element_name": "primary-inference",
                "config-file-path": "../pipelines/vehicle_detect/config/dstest2_pgie_config.txt",
                "class_type": "vehicle_detect"
            },
            {
                "element_type": "nvtracker",
                "element_name": "tracker",
                "config-file-path": "../pipelines/vehicle_detect/config/dstest2_tracker_config.txt"
            },
            {
                "element_type": "nvdsanalytics",
                "element_name": "analytics",
                "config-file-path": "../pipelines/vehicle_detect/config/config_nvdsanalytics.txt"
            },
            {
                "element_type": "nvinfer",
                "element_name": "secondary1-nvinference-engine",
                "config-file-path": "../pipelines/vehicle_detect/config/dstest2_sgie1_config.txt",
                "class_type": "Color"
            },
            {
                "element_type": "nvinfer",
                "element_name": "secondary2-nvinference-engine",
                "config-file-path": "../pipelines/vehicle_detect/config/dstest2_sgie2_config.txt",
                "class_type": "Make"
            },
            {
                "element_type": "nvinfer",
                "element_name": "secondary3-nvinference-engine",
                "config-file-path": "../pipelines/vehicle_detect/config/dstest2_sgie3_config.txt",
                "class_type": "Type"
            }
        ]
    },
    "License Plate Recognizer v2.1": {
        "constant": {
            "MAX_CHANNEL": 16,
            "OUTPUT_WIDTH": 1920,
            "OUTPUT_HEIGHT": 1080
        },
        "config-classes-path" : "../pipelines/lprnet/config/labels_trafficnet.txt",
        "elements": [
            {
                "element_type": "nvinfer",
                "element_name": "pgie_car_detector",
                "config-file-path": "../pipelines/lprnet/config/trafficamnet_config.txt",
                "class_type": "lprnet"
            },
            {
                "element_type": "nvtracker",
                "element_name": "tracker",
                "config-file-path": "../pipelines/lprnet/config/lpr_sample_tracker_config.txt"
            },
            {
                "element_type": "nvdsanalytics",
                "element_name": "analytics",
                "config-file-path": "../pipelines/lprnet/config/config_nvdsanalytics.txt"
            },
            {
                "element_type": "nvinfer",
                "element_name": "sgie_license_plate_detector",
                "config-file-path": "../pipelines/lprnet/config/lpd_us_config.txt",
                "class_type":"Lpd_US_CA"
            },
            {
                "element_type": "nvinfer",
                "element_name": "sgie_license_plate_recognizer",
                "config-file-path": "../pipelines/lprnet/config/lpr_config_sgie_us.txt",
                "class_type": "Lpr_US_CA"
            }
        ]
    },
    "Person Detect v1.0": {
        "constant": {
            "MAX_CHANNEL": 16,
            "OUTPUT_WIDTH": 1920,
            "OUTPUT_HEIGHT": 1080
        },
        "config-classes-path" : "../pipelines/person_detect/models/Primary_Detector/labels.txt",
        "elements": [
            {
                "element_type": "nvinfer",
                "element_name": "pgie_people_detector",
                "config-file-path": "../pipelines/person_detect/config/config_infer_primary_person_detect.txt",
                "class_type": "person_detect"
            },
            {
                "element_type": "nvtracker",
                "element_name": "tracker",
                "config-file-path": "../pipelines/person_detect/config/dstest2_tracker_config.txt"
            },
            {
                "element_type": "nvdsanalytics",
                "element_name": "analytics",
                "config-file-path": "../pipelines/person_detect/config/config_nvdsanalytics.txt"
            }
        ]
    },
    "PigCare v1.0": {
        "constant": {
            "MAX_CHANNEL": 16,
            "OUTPUT_WIDTH": 1920,
            "OUTPUT_HEIGHT": 1080
        },
        "config-classes-path" : "../pipelines/pigcare/models/Primary_Detector/labels.txt",
        "elements": [
            {
                "element_type": "nvinfer",
                "element_name": "pgie_pigcare_detector",
                "config-file-path": "../pipelines/pigcare/config/config_infer_primary.txt",
                "class_type": "pigcare"
            },
            {
                "element_type": "nvtracker",
                "element_name": "tracker",
                "config-file-path": "../pipelines/pigcare/config/dstest2_tracker_config.txt"
            },
            {
                "element_type": "nvdsanalytics",
                "element_name": "analytics",
                "config-file-path": "../pipelines/pigcare/config/config_nvdsanalytics.txt"
            }
        ]
    },
    "UniCare v1.0": {
        "constant": {
            "MAX_CHANNEL": 16,
            "OUTPUT_WIDTH": 1920,
            "OUTPUT_HEIGHT": 1080
        },
        "config-classes-path" : "../pipelines/unicare/models/Primary_Detector/labels.txt",
        "elements": [
            {
                "element_type": "nvinfer",
                "element_name": "pgie_unicare_detector",
                "config-file-path": "../pipelines/unicare/config/config_infer_primary.txt",
                "class_type": "pigcare"
            },
            {
                "element_type": "nvtracker",
                "element_name": "tracker",
                "config-file-path": "../pipelines/unicare/config/dstest2_tracker_config.txt"
            },
            {
                "element_type": "nvdsanalytics",
                "element_name": "analytics",
                "config-file-path": "../pipelines/unicare/config/config_nvdsanalytics.txt"
            }
        ]
    },
    "Sorest v1.0": {
        "constant": {
            "MAX_CHANNEL": 16,
            "OUTPUT_WIDTH": 1920,
            "OUTPUT_HEIGHT": 1080
        },
        "config-classes-path" : "../pipelines/sorest/models/Primary_Detector/labels.txt",
        "elements": [
            {
                "element_type": "nvinfer",
                "element_name": "pgie_sorest_detector",
                "config-file-path": "../pipelines/sorest/config/config_infer_primary.txt",
                "class_type": "sorest"
            },
            {
                "element_type": "nvtracker",
                "element_name": "tracker",
                "config-file-path": "../pipelines/sorest/config/dstest2_tracker_config.txt"
            }
        ]
    }
}
