{
    "GET/": {
        "view": "index",
        "controler": "index"
    },
    "GET/client":{
        "view": "client",
        "controler": "req",
        "url": "http://localhost:8080/API/client/"
    },
    "GET/materiel/client":{
        "view": "materiel",
        "controler": "reqId",
        "url": "http://localhost:8080/API/materiel/client/"
    }
}