initial config is q0: *1*1 11
step 0: q0: *1*1 11
step 1: q0: 1*1* 11
step 2: q0: 11*B*11
step 3: q1: 11*B*11
step 4: q1: 11*1*11
step 5: q2: 11*1*11
step 6: q2: 1*1*111
step 7: q2: *1*1111
step 8: q2: *B*11111
step 9: q3: *B*11111
step 10: q3: B*1*1111
step 11: q4: B*B*1111
step 12: q5: BB*1*111
step 13: HALT
'((0 #\1 (#\1) (#\space #\1 #\1)) (0 #\space (#\1 #\1) (#\1 #\1)) (1 #\B (#\1 #\1) (#\1 #\1)) (1 #\1 (#\1 #\1) (#\1 #\1)) (2 #\1 (#\1 #\1) (#\1 #\1)) (2 #\1 (#\1) (#\1 #\1 #\1)) (2 #\1 () (#\1 #\1 #\1 #\1)) (2 #\B () (#\1 #\1 #\1 #\1 #\1)) (3 #\B () (#\1 #\1 #\1 #\1 #\1)) (3 #\1 (#\B) (#\1 #\1 #\1 #\1)) (4 #\B (#\B) (#\1 #\1 #\1 #\1)) (5 #\1 (#\B #\B) (#\1 #\1 #\1)) ())
