initial config is q0: *1*1
step 0: q0: *1*1
step 1: q0: 1*1*
step 2: q0: 11*B*
step 3: q1: 11*1*
step 4: q1: 1*1*1
step 5: q1: *1*11
step 6: q1: *B*111
step 7: q2: B*1*11
step 8: HALT
'((0 #\1 (#\1) ()) (0 #\B (#\1 #\1) ()) (1 #\1 (#\1 #\1) ()) (1 #\1 (#\1) (#\1)) (1 #\1 () (#\1 #\1)) (1 #\B () (#\1 #\1 #\1)) (2 #\1 (#\B) (#\1 #\1)) ())
