graph {
	q0 -- [label="7",weight="7"];
	a -- c[label="9",weight="9"];
	a -- f[label="14",weight="14"];
	b -- c[label="10",weight="10"];
	b -- d[label="15",weight="15"];
	c -- d[label="11",weight="11"];
	c -- f[label="2",weight="2"];
	d -- e[label="6",weight="6"];
	f -- e[label="9",weight="9"];
	}