initial config is q0: *1*111
step 0: q0: *1*111
step 1: q1: 1*1*11
step 2: q2: 1*B*11
step 3: q3: *1*B11
step 4: q4: *B*B11
step 5: q5: B*B*11
step 6: q0: BB*1*1
step 7: q1: BB1*1*
step 8: q2: BB1*B*
step 9: q3: BB*1*B
step 10: q4: BB*B*B
step 11: q5: BBB*B*
step 12: q0: BBBB*B*
step 13: q100: BBBB*B*
step 14: HALT
'((1 #\1 (#\1) (#\1 #\1)) (2 #\B (#\1) (#\1 #\1)) (3 #\1 () (#\B #\1 #\1)) (4 #\B () (#\B #\1 #\1)) (5 #\B (#\B) (#\1 #\1)) (0 #\1 (#\B #\B) (#\1)) (1 #\1 (#\B #\B #\1) ()) (2 #\B (#\B #\B #\1) ()) (3 #\1 (#\B #\B) (#\B)) (4 #\B (#\B #\B) (#\B)) (5 #\B (#\B #\B #\B) ()) (0 #\B (#\B #\B #\B #\B) ()) (100 #\B (#\B #\B #\B #\B) ()) ())
