date      dist
1991.663  8.95  
1968.800  8.90  
1967.800  8.35  
1965.408  8.35  
1964.701  8.34  
1964.625  8.31  
1962.441  8.31  
1961.540  8.28   
1961.128  8.24   
1960.616  8.21  
1935.397  8.13  
1931.822  7.98  
1928.693  7.93  
1928.518  7.90  
1925.449  7.89  
1924.518  7.76   
1923.559  7.69  
1901.595  7.61 
1901.537  7.60   
1901.573  7.605 
1901.403  7.54   
1900.326  7.51  
1900.323  7.50  
1899.400  7.43   
1899.233  7.42  
1899.326  7.40   
1898.548  7.48 
1898.458  7.33   
1898.463  7.25  
1898.444  7.235  
1894.679  7.21  
1893.175  7.17  
1891.507  7.17  
1890.778  7.09   
1886.660  7.085   
1898.444  7.235  
1883.701  7.06  
1883.663  7.06   
1874.444  7.05  
1874.236  6.97  
1872.236  6.88   
1869.159  6.75   
1868.203  6.50  
1864.658  6.40   
1862.288  6.38   
1859.189 5.94    
1857.208 5.94 
