// bean_partition.asy
size(1.5cm,0);
import ibl;

filldraw(bean,fillpen=color_base);
path p1 = (-1,1.7){dir(-10)}..(2,1.75);
draw(p1,dotted);
path p2 = (-1,0.2){dir(20)}..(2,0.25);
draw(p2,dotted);
path p3 = point(p1,0.458){dir(-110)}..point(p2,0.472);
draw(p3,dotted);
clip(bean);

// label("{\tiny $P_0$}",0.5*(bean2+bean5)-(0.03,0.10));            
// label("{\tiny $P_1$}",bean1+(-0.07,0.09));            
// label("{\tiny $P_2$}",0.5*(bean1+bean4)+(0.16,0.01));            
// label("{\tiny $P_3$}",0.5*(bean0+bean3)+(0.01,0.13));            
picture P0_box=new picture;
label(P0_box,"{$P_0$}",0.5*(bean2+bean5)-(0.03,0.10));
add(P0_box,filltype=Fill(white));
picture P1_box=new picture;
label(P1_box,"{$P_1$}",bean1+(-0.07,0.09));
add(P1_box,filltype=Fill(white));
picture P2_box=new picture;
label(P2_box,"{$P_2$}",0.5*(bean1+bean4)+(0.16,0.01));
add(P2_box,filltype=Fill(white));
picture P3_box=new picture;
label(P3_box,"{$P_3$}",0.5*(bean0+bean3)+(0.01,0.13));
add(P3_box,filltype=Fill(white));

// dot(bean0,red);
// dot(bean1,red);
// dot(bean2,red);
// dot(bean3,red);
// dot(bean4,red);
// dot(bean5,red);
