size(3cm,2cm);
// Colors from "Still not getting any" by sp613g, https://kuler.adobe.com/#themeID/181115
import ibl;

filldraw(bean,fillpen=color_base);

real r=.1cm;
real label_offset_x=0.12*r, label_offset_y=0.23*r;
label("{$A$}",bean1+(label_offset_x,label_offset_y));            

