book,\title{A Clear Path Forward}\author{A Brown},\maketitle,\chapter{Chapter One},\chapter{Chapter Two},\section{Section One},\section{Section Two},\subsection{Subsection One},\subsection{Subsection Two}
article,\title{A Clear Path Forward}\author{A Brown},\maketitle,\section{Section One},\section{Section Two},\subsection{Subsection One},\subsection{Subsection Two},,
report,\title{A Clear Path Forward}\author{A Brown},\maketitle,\chapter{Chapter One},\chapter{Chapter Two},\section{Section One},\section{Section Two},\subsection{Subsection One},\subsection{Subsection Two}
scrartcl,\title{A Clear Path Forward}\author{A Brown},\maketitle,\part{Part One},\part{Part Two},\section{Section One},\section{Section Two},\subsection{Subsection One},\subsection{Subsection Two}
