%!PS-Adobe-3.0 EPSF-3.0
%%Creator: GIMP PostScript file plug-in V 1.17 by Peter Kirchgessner
%%Title: fielder.eps
%%CreationDate: Sat Sep 23 06:50:14 2023
%%DocumentData: Clean7Bit
%%LanguageLevel: 2
%%Pages: 1
%%BoundingBox: 14 14 277 424
%%EndComments
%%BeginProlog
% Use own dictionary to avoid conflicts
10 dict begin
%%EndProlog
%%Page: 1 1
% Translate for offset
14.173228346456694 14.173228346456694 translate
% Translate to begin of first scanline
0 408.83543240414167 translate
262.42274330441973 -408.83543240414167 scale
% Image geometry
328 511 8
% Transformation matrix
[ 328 0 0 511 0 0 ]
% Strings to hold RGB-samples per scanline
/rstr 328 string def
/gstr 328 string def
/bstr 328 string def
{currentfile /ASCII85Decode filter /RunLengthDecode filter rstr readstring pop}
{currentfile /ASCII85Decode filter /RunLengthDecode filter gstr readstring pop}
{currentfile /ASCII85Decode filter /RunLengthDecode filter bstr readstring pop}
true 3
%%BeginData:        38669 ASCII Bytes
colorimage
jSo;N]km3="'hVJnq$gls6]i:~>
jSo;N]km3="'hVJnq$gls6]i:~>
jSo;N]km3="'hVJnq$gls6]i:~>
kPkYZc%cbo!!7SurIP!"s7$&=~>
kPkYZc%cbo!!7SurIP!"s7$&=~>
kPkYZc%cbo!!7SurIP!"s7$&=~>
l2LhFSMK=-!b0.EJcC<$o)F4~>
l2LhFSMK=-!b0.EJcC<$o)F4~>
l2LhFSMK=-!b0.EJcC<$o)F4~>
li.%]W=@he!_'NkJcC<$o`'F~>
li.%]W=@he!_'NkJcC<$o`'F~>
li.%]W=@he!_'NkJcC<$o`'F~>
m/I+:<o*fW=PA?+JcGECJ,~>
m/I+:<o*fW=PA?+JcGECJ,~>
m/I+:<o*fW=PA?+JcGECJ,~>
mf*=XPhH*<V>,WAJcGKEJ,~>
mf*=XPhH*<V>,WAJcGKEJ,~>
mf*=XPhH*<V>,WAJcGKEJ,~>
n,EF44kK`8?f$A6JcGNFJ,~>
n,EF44kK`8?f$A6JcGNFJ,~>
n,EF44kK`8?f$A6JcGNFJ,~>
nG`L'e,TKWJcC<$q>Ys~>
nG`L'e,TKWJcC<$q>Ys~>
nG`L'e,TKWJcC<$q>Ys~>
nc&U!dJs<Jrdk*#s82hH~>
nc&U!dJs<Jrdk*#s82hH~>
nc&U!dJs<Jrdk*#s82hH~>
o)A]pci=*=rIP!"s8;nI~>
o)A]pci=*=rIP!"s8;nI~>
o)A]pci=*=rIP!"s8;nI~>
o`"skWm1SFPl$%3JcG]KJ,~>
o`"skWm1SFPl$%3JcG]KJ,~>
o`"skWm1SFPl$%3JcG]KJ,~>
o`"ofbQ%[#qgncus8N%K~>
o`"ofbQ%[#qgncus8N%K~>
o`"ofbQ%[#qgncus8N%K~>
p&>$;aoDF;JcC<$rr7K~>
p&>$;aoDF;JcC<$rr7K~>
p&>$;aoDF;JcC<$rr7K~>
pAY0_5fj!+c%5nGs8W+L~>
pAY0_5fj!+c%5nGs8W+L~>
pAY0_5fj!+c%5nGs8W+L~>
p\t9nLWBGr1?jAiJc>`MJ,~>
p\t9nLWBGr1?jAiJc>`MJ,~>
p\t9nLWBGr1?jAiJc>`MJ,~>
p\t63`W-$RpjrHrs*t~>
p\t63`W-$RpjrHrs*t~>
p\t63`W-$RpjrHrs*t~>
q#:B\0#[ejRXtKis*t~>
q#:B\0#[ejRXtKis*t~>
q#:B\0#[ejRXtKis*t~>
q>UKpH,BU^eq*jQs*t~>
q>UKpH,BU^eq*jQs*t~>
q>UKpH,BU^eq*jQs*t~>
q>UHI_>jURrdk*%s*t~>
q>UHI_>jURrdk*%s*t~>
q>UHI_>jURrdk*%s*t~>
q>UGN_#OJ[JcCB&J,~>
q>UGN_#OJ[JcCB&J,~>
q>UGN_#OJ[JcCB&J,~>
qYpQZ^]4C@qgnd#s*t~>
qYpQZ^]4C@qgnd#s*t~>
qYpQZ^]4C@qgnd#s*t~>
qYpPi^An8OJcCE'J,~>
qYpPi^An8OJcCE'J,~>
qYpPi^An8OJcCE'J,~>
qu6]g-GKN]:&';>L&ZZ~>
qu6]g-GKN]:&';>L&ZZ~>
qu6]g-GKN]:&';>L&ZZ~>
qu6Z+]`8&SJcCH(J,~>
qu6Z+]`8&SJcCH(J,~>
qu6Z+]`8&SJcCH(J,~>
r;Qfs9t^N,Lk5S[s*t~>
r;Qfs9t^N,Lk5S[s*t~>
r;Qfs9t^N,Lk5S[s*t~>
r;Qc]]DqsJoR[$ss*t~>
r;Qc]]DqsJoR[$ss*t~>
r;Qc]]DqsJoR[$ss*t~>
r;Qc<])ViPJcCK)J,~>
r;Qc<])ViPJcCK)J,~>
r;Qc<])ViPJcCK)J,~>
r;Qbh])VhdJcCK)J,~>
r;Qbh])VhdJcCK)J,~>
r;Qbh])VhdJcCK)J,~>
r;Qb(])VjIoR[$ts*t~>
r;Qb(])VjIoR[$ts*t~>
r;Qb(])VjIoR[$ts*t~>
rVllf\GuWPJcCN*J,~>
rVllf\GuWPJcCN*J,~>
rVllf\GuWPJcCN*J,~>
rVllH\GuW:JcCN*J,~>
rVllH\GuW:JcCN*J,~>
rVllH\GuW:JcCN*J,~>
rVll"\GuW)JcCN*J,~>
rVll"\GuW)JcCN*J,~>
rVll"\GuW)JcCN*J,~>
rVlkb\GuVjJcCN*J,~>
rVlkb\GuVjJcCN*J,~>
rVlkb\GuVjJcCN*J,~>
rVlkY\GuVRJcCN*J,~>
rVlkY\GuVRJcCN*J,~>
rVlkY\GuVRJcCN*J,~>
rVlkO\GuV:JcCN*J,~>
rVlkO\GuV:JcCN*J,~>
rVlkO\GuV:JcCN*J,~>
rVlkC\GuVPJcCN*J,~>
rVlkC\GuVPJcCN*J,~>
rVlkC\GuVPJcCN*J,~>
rVlk7\GuVhJcCN*J,~>
rVlk7\GuVhJcCN*J,~>
rVlk7\GuVhJcCN*J,~>
rVlk)\GuW'JcCN*J,~>
rVlk)\GuW'JcCN*J,~>
rVlk)\GuW'JcCN*J,~>
rVljj\GuW8JcCN*J,~>
rVljj\GuW8JcCN*J,~>
rVljj\GuW8JcCN*J,~>
rVlj_\GuWGJcCN*J,~>
rVlj_\GuWGJcCN*J,~>
rVlj_\GuWGJcCN*J,~>
rVlk<\GuWTJcCN*J,~>
rVlk<\GuWTJcCN*J,~>
rVlk<\GuWTJcCN*J,~>
rVlkc\GuWiJcCN*J,~>
rVlkc\GuWiJcCN*J,~>
rVlkc\GuWiJcCN*J,~>
rVll+\c;a?q18R$s*t~>
rVll+\c;a?q18R$s*t~>
rVll+\c;a?q18R$s*t~>
rVllC\c;_DJcCK)J,~>
rVllC\c;_DJcCK)J,~>
rVllC\c;_DJcCK)J,~>
rVllX\c;`!JcCK)J,~>
rVllX\c;`!JcCK)J,~>
rVllX\c;`!JcCK)J,~>
rVllk\c;`DJcCK)J,~>
rVllk\c;`DJcCK)J,~>
rVllk\c;`DJcCK)J,~>
r;Qae])ViaJcCK)J,~>
r;Qae])ViaJcCK)J,~>
r;Qae])ViaJcCK)J,~>
r;QbP])Vj$JcCK)J,~>
r;QbP])Vj$JcCK)J,~>
r;QbP])Vj$JcCK)J,~>
r;QcD]Dqq%JcCH(J,~>
r;QcD]Dqq%JcCH(J,~>
r;QcD]Dqq%JcCH(J,~>
r;Qfq;7ur0Lk5S[s*t~>
r;Qfq;7ur0Lk5S[s*t~>
r;Qfq;7ur0Lk5S[s*t~>
qu6Z*]`8&:JcCH(J,~>
qu6Z*]`8&:JcCH(J,~>
qu6Z*]`8&:JcCH(J,~>
qu6]f*52CQc@Q"Ls*t~>
qu6]f*52CQc@Q"Ls*t~>
qu6]f*52CQc@Q"Ls*t~>
qYpPu^&S/sJcCH(J,~>
qYpPu^&S/sJcCH(J,~>
qYpPu^&S/sJcCH(J,~>
qYpTl?bcXB,5d#lL&ZZ~>
qYpTl?bcXB,5d#lL&ZZ~>
qYpTl?bcXB,5d#lL&ZZ~>
q>UHL^]4@UJcCE'J,~>
q>UHL^]4@UJcCE'J,~>
q>UHL^]4@UJcCE'J,~>
q#:>c_#OJ0JcCE'J,~>
q#:>c_#OJ0JcCE'J,~>
q#:>c_#OJ0JcCE'J,~>
q#:Bf9>UZ/`e"/Cs*t~>
q#:Bf9>UZ/`e"/Cs*t~>
q#:Bf9>UZ/`e"/Cs*t~>
p\t6A_>jSsJcCE'J,~>
p\t6A_>jSsJcCE'J,~>
p\t6A_>jSsJcCE'J,~>
pAY,p_uKf^qgnd#s*t~>
pAY,p_uKf^qgnd#s*t~>
pAY,p_uKf^qgnd#s*t~>
pAY0lK#I]iG_,mIs*t~>
pAY0lK#I]iG_,mIs*t~>
pAY0lK#I]iG_,mIs*t~>
p&>'a;oSe;WIb)%s*t~>
p&>'a;oSe;WIb)%s*t~>
p&>'a;oSe;WIb)%s*t~>
o`"sM*6/$Zb^oeHs*t~>
o`"sM*6/$Zb^oeHs*t~>
o`"sM*6/$Zb^oeHs*t~>
oD\g.`rH,(JcCB&J,~>
oD\g.`rH,(JcCB&J,~>
oD\g.`rH,(JcCB&J,~>
o)A]ZaT)?!rIP!$s*t~>
o)A]ZaT)?!rIP!$s*t~>
o)A]ZaT)?!rIP!$s*t~>
o)AaeE68.\K7X&Ss*t~>
o)AaeE68.\K7X&Ss*t~>
o)AaeE68.\K7X&Ss*t~>
nc&XW5g'--Z%;q,s*t~>
nc&XW5g'--Z%;q,s*t~>
nc&XW5g'--Z%;q,s*t~>
nG`L>b5_OjJcC?%J,~>
nG`L>b5_OjJcC?%J,~>
nG`L>b5_OjJcC?%J,~>
n,EBpbQ%Y2JcC?%J,~>
n,EBpbQ%Y2JcC?%J,~>
n,EBpbQ%Y2JcC?%J,~>
n,EFfMTu2%8V-nms*t~>
n,EFfMTu2%8V-nms*t~>
n,EFfMTu2%8V-nms*t~>
mf*=\?dA]PNe.4]s*t~>
mf*=\?dA]PNe.4]s*t~>
mf*=\?dA]PNe.4]s*t~>
mJd4N2:)='Z%;q+s*t~>
mJd4N2:)='Z%;q+s*t~>
mJd4N2:)='Z%;q+s*t~>
m/I(8ci='fJcC<$J,~>
m/I(8ci='fJcC<$J,~>
m/I(8ci='fJcC<$J,~>
li-sod/X1'JcC<$J,~>
li-sod/X1'JcC<$J,~>
li-sod/X1'JcC<$J,~>
li."bPgTO3nU^^ks*t~>
li."bPgTO3nU^^ks*t~>
li."bPgTO3nU^^ks*t~>
lMgn\E7=jg1B)k)JcC6~>
lMgn\E7=jg1B)k)JcC6~>
lMgn\E7=jg1B)k)JcC6~>
l2LeP8_!e@?\/6.rrE(L~>
l2LeP8_!e@?\/6.rrE(L~>
l2LeP8_!e@?\/6.rrE(L~>
kl1\>*7b)i>(Q^)rrE(L~>
kl1\>*7b)i>(Q^)rrE(L~>
kl1\>*7b)i>(Q^)rrE(L~>
kPkP#ec5\IJcC<$!<7Q~>
kPkP#ec5\IJcC<$!<7Q~>
kPkP#ec5\IJcC<$!<7Q~>
k5PFVf)Pe@JcC<$!<7Q~>
k5PFVf)Pe@JcC<$!<7Q~>
k5PFVf)Pe@JcC<$!<7Q~>
k5PJ[JCji%/qO%RrrE(L~>
k5PJ[JCji%/qO%RrrE(L~>
k5PJ[JCji%/qO%RrrE(L~>
jo5AQ;qM'Mrdk*#s*t~>
jo5AQ;qM'Mrdk*#s*t~>
jo5AQ;qM'Mrdk*#s*t~>
jSo89%GCd^Jq<rQrrE(L~>
jSo89%GCd^Jq<rQrrE(L~>
jSo89%GCd^Jq<rQrrE(L~>
j8T+`g&M,uJcC<$!<7Q~>
j8T+`g&M,uJcC<$!<7Q~>
j8T+`g&M,uJcC<$!<7Q~>
j8T/XGME/uVh+l!s8W+L~>
j8T/XGME/uVh+l!s8W+L~>
j8T/XGME/uVh+l!s8W+L~>
ir9&G2;\B8B[6U.s+14Ms*t~>
ir9&G2;\B8B[6U.s+14Ms*t~>
ir9&G2;\B8B[6U.s+14Ms*t~>
iVrndirB3KPf2ebJcC<$rVqB~>
iVrndirB3KPf2ebJcC<$rVqB~>
iVrndirB3KPf2ebJcC<$rVqB~>
iVrrP46QYI30(f9rdk*#s7u\F~>
iVrrP46QYI30(f9rdk*#s7u\F~>
iVrrP46QYI30(f9rdk*#s7u\F~>
i;Weali7/@LqMaFJcC<$p&BO~>
i;Weali7/@LqMaFJcC<$p&BO~>
i;Weali7/@LqMaFJcC<$p&BO~>
i;WiM.e*KA,(d>^qgncus7-,>~>
i;WiM.e*KA,(d>^qgncus7-,>~>
i;WiM.e*KA,(d>^qgncus7-,>~>
hu<\So`,+1I'h]*JcC<$mJh\~>
hu<\So`,+1I'h]*JcC<$mJh\~>
hu<\So`,+1I'h]*JcC<$mJh\~>
hu<`RKDGQN%<J`*pOW?qs69Q6~>
hu<`RKDGQN%<J`*pOW?qs69Q6~>
hu<`RKDGQN%<J`*pOW?qs69Q6~>
hZ!lY_I<rSCoc+[JcC<$jo9i~>
hZ!lY_I<rSCoc+[JcC<$jo9i~>
hZ!lY_I<rSCoc+[JcC<$jo9i~>
g].<NJcC<$iW"E~>
g].<NJcC<$iW"E~>
g].<NJcC<$iW"E~>
JcC<$\c70~>
JcC<$\c70~>
JcC<$\c70~>
JcC<$\c70~>
JcC<$\c70~>
JcC<$\c70~>
JcC<$\c70~>
JcC<$\c70~>
JcC<$\c70~>
JcC<$\c70~>
JcC<$\c70~>
JcC<$\c70~>
JcC<$\c70~>
JcC<$\c70~>
JcC<$\c70~>
JcC<$\c70~>
JcC<$\c70~>
JcC<$\c70~>
])Mj-gr4jEKE$H~>
])Mj-gr4jEKE$H~>
])Mj-gr4jEKE$H~>
^AeH4fs5uF!!)Glrs8VqkM"/*h!+N`s5!^*~>
^AeH4fs5uF!!)Glrs8VqkM"/*h!+N`s5!^*~>
^AeH4fs5uF!!)Glrs8VqkM"/*h!+N`s5!^*~>
_Z'c4eus6+qZ$W,[f6O(c'ilW(ARq6,$fYmf(sstj8XW~>
_Z'c4eus6+qZ$W,[f6O(c'ilW(ARq6,$fYmf(sstj8XW~>
_Z'c4eus6+qZ$W,[f6O(c'ilW(ARq6,$fYmf(sstj8XW~>
`r?/4e>mQ^!!$N>rr_]+KGO"V""oe\oR[&)s*t~>
`r?/4e>mQ^!!$N>rr_]+KGO"V""oe\oR[&)s*t~>
`r?/4e>mQ^!!$N>rr_]+KGO"V""oe\oR[&)s*t~>
b5VS6dAL^K!!)#lrrW)6E9I9(%=un*JcG!7J,~>
b5VS6dAL^K!!)#lrrW)6E9I9(%=un*JcG!7J,~>
b5VS6dAL^K!!)#lrrW)6E9I9(%=un*JcG!7J,~>
cMn"7c(eb8!!'"5rrW2F>iPebG27`LlMlA~>
cMn"7c(eb8!!'"5rrW2F>iPebG27`LlMlA~>
cMn"7c(eb8!!'"5rrW2F>iPebG27`LlMlA~>
df0F9b+Dl%!!,Uf_>aPjF5HruN9Gimm/MS~>
df0F9b+Dl%!!,Uf_>aPjF5HruN9Gimm/MS~>
df0F9b+Dl%!!,Uf_>aPjF5HruN9Gimm/MS~>
f)Gj;a.$#g!!(QerrM>?g].BbT^m[6mf.e~>
f)Gj;a.$#g!!(QerrM>?g].BbT^m[6mf.e~>
f)Gj;a.$#g!!(QerrM>?g].BbT^m[6mf.e~>
g]%ETk/<QYhuEbB`;]kb0%g4*;<*6-n,In~>
g]%ETk/<QYhuEbB`;]kb0%g4*;<*6-n,In~>
g]%ETk/<QYhuEbB`;]kb0%g4*;<*6-n,In~>
g]%<P:#,dM-MGL[!WKCU!!+RoJcG6>J,~>
g]%<P:#,dM-MGL[!WKCU!!+RoJcG6>J,~>
g]%<P:#,dM-MGL[!WKCU!!+RoJcG6>J,~>
gA_/Tg].>qaSu;9Oja:2Z2T=So)F4~>
gA_/Tg].>qaSu;9Oja:2Z2T=So)F4~>
gA_/Tg].>qaSu;9Oja:2Z2T=So)F4~>
gA_07g].>(ao;D0D:&=aOSFD,oDa=~>
gA_07g].>(ao;D0D:&=aOSFD,oDa=~>
gA_07g].>(ao;D0D:&=aOSFD,oDa=~>
g&D%eg].?AbPqV08'_/9F8:Ceo`'F~>
g&D%eg].?AbPqV08'_/9F8:Ceo`'F~>
g&D%eg].?AbPqV08'_/9F8:Ceo`'F~>
g&D&cg].>bbl7_<C!?VYPl?76p&BO~>
g&D&cg].>bbl7_<C!?VYPl?76p&BO~>
g&D&cg].>bbl7_<C!?VYPl?76p&BO~>
g&D'@g].=`c2RhDNQV;%["88Ms*t~>
g&D'@g].=`c2RhDNQV;%["88Ms*t~>
g&D'@g].=`c2RhDNQV;%["88Ms*t~>
f`(r*g].?6cMmmJaT)=fJcGHDJ,~>
f`(r*g].?6cMmmJaT)=fJcGHDJ,~>
f`(r*g].?6cMmmJaT)=fJcGHDJ,~>
f`(rpg].>Qci4!ia8c5njFR@*s*t~>
f`(rpg].>Qci4!ia8c5njFR@*s*t~>
f`(rpg].>Qci4!ia8c5njFR@*s*t~>
f`)!I0&6L.7JkL4!TklP!!-*lJcGNFJ,~>
f`)!I0&6L.7JkL4!TklP!!-*lJcGNFJ,~>
f`)!I0&6L.7JkL4!TklP!!-*lJcGNFJ,~>
fDbi?g].?)dJj2s`;fn<JcGNFJ,~>
fDbi?g].?)dJj2s`;fn<JcGNFJ,~>
fDbi?g].?)dJj2s`;fn<JcGNFJ,~>
fDbj'g].>=df0<u_uKf^m=G<5s*t~>
fDbj'g].>=df0<u_uKf^m=G<5s*t~>
fDbj'g].>=df0<u_uKf^m=G<5s*t~>
fDbmM:#,dM,50Od!W?iP!!&I=s7u\F~>
fDbmM:#,dM,50Od!W?iP!!&I=s7u\F~>
fDbmM:#,dM,50Od!W?iP!!&I=s7u\F~>
f)G`Pg].>peGfNk_#OJsJcGTHJ,~>
f)G`Pg].>peGfNk_#OJsJcGTHJ,~>
f)G`Pg].>peGfNk_#OJsJcGTHJ,~>
f)Ga3g].>&ec,[H<l"b9L4TC$s*t~>
f)Ga3g].>&ec,[H<l"b9L4TC$s*t~>
f)Ga3g].>&ec,[H<l"b9L4TC$s*t~>
ec,Vag].?Af)G`a^An8gJcGWIJ,~>
ec,Vag].?Af)G`a^An8gJcGWIJ,~>
ec,Vag].?Af)G`a^An8gJcGWIJ,~>
ec,W_g].>af)G_]^An8%JcGWIJ,~>
ec,W_g].>af)G_]^An8%JcGWIJ,~>
ec,W_g].>af)G_]^An8%JcGWIJ,~>
ec,[>%G_!a@+YDYlFm6!3;\:,r;V9~>
ec,[>%G_!a@+YDYlFm6!3;\:,r;V9~>
ec,[>%G_!a@+YDYlFm6!3;\:,r;V9~>
eGfN&g].?5f`(rb]`8&dJcGZJJ,~>
eGfN&g].?5f`(rb]`8&dJcGZJJ,~>
eGfN&g].?5f`(rb]`8&dJcGZJJ,~>
eGfNmg].>Pf`(qt]`8&1JcGZJJ,~>
eGfNmg].>Pf`(qt]`8&1JcGZJJ,~>
eGfNmg].>Pf`(qt]`8&1JcGZJJ,~>
eGfRE0&6L.6MoL:!:mc&!E8uKs8DtJ~>
eGfRE0&6L.6MoL:!:mc&!E8uKs8DtJ~>
eGfRE0&6L.6MoL:!:mc&!E8uKs8DtJ~>
e,KE;g].?(gA_/o])VikJcG]KJ,~>
e,KE;g].?(gA_/o])VikJcG]KJ,~>
e,KE;g].?(gA_/o])VikJcG]KJ,~>
e,KF$g].>=gA_/7])Vi>JcG]KJ,~>
e,KF$g].>=gA_/7])Vi>JcG]KJ,~>
e,KF$g].>=gA_/7])Vi>JcG]KJ,~>
e,KII:Yc!O,5'^j!+ibB!1AE<rVqB~>
e,KII:Yc!O,5'^j!+ibB!1AE<rVqB~>
e,KII:Yc!O,5'^j!+ibB!1AE<rVqB~>
df0<Lg].>pg]%7/])Vh]JcG]KJ,~>
df0<Lg].>pg]%7/])Vh]JcG]KJ,~>
df0<Lg].>pg]%7/])Vh]JcG]KJ,~>
df0=0g].>%h#@BK\c;_;JcG]KJ,~>
df0=0g].>%h#@BK\c;_;JcG]KJ,~>
df0=0g].>%h#@BK\c;_;JcG]KJ,~>
dJj2_g].?@h>[K@\c;^WJcG]KJ,~>
dJj2_g].?@h>[K@\c;^WJcG]KJ,~>
dJj2_g].?@h>[K@\c;^WJcG]KJ,~>
dJj3\g].>`h>[K2\GuX&JcG`LJ,~>
dJj3\g].>`h>[K2\GuX&JcG`LJ,~>
dJj3\g].>`h>[K2\GuX&JcG`LJ,~>
dJj7:%G_!a@,:h_caa#Ul%/m6s*t~>
dJj7:%G_!a@,:h_caa#Ul%/m6s*t~>
dJj7:%G_!a@,:h_caa#Ul%/m6s*t~>
d/O*#g].?4hZ!Sj\GuWaJcG`LJ,~>
d/O*#g].?4hZ!Sj\GuWaJcG`LJ,~>
d/O*#g].?4hZ!Sj\GuWaJcG`LJ,~>
d/O*ig].>OhZ!Sj\GuWaJcG`LJ,~>
d/O*ig].>OhZ!Sj\GuWaJcG`LJ,~>
d/O*ig].>OhZ!Sj\GuWaJcG`LJ,~>
d/O.A1>Mp26Mo[?!7/1U!9o(7rr7K~>
d/O.A1>Mp26Mo[?!7/1U!9o(7rr7K~>
d/O.A1>Mp26Mo[?!7/1U!9o(7rr7K~>
ci4!8g].?(hu<]4\GuX&JcG`LJ,~>
ci4!8g].?(hu<]4\GuX&JcG`LJ,~>
ci4!8g].?(hu<]4\GuX&JcG`LJ,~>
ci4"!g].><hu<]B\c;^WJcG]KJ,~>
ci4"!g].><hu<]B\c;^WJcG]KJ,~>
ci4"!g].><hu<]B\c;^WJcG]KJ,~>
ci4%E:Yc!O*7*RC!;F&)!+1<WrVqB~>
ci4%E:Yc!O*7*RC!;F&)!+1<WrVqB~>
ci4%E:Yc!O*7*RC!;F&)!+1<WrVqB~>
cMmmIgAh5fi;Wd4])Vh]JcG]KJ,~>
cMmmIgAh5fi;Wd4])Vh]JcG]KJ,~>
cMmmIgAh5fi;Wd4])Vh]JcG]KJ,~>
cMmn,g&M/Sro3qXA\.pBR=YD:s*t~>
cMmn,g&M/Sro3qXA\.pBR=YD:s*t~>
cMmn,g&M/Sro3qXA\.pBR=YD:s*t~>
c2Rc\g&M/?qr@\VOLkJm[XnJWs*t~>
c2Rc\g&M/?qr@\VOLkJm[XnJWs*t~>
c2Rc\g&M/?qr@\VOLkJm[XnJWs*t~>
c2RdXf`2&*pZ2>SaL_EPj+77/s*t~>
c2RdXf`2&*pZ2>SaL_EPj+77/s*t~>
c2RdXf`2&*pZ2>SaL_EPj+77/s*t~>
c2Rh7%G:^^DXlig!:mc&!E8uKs8DtJ~>
c2Rh7%G:^^DXlig!:mc&!E8uKs8DtJ~>
c2Rh7%G:^^DXlig!:mc&!E8uKs8DtJ~>
bl7ZufDkqSl/hpFHG':YVh+mGs*t~>
bl7ZufDkqSl/hpFHG':YVh+mGs*t~>
bl7ZufDkqSl/hpFHG':YVh+mGs*t~>
bl7[ff)Ph:hWFh<]tFCGg6;O;r;Q'_J,~>
bl7[ff)Ph:hWFh<]tFCGg6;O;r;Q'_J,~>
bl7[ff)Ph:hWFh<]tFCGg6;O;r;Q'_J,~>
bl7_=1=lL,-IV)W!:%8u!BBtDrsSSJT79lN%8C`)`U*-pJ,~>
bl7_=1=lL,-IV)W!:%8u!BBtDrsSSJT79lN%8C`)`U*-pJ,~>
bl7_=1=lL,-IV)W!:%8u!BBtDrsSSJT79lN%8C`)`U*-pJ,~>
bPqR5ec5^[_WUq!A\S3FR@4'Vh2NWP!!6`Sr:L#>~>
bPqR5ec5^[_WUq!A\S3FR@4'Vh2NWP!!6`Sr:L#>~>
bPqR5ec5^[_WUq!A\S3FR@4'Vh2NWP!!6`Sr:L#>~>
bPqRre,TNQrosF_^:sXJgRJ3Dm#pl=!F<nAs*t~>
bPqRre,TNQrosF_^:sXJgRJ3Dm#pl=!F<nAs*t~>
bPqRre,TNQrosF_^:sXJgRJ3Dm#pl=!F<nAs*t~>
bPqVA;:GRHS,DRO!W#j5!!%bDrrW/.,45F3R/$FUJ,~>
bPqVA;:GRHS,DRO!W#j5!!%bDrrW/.,45F3R/$FUJ,~>
bPqVA;:GRHS,DRO!W#j5!!%bDrrW/.,45F3R/$FUJ,~>
b5VIFdf9E(q!.kZb/"&XjdlDPm<\'u!GUlps*t~>
b5VIFdf9E(q!.kZb/"&XjdlDPm<\'u!GUlps*t~>
b5VIFdf9E(q!.kZb/"&XjdlDPm<\'u!GUlps*t~>
b5VJ(dJs;go'?;VrG9@O!1KJY!Q[._!!-*iq>Ys~>
b5VJ(dJs;go'?;VrG9@O!1KJY!Q[._!!-*iq>Ys~>
b5VJ(dJs;go'?;VrG9@O!1KJY!Q[._!!-*iq>Ys~>
ao;?YdJs;Qlg+QNf#.Oh,42$&!VDN:!!.-8qYu'~>
ao;?YdJs;Qlg+QNf#.Oh,42$&!VDN:!!.-8qYu'~>
ao;?YdJs;Qlg+QNf#.Oh,42$&!VDN:!!.-8qYu'~>
ao;@Ud/X29i9UCCJAhKgWh9:lfMCQ.!0I'WJ,~>
ao;@Ud/X29i9UCCJAhKgWh9:lfMCQ.!0I'WJ,~>
ao;@Ud/X29i9UCCJAhKgWh9:lfMCQ.!0I'WJ,~>
ao;D3,1-Ak0%K=g!TklP!!-*lU&P/iVr7UUf),Jt~>
ao;D3,1-Ak0%K=g!TklP!!-*lU&P/iVr7UUf),Jt~>
ao;D3,1-Ak0%K=g!TklP!!-*lU&P/iVr7UUf),Jt~>
aSu7;ci=(U`U*U)cH#td0'/f,!T[qP!!-^0r;V9~>
aSu7;ci=(U`U*U)cH#td0'/f,!T[qP!!-^0r;V9~>
aSu7;ci=(U`U*U)cH#td0'/f,!T[qP!!-^0r;V9~>
aSu;1-I2YlZg@\lZH3(HdA$XBrOX'+!!("9s*t~>
aSu;1-I2YlZg@\lZH3(HdA$XBrOX'+!!("9s*t~>
aSu;1-I2YlZg@\lZH3(HdA$XBrOX'+!!("9s*t~>
a8Z.=c2[m;r9jRcrfG;'!4S^&!UbHm!!%0>s*t~>
a8Z.=c2[m;r9jRcrfG;'!4S^&!UbHm!!%0>s*t~>
a8Z.=c2[m;r9jRcrfG;'!4S^&!UbHm!!%0>s*t~>
a8Z228^7;:Mtuf@!VgNV!!&@[rrL;)g&M-ArVqB~>
a8Z228^7;:Mtuf@!VgNV!!&@[rrL;)g&M-ArVqB~>
a8Z228^7;:Mtuf@!VgNV!!&@[rrL;)g&M-ArVqB~>
`r?)!0$XFtG4Y/%!U`b0!!.BAV#LJhQ.Q':_u9Uc~>
`r?)!0$XFtG4Y/%!U`b0!!.BAV#LJhQ.Q':_u9Uc~>
`r?)!0$XFtG4Y/%!U`b0!!.BAV#LJhQ.Q':_u9Uc~>
`W#ti(<um\@-m=]!Uk$U!!/>[V#LJM;qD!LRJm/9~>
`W#ti(<um\@-m=]!Uk$U!!/>[V#LJM;qD!LRJm/9~>
`W#ti(<um\@-m=]!Uk$U!!/>[V#LJM;qD!LRJm/9~>
`;]hXbl@c9j6lpJq39>.!OVj&rrN"teGoSsrVqB~>
`;]hXbl@c9j6lpJq39>.!OVj&rrN"teGoSsrVqB~>
`;]hXbl@c9j6lpJq39>.!OVj&rrN"teGoSsrVqB~>
_uBb]*6nNb1=tso!WKIW!!+RqV#LJYCt&Fb;>pNF~>
_uBb]*6nNb1=tso!WKIW!!+RqV#LJYCt&Fb;>pNF~>
_uBb]*6nNb1=tso!WKIW!!+RqV#LJYCt&Fb;>pNF~>
_Z'Yj36hL)(<GnC!RNIP!!-$YV>gVr^*:u*!<2utJ,~>
_Z'Yj36hL)(<GnC!RNIP!!-$YV>gVr^*:u*!<2utJ,~>
_Z'Yj36hL)(<GnC!RNIP!!-$YV>gVr^*:u*!<2utJ,~>
_>aPt:X&k>[dF(ql&4<s!Y(joV>gSbK@'Z!5lL_5~>
_>aPt:X&k>[dF(ql&4<s!Y(joV>gSbK@'Z!5lL_5~>
_>aPt:X&k>[dF(ql&4<s!Y(joV>gSbK@'Z!5lL_5~>
_#FH'A^(2UU]'T[!ShnV!!/2GV#LJ@5gTK2B)Va[~>
_#FH'A^(2UU]'T[!ShnV!!/2GV#LJ@5gTK2B)Va[~>
_#FH'A^(2UU]'T[!ShnV!!/2GV#LJ@5gTK2B)Va[~>
^]+?-HHcEjO8A8D!rgSVirB+-hk^8Qp6s8,!.k+KJ,~>
^]+?-HHcEjO8A8D!rgSVirB+-hk^8Qp6s8,!.k+KJ,~>
^]+?-HHcEjO8A8D!rgSVirB+-hk^8Qp6s8,!.k+KJ,~>
^Ae61O3IY*HM-Y)!rU&`kPtZ(M:A=#!Spl&!!'/"s*t~>
^Ae61O3IY*HM-Y)!rU&`kPtZ(M:A=#!Spl&!!'/"s*t~>
^Ae61O3IY*HM-Y)!rU&`kPtZ(M:A=#!Spl&!!'/"s*t~>
^&J-3UWic>Aa\j`"7aEj,4>L64.=OjU]1DmY78\U!87>NJ,~>
^&J-3UWic>Aa\j`"7aEj,4>L64.=OjU]1DmY78\U!87>NJ,~>
^&J-3UWic>Aa\j`"7aEj,4>L64.=OjU]1DmY78\U!87>NJ,~>
]Dhl?bl@c?jll^JpsPgc?RGRK"Ys\DWS76CrrMA(b5_Piq>L>D~>
]Dhl?bl@c?jll^JpsPgc?RGRK"Ys\DWS76CrrMA(b5_Piq>L>D~>
]Dhl?bl@c?jll^JpsPgc?RGRK"Ys\DWS76CrrMA(b5_Piq>L>D~>
])MfQ(<um\383Em#PI<8bg5,2pRV<crkU),!!&Das*t~>
])MfQ(<um\383Em#PI<8bg5,2pRV<crkU),!!&Das*t~>
])MfQ(<um\383Em#PI<8bg5,2pRV<crkU),!!&Das*t~>
\c2]^1<ok#*6Wp5q>UKcLr]PrkktI2~>
\c2]^1<ok#*6Wp5q>UKcLr]PrkktI2~>
\c2]^1<ok#*6Wp5q>UKcLr]PrkktI2~>
\GlTi9?dG:]7L"ZrrLP:a8c4*qu;0~>
\GlTi9?dG:]7L"ZrrLP:a8c4*qu;0~>
\GlTi9?dG:]7L"ZrrLP:a8c4*qu;0~>
\,QKq@*JZPVu;2Hs8N,oT#Ug32=(/>J,~>
\,QKq@*JZPVu;2Hs8N,oT#Ug32=(/>J,~>
\,QKq@*JZPVu;2Hs8N,oT#Ug32=(/>J,~>
[f6C"G0L!fPPTk1!T.2&!!(=@s*t~>
[f6C"G0L!fPPTk1!T.2&!!(=@s*t~>
[f6C"G0L!fPPTk1!T.2&!!(=@s*t~>
[Jp:'Mp25&IeJHp!rTA6`W-"9q>Ys~>
[Jp:'Mp25&IeJHp!rTA6`W-"9q>Ys~>
[Jp:'Mp25&IeJHp!rTA6`W-"9q>Ys~>
[/U1)T?R?:C%$fV!U=jI!!/bjq>Ys~>
[/U1)T?R?:C%$fV!U=jI!!/bjq>Ys~>
[/U1)T?R?:C%$fV!U=jI!!/bjq>Ys~>
ZMsp2bl@cCkD9-=`@f+0!5&"*J,~>
ZMsp2bl@cCkD9-=`@f+0!5&"*J,~>
ZMsp2bl@cCkD9-=`@f+0!5&"*J,~>
Z2XjD%F+qS45>bo!V;8h!!,F9pA]X~>
Z2XjD%F+qS45>bo!V;8h!!,F9pA]X~>
Z2XjD%F+qS45>bo!V;8h!!,F9pA]X~>
Yl=aS0$XFt,0l2J!S'c\!!.lFp&BO~>
Yl=aS0$XFt,0l2J!S'c\!!.lFp&BO~>
Yl=aS0$XFt,0l2J!S'c\!!.lFp&BO~>
YQ"X]7Ekf4^6&?qq4kn/![b_^o`'F~>
YQ"X]7Ekf4^6&?qq4kn/![b_^o`'F~>
YQ"X]7Ekf4^6&?qq4kn/![b_^o`'F~>
Y5\Of>g36LX8\sq'E.[qlf?mQcc<c.XeV8BIVrCW(<$7SE9QlmJ,~>
Y5\Of>g36LX8\sq'E.[qlf?mQcc<c.XeV8BIVrCW(<$7SE9QlmJ,~>
Y5\Of>g36LX8\sq'E.[qlf?mQcc<c.XeV8BIVrCW(<$7SE9QlmJ,~>
XoAFmEm4RbQi">n')V@iki(7EbJ_#uW1K3-G\0f.Z2ap.qsj]:~>
XoAFmEm4RbQi">n')V@iki(7EbJ_#uW1K3-G\0f.Z2ap.qsj]:~>
XoAFmEm4RbQi">n')V@iki(7EbJ_#uW1K3-G\0f.Z2ap.qsj]:~>
XT&=rL<T]!K(dLi'E7dtm,d*Ud)a#3Y,%JFJ8npd*2*?5=PWBFJ,~>
XT&=rL<T]!K(dLi'E7dtm,d*Ud)a#3Y,%JFJ8npd*2*?5=PWBFJ,~>
XT&=rL<T]!K(dLi'E7dtm,d*Ud)a#3Y,%JFJ8npd*2*?5=PWBFJ,~>
X8`4uS':ph>(D*OI=6KhH$FRXG'.qKEcH&;DJa3)C2%?nAS#@\?sd8H>Zt63<`N's;,9nZ91_W5
NW9*Jp?qs2~>
X8`4uS':ph>(D*OI=6KhH$FRXG'.qKEcH&;DJa3)C2%?nAS#@\?sd8H>Zt63<`N's;,9nZ91_W5
NW9*Jp?qs2~>
X8`4uS':ph>(D*OI=6KhH$FRXG'.qKEcH&;DJa3)C2%?nAS#@\?sd8H>Zt63<`N's;,9nZ91_W5
NW9*Jp?qs2~>
WrE,!YCQ\Q!!,7.m/MS~>
WrE,!YCQ\Q!!,7.m/MS~>
WrE,!YCQ\Q!!,7.m/MS~>
W;cn8%=nM\!!.]?li2J~>
W;cn8%=nM\!!.]?li2J~>
W;cn8%=nM\!!.]?li2J~>
VuHeG-@l0#!!4@Xrp'N6~>
VuHeG-@l0#!!4@Xrp'N6~>
VuHeG-@l0#!!4@Xrp'N6~>
VZ-\R5_/p?!!-iskl6/~>
VZ-\R5_/p?!!-iskl6/~>
VZ-\R5_/p?!!-iskl6/~>
V>gS\<e17W!!0+rkPp&~>
V>gS\<e17W!!0+rkPp&~>
V>gS\<e17W!!0+rkPp&~>
V#LJbD1M\q!!-$Pjo9i~>
V#LJbD1M\q!!-$Pjo9i~>
V#LJbD1M\q!!-$Pjo9i~>
U]1AgJq3p3!!/>WjSs`~>
U]1AgJq3p3!!/>WjSs`~>
U]1AgJq3p3!!/>WjSs`~>
UAk8kQ[o.K!!,(%ir=N~>
UAk8kQ[o.K!!,(%ir=N~>
UAk8kQ[o.K!!,(%ir=N~>
U&P/mWdt/`!!.Q:iW"E~>
U&P/mWdt/`!!.Q:iW"E~>
U&P/mWdt/`!!.Q:iW"E~>
TDno*JH3Ic!Z\cLi;\<~>
TDno*JH3Ic!Z\cLi;\<~>
TDno*JH3Ic!Z\cLi;\<~>
T)Si:,(Ta3!!-]mhZ&*~>
T)Si:,(Ta3!!-]mhZ&*~>
T)Si:,(Ta3!!-]mhZ&*~>
Sc8`G4+RCN!!/tmh>`!~>
Sc8`G4+RCN!!/tmh>`!~>
Sc8`G4+RCN!!/tmh>`!~>
SGrWQ;h4qi!!,gGg])d~>
SGrWQ;h4qi!!,gGg])d~>
SGrWQ;h4qi!!,gGg])d~>
S,WNXBn69,!!/2RgAc[~>
S,WNXBn69,!!/2RgAc[~>
S,WNXBn69,!!/2RgAc[~>
Rf<E^IXqLD!!+jqf`-I~>
Rf<E^IXqLD!!+jqf`-I~>
Rf<E^IXqLD!!+jqf`-I~>
RK!<aPCW_[!!.?2fDg@~>
RK!<aPCW_[!!.?2fDg@~>
RK!<aPCW_[!!.?2fDg@~>
R/[3cVh"ir!!3qDr7:mu~>
R/[3cVh"ir!!3qDr7:mu~>
R/[3cVh"ir!!3qDr7:mu~>
QN$rrJH41"!FXm9s*t~>
QN$rrJH41"!FXm9s*t~>
QN$rrJH41"!FXm9s*t~>
Q2^m.*.\+A!!/ege,Op~>
Q2^m.*.\+A!!/ege,Op~>
Q2^m.*.\+A!!/ege,Op~>
PlCd;21Yb]!!,U>dJn^~>
PlCd;21Yb]!!,U>dJn^~>
PlCd;21Yb]!!,U>dJn^~>
PQ([F9n<<"!!/#Kd/SU~>
PQ([F9n<<"!!/#Kd/SU~>
PQ([F9n<<"!!/#Kd/SU~>
P5bRN@t=X;!!+^jcMrC~>
P5bRN@t=X;!!+^jcMrC~>
P5bRN@t=X;!!+^jcMrC~>
OoGISCk2TF!!.0+c2W:~>
OoGISCk2TF!!.0+c2W:~>
OoGISCk2TF!!.0+c2W:~>
OT,<PJH4^1!Y)I5bl<1~>
OT,<PJH4^1!Y)I5bl<1~>
OT,<PJH4^1!Y)I5bl<1~>
OT,<PJH4a2!F4O)s*t~>
OT,<PJH4a2!F4O)s*t~>
OT,<PJH4a2!F4O)s*t~>
OT,<PJH4d3!M/u,s*t~>
OT,<PJH4d3!M/u,s*t~>
OT,<PJH4d3!M/u,s*t~>
OT,<PJH4j5!CG2Ss*t~>
OT,<PJH4j5!CG2Ss*t~>
OT,<PJH4j5!CG2Ss*t~>
OT,<PJH4m6!J^*`s*t~>
OT,<PJH4m6!J^*`s*t~>
OT,<PJH4m6!J^*`s*t~>
OT,<PJH4s8!aj1N`W(G~>
OT,<PJH4s8!aj1N`W(G~>
OT,<PJH4s8!aj1N`W(G~>
OT,<PJH5$:!a*PA_uG5~>
OT,<PJH5$:!a*PA_uG5~>
OT,<PJH5$:!a*PA_uG5~>
OT,<PJH50>";YjHanrpSJ,~>
OT,<PJH50>";YjHanrpSJ,~>
OT,<PJH50>";YjHanrpSJ,~>
OT,<PJH5WK%4Y(^FbGmIVm*_KbiJW6s*t~>
OT,<PJH5WK%4Y(^FbGmIVm*_KbiJW6s*t~>
OT,<PJH5WK%4Y(^FbGmIVm*_KbiJW6s*t~>
OT,<POT6%(4]lNKMO's:[(XK)e_K3MnFld`s*t~>
OT,<POT6%(4]lNKMO's:[(XK)e_K3MnFld`s*t~>
OT,<POT6%(4]lNKMO's:[(XK)e_K3MnFld`s*t~>
OT,<PU];#S94E$rOIN,N\\cM:f\biYoD+mUJ,~>
OT,<PU];#S94E$rOIN,N\\cM:f\biYoD+mUJ,~>
OT,<PU];#S94E$rOIN,N\\cM:f\biYoD+mUJ,~>
OT,<PV#UM1M#Vu~>
OT,<PV#UM1M#Vu~>
OT,<PV#UM1M#Vu~>
OT,<PV#UM2M#Vu~>
OT,<PV#UM2M#Vu~>
OT,<PV#UM2M#Vu~>
OT,<PV#UM2M#Vu~>
OT,<PV#UM2M#Vu~>
OT,<PV#UM2M#Vu~>
OT,<PV#UM2M#Vu~>
OT,<PV#UM2M#Vu~>
OT,<PV#UM2M#Vu~>
OT,<PV#UM2M#Vu~>
OT,<PV#UM2M#Vu~>
OT,<PV#UM2M#Vu~>
OT,<PV#UM2M#Vu~>
OT,<PV#UM2M#Vu~>
OT,<PV#UM2M#Vu~>
OT,<PV#UM2M#Vu~>
OT,<PV#UM2M#Vu~>
OT,<PV#UM2M#Vu~>
OT,<PV#UM2M#Vu~>
OT,<PV#UM2M#Vu~>
OT,<PV#UM2M#Vu~>
OT,<PV#UM2M#Vu~>
OT,<PV#UM2M#Vu~>
OT,<PV#UM2M#Vu~>
OT,<PV#UM2M#Vu~>
OT,<PV#UM2M#Vu~>
OT,<PV#UM2M#Vu~>
OT,<PV#UM2M#Vu~>
OT,<PV#UM2M#Vu~>
OT,<PV#UM2M#Vu~>
OT,<PV#UM2M#Vu~>
OT,<PV#UM2M#Vu~>
OT,<PV#UM2M#Vu~>
OT,<PV#UM2M#Vu~>
OT,<PV#UM2M#Vu~>
OT,<PV#UM2M#Vu~>
OT,<PV#UM2M#Vu~>
OT,<PV#UM2M#Vu~>
OT,<PV#UM2M#Vu~>
OT,<PV#UM2M#Vu~>
OT,<PV#UM2M#Vu~>
OT,<PV#UM2M#Vu~>
OT,<PV#UM2M#Vu~>
OT,<PV#UM2M#Vu~>
OT,<PV#UM2M#Vu~>
OT,<PV#UM2M#Vu~>
OT,<PV#UM2M#Vu~>
OT,<PV#UM2M#Vu~>
OT,<PV#UM2M#Vu~>
OT,<PV#UM2M#Vu~>
OT,<PV#UM2M#Vu~>
OT,<PV#UM2M#Vu~>
OT,<PV#UM2M#Vu~>
OT,<PV#UM2M#Vu~>
OT,<PV#UM2M#Vu~>
OT,<PV#UM2M#Vu~>
OT,<PV#UM2M#Vu~>
OT,<PV#UM2M#Vu~>
OT,<PV#UM2M#Vu~>
OT,<PV#UM2M#Vu~>
OT,<PV#UM2M#Vu~>
OT,<PV#UM2M#Vu~>
OT,<PV#UM2M#Vu~>
OT,<PV#UM2M#Vu~>
OT,<PV#UM2M#Vu~>
OT,<PV#UM2M#Vu~>
OT,<PV#UM2M#Vu~>
OT,<PV#UM2M#Vu~>
OT,<PV#UM2M#Vu~>
OT,<PV#UM2M#Vu~>
OT,<PV#UM2M#Vu~>
OT,<PV#UM2M#Vu~>
OT,<PV#UM2M#Vu~>
OT,<PV#UM2M#Vu~>
OT,<PV#UM2M#Vu~>
OT,<PV#UM2M#Vu~>
OT,<PV#UM2M#Vu~>
OT,<PV#UM2M#Vu~>
OT,<PV#UM2M#Vu~>
OT,<PV#UM2M#Vu~>
OT,<PV#UM2M#Vu~>
OT,<PV#UM2M#Vu~>
OT,<PV#UM2M#Vu~>
OT,<PV#UM2M#Vu~>
OT,<PV#UM2M#Vu~>
OT,<PV#UM2M#Vu~>
OT,<PV#UM2M#Vu~>
OT,<PV#UM2M#Vu~>
OT,<PV#UM2M#Vu~>
OT,<PV#UM2M#Vu~>
OT,<PV#UM2M#Vu~>
OT,<PV#UM2M#Vu~>
OT,<PV#UM2M#Vu~>
OT,<PV#UM2M#Vu~>
OT,<PV#UM2M#Vu~>
OT,<PV#UM2M#Vu~>
OT,<PV#UM2M#Vu~>
OT,<PV#UM2M#Vu~>
OT,<PV#UM2M#Vu~>
OT,<PV#UM2M#Vu~>
OT,<PV#UM2M#Vu~>
OT,<PV#UM2M#Vu~>
OT,<PV#UM2M#Vu~>
OT,<PV#UM2M#Vu~>
OT,<PV#UM2M#Vu~>
OT,<PV#UM2M#Vu~>
OT,<PV#UM2M#Vu~>
OT,<PV#UM2M#Vu~>
OT,<PV#UM2M#Vu~>
OT,<PV#UM2M#Vu~>
OT,<PV#UM2M#Vu~>
OT,<PV#UM2M#Vu~>
OT,<PV#UM2M#Vu~>
OT,<PV#UM2M#Vu~>
OT,<PV#UM2M#Vu~>
OT,<PV#UM2M#Vu~>
OT,<PV#UM2M#Vu~>
OT,<PV#UM2M#Vu~>
OT,<PV#UM2M#Vu~>
OT,<PV#UM2M#Vu~>
OT,<PV#UM2M#Vu~>
OT,<PV#UM2M#Vu~>
OT,<PV#UM2M#Vu~>
OT,<PV#UM2M#Vu~>
OT,<PV#UM2M#Vu~>
OT,<PV#UM2M#Vu~>
OT,<PV#UM2M#Vu~>
OT,<PV#UM2M#Vu~>
OT,<PV#UM2M#Vu~>
OT,<PV#UM2M#Vu~>
OT,<PV#UM2M#Vu~>
OT,<PV#UM2M#Vu~>
OT,<PV#UM2M#Vu~>
OT,<PV#UM2M#Vu~>
OT,<PV#UM2M#Vu~>
OT,<PV#UM2M#Vu~>
OT,<PV#UM2M#Vu~>
OT,<PV#UM2M#Vu~>
OT,<PV#UM2M#Vu~>
OT,<PV#UM2M#Vu~>
OT,<PV#UM2M#Vu~>
OT,<PV#UM2M#Vu~>
OT,<PV#UM2M#Vu~>
OT,<PV#UM2M#Vu~>
OT,<PV#UM2M#Vu~>
OT,<PV#UM2M#Vu~>
OT,<PV#UM2M#Vu~>
OT,<PV#UM2M#Vu~>
OT,<PV#UM2M#Vu~>
OT,<PV#UM2M#Vu~>
OT,<PV#UM2M#Vu~>
OT,<PV#UM2M#Vu~>
OT,<PV#UM2M#Vu~>
OT,<PV#UM2M#Vu~>
OT,<PV#UM2M#Vu~>
OT,<PV#UM2M#Vu~>
OT,<PV#UM2M#Vu~>
OT,<PV#UM2M#Vu~>
OT,<PV#UM2M#Vu~>
OT,<PV#UM2M#Vu~>
OT,<PV#UM2M#Vu~>
OT,<PV#UM2M#Vu~>
OT,<PV#UM2M#Vu~>
OT,<PV#UM2M#Vu~>
OT,<PV#UM2M#Vu~>
OT,<PV#UM2M#Vu~>
OT,<PV#UM2M#Vu~>
OT,<PV#UM2M#Vu~>
OT,<PV#UM2M#Vu~>
OT,<PV#UM2M#Vu~>
OT,<PV#UM2M#Vu~>
OT,<PV#UM2M#Vu~>
OT,<PV#UM2M#Vu~>
OT,<PV#UM2M#Vu~>
OT,<PV#UM2M#Vu~>
OT,<PV#UM2M#Vu~>
OT,<PV#UM2M#Vu~>
OT,<PV#UM2M#Vu~>
OT,<PV#UM2M#Vu~>
OT,<PV#UM2M#Vu~>
OT,<PV#UM2M#Vu~>
OT,<PV#UM2M#Vu~>
OT,<PV#UM2M#Vu~>
OT,<PV#UM2M#Vu~>
OT,<PV#UM2M#Vu~>
OT,<PV#UM2M#Vu~>
OT,<PV#UM2M#Vu~>
OT,<PV#UM2M#Vu~>
OT,<PV#UM2M#Vu~>
OT,<PV#UM2M#Vu~>
OT,<PV#UM2M#Vu~>
OT,<PV#UM2M#Vu~>
OT,<PV#UM2M#Vu~>
OT,<PV#UM2M#Vu~>
OT,<PV#UM2M#Vu~>
OT,<PV#UM2M#Vu~>
OT,<PV#UM2M#Vu~>
OT,<PV#UM2M#Vu~>
OT,<PV#UM2M#Vu~>
OT,<PV#UM2M#Vu~>
OT,<PV#UM2M#Vu~>
OT,<PV#UM2M#Vu~>
OT,<PV#UM2M#Vu~>
OT,<PV#UM2M#Vu~>
OT,<PV#UM2M#Vu~>
OT,<PV#UM2M#Vu~>
OT,<PV#UM2M#Vu~>
OT,<PV#UM2M#Vu~>
OT,<PV#UM2M#Vu~>
OT,<PV#UM2M#Vu~>
OT,<PV#UM2M#Vu~>
OT,<PV#UM2M#Vu~>
OT,<PV#UM2M#Vu~>
OT,<PV#UM2M#Vu~>
OT,<PV#UM2M#Vu~>
OT,<PV#UM2M#Vu~>
OT,<PV#UM2M#Vu~>
OT,<PV#UM2M#Vu~>
OT,<PV#UM2M#Vu~>
OT,<PV#UM2M#Vu~>
OT,<PV#UM2M#Vu~>
OT,<PV#UM2M#Vu~>
OT,<PV#UM2M#Vu~>
OT,<PV#UM2M#Vu~>
OT,<PV#UM2M#Vu~>
OT,<PV#UM2M#Vu~>
OT,<PV#UM2M#Vu~>
OT,<PV#UM2M#Vu~>
OT,<PV#UM2M#Vu~>
OT,<PV#UM2M#Vu~>
OT,<PV#UM2M#Vu~>
OT,<PV#UM2M#Vu~>
OT,<PV#UM2M#Vu~>
OT,<PV#UM2M#Vu~>
OT,<PV#UM2M#Vu~>
OT,<PV#UM2M#Vu~>
OT,<PV#UM2M#Vu~>
OT,<PV#UM2M#Vu~>
OT,<PV#UM2M#Vu~>
OT,<PV#UM2M#Vu~>
OT,<PV#UM2M#Vu~>
OT,<PV#UM2M#Vu~>
OT,<PV#UM2M#Vu~>
OT,<PV#UM2M#Vu~>
OT,<PV#UM2M#Vu~>
OT,<PV#UM2M#Vu~>
OT,<PV#UM2M#Vu~>
OT,<PV#UM2M#Vu~>
OT,<PV#UM2M#Vu~>
OT,<PV#UM2M#Vu~>
OT,<PV#UM2M#Vu~>
OT,<PV#UM2M#Vu~>
OT,<PV#UM2M#Vu~>
OT,<PV#UM2M#Vu~>
OT,<PV#UM2M#Vu~>
OT,<PV#UM2M#Vu~>
OT,<PV#UM2M#Vu~>
OT,<PV#UM2M#Vu~>
OT,<PV#UM2M#Vu~>
OT,<PV#UM2M#Vu~>
OT,<PV#UM2M#Vu~>
OT,<PV#UM2M#Vu~>
OT,<PV#UM2M#Vu~>
OT,<PV#UM2M#Vu~>
OT,<PV#UM2M#Vu~>
OT,<PV#UM2M#Vu~>
OT,<PV#UM2M#Vu~>
OT,<PV#UM2M#Vu~>
OT,<PV#UM2M#Vu~>
OT,<PV#UM2M#Vu~>
OT,<PV#UM2M#Vu~>
OT,<PV#UM2M#Vu~>
OT,<PV#UM2M#Vu~>
OT,<PV#UM2M#Vu~>
OT,<PV#UM2M#Vu~>
OT,<PV#UM2M#Vu~>
OT,<PV#UM2M#Vu~>
OT,<PV#UM2M#Vu~>
OT,<PV#UM2M#Vu~>
OT,<PV#UM2M#Vu~>
OT,<PV#UM2M#Vu~>
OT,<PV#UM2M#Vu~>
OT,<PV#UM2M#Vu~>
OT,<PV#UM2M#Vu~>
OT,<PV#UM2M#Vu~>
OT,<PV#UM2M#Vu~>
OT,<PV#UM2M#Vu~>
OT,<PV#UM2M#Vu~>
OT,<PV#UM2M#Vu~>
OT,<PV#UM2M#Vu~>
OT,<PV#UM2M#Vu~>
OT,<PV#UM2M#Vu~>
OT,<PV#UM2M#Vu~>
OT,<PV#UM2M#Vu~>
OT,<PV#UM2M#Vu~>
OT,<PV#UM2M#Vu~>
OT,<PV#UM2M#Vu~>
OT,<PV#UM2M#Vu~>
OT,<PV#UM2M#Vu~>
OT,<PV#UM2M#Vu~>
OT,<PV#UM2M#Vu~>
OT,<PV#UM2M#Vu~>
OT,<PV#UM2M#Vu~>
OT,<PV#UM2M#Vu~>
OT,<PV#UM2M#Vu~>
OT,<PV#UM2M#Vu~>
OT,<PV#UM2M#Vu~>
OT,<PV#UM2M#Vu~>
OT,<PV#UM2M#Vu~>
OT,<JV#UM2M#Vu~>
OT,<JV#UM2M#Vu~>
OT,<JV#UM2M#Vu~>
OT,;gV#UM2M#Vu~>
OT,;gV#UM2M#Vu~>
OT,;gV#UM2M#Vu~>
OoGFRU]:D1M#Vu~>
OoGFRU]:D1M#Vu~>
OoGFRU]:D1M#Vu~>
OoGF5U]:CcM#Vu~>
OoGF5U]:CcM#Vu~>
OoGF5U]:CcM#Vu~>
OoGEiU]:EQqMG6&~>
OoGEiU]:EQqMG6&~>
OoGEiU]:EQqMG6&~>
OoGE;UAt;BM>r)~>
OoGE;UAt;BM>r)~>
OoGE;UAt;BM>r)~>
P5bR^4/2cUP_oEj~>
P5bR^4/2cUP_oEj~>
P5bR^4/2cUP_oEj~>
P5bOHU&Y3DpPT!$~>
P5bOHU&Y3DpPT!$~>
P5bOHU&Y3DpPT!$~>
P5bO)T`>);MZ82~>
P5bO)T`>);MZ82~>
P5bO)T`>);MZ82~>
P5bNYT`>(OMZ82~>
P5bNYT`>(OMZ82~>
P5bNYT`>(OMZ82~>
P5bN"T`>*5oo&j#~>
P5bN"T`>*5oo&j#~>
P5bN"T`>*5oo&j#~>
PQ([Y%A3\$a,BtJ~>
PQ([Y%A3\$a,BtJ~>
PQ([Y%A3\$a,BtJ~>
PQ(X=T)\kDMuS;~>
PQ(X=T)\kDMuS;~>
PQ(X=T)\kDMuS;~>
PQ(WqT)\m$nVmKu~>
PQ(WqT)\m$nVmKu~>
PQ(WqT)\m$nVmKu~>
PQ(WGScAc-N;nD~>
PQ(WGScAc-N;nD~>
PQ(WGScAc-N;nD~>
PQ(VUScAb9N;nD~>
PQ(VUScAb9N;nD~>
PQ(VUScAb9N;nD~>
PlCaOS,`QVNW4M~>
PlCaOS,`QVNW4M~>
PlCaOS,`QVNW4M~>
PlCa1S,`Q%NW4M~>
PlCa1S,`Q%NW4M~>
PlCa1S,`Q%NW4M~>
PlC`bS,`P+NW4M~>
PlC`bS,`P+NW4M~>
PlC`bS,`P+NW4M~>
PlC`0RfEHQNrOV~>
PlC`0RfEHQNrOV~>
PlC`0RfEHQNrOV~>
Q2^m^,+AQ4[>t9;~>
Q2^m^,+AQ4[>t9;~>
Q2^m^,+AQ4[>t9;~>
Q2^jDRK*=sNrOV~>
Q2^jDRK*=sNrOV~>
Q2^jDRK*=sNrOV~>
Q2^j$R/d6JO8j_~>
Q2^j$R/d6JO8j_~>
Q2^j$R/d6JO8j_~>
Q2^iQR/d5jO8j_~>
Q2^iQR/d5jO8j_~>
Q2^iQR/d5jO8j_~>
Q2^hhR/d7grfI/1~>
Q2^hhR/d7grfI/1~>
Q2^hhR/d7grfI/1~>
QN$sUQN.$COT0h~>
QN$sUQN.$COT0h~>
QN$sUQN.$COT0h~>
QN$s9QN.#aOT0h~>
QN$s9QN.#aOT0h~>
QN$s9QN.#aOT0h~>
QN$rkf)Pf2m^<+Uec5_BrK7,1~>
QN$rkf)Pf2m^<+Uec5_BrK7,1~>
QN$rkf)Pf2m^<+Uec5_BrK7,1~>
QN$r<f)Pg/mf*:ReGoU'OoKq~>
QN$r<f)Pg/mf*:ReGoU'OoKq~>
QN$r<f)Pg/mf*:ReGoU'OoKq~>
Qi@*b2:qm0(AdFu!-Zon!25PTJ,~>
Qi@*b2:qm0(AdFu!-Zon!25PTJ,~>
Qi@*b2:qm0(AdFu!-Zon!25PTJ,~>
Qi@'Kf)Penm/I($ec5_6qi^u0~>
Qi@'Kf)Penm/I($ec5_6qi^u0~>
Qi@'Kf)Penm/I($ec5_6qi^u0~>
Qi@',f)PfMm/I(TeGoU"P5g%~>
Qi@',f)PfMm/I(TeGoU"P5g%~>
Qi@',f)PfMm/I(TeGoU"P5g%~>
Qi@&[f)Pfrli-s8ec5]<P5g%~>
Qi@&[f)Pfrli-s8ec5]<P5g%~>
Qi@&[f)Pfrli-s8ec5]<P5g%~>
Qi@&#f)Pg;li-t(ec5_'q31i/~>
Qi@&#f)Pg;li-t(ec5_'q31i/~>
Qi@&#f)Pg;li-t(ec5_'q31i/~>
R/[0[f)Pe>lMgnV(=iHcd$+K[~>
R/[0[f)Pe>lMgnV(=iHcd$+K[~>
R/[0[f)Pe>lMgnV(=iHcd$+K[~>
R/[0@f)Pf1l2La?ec5]4PQ-.~>
R/[0@f)Pf1l2La?ec5]4PQ-.~>
R/[0@f)Pf1l2La?ec5]4PQ-.~>
R/[/tf)Pf]l2Lb,ec5^pp6>T-~>
R/[/tf)Pf]l2Lb,ec5^pp6>T-~>
R/[/tf)Pf]l2Lb,ec5^pp6>T-~>
R/[/Hf)Pg*l2LeX,1Z_ob*;pV~>
R/[/Hf)Pg*l2LeX,1Z_ob*;pV~>
R/[/Hf)Pg*l2LeX,1Z_ob*;pV~>
R/[.Tf)PgEkl1XGec5]+PlH7~>
R/[.Tf)PgEkl1XGec5]+PlH7~>
R/[.Tf)PgEkl1XGec5]+PlH7~>
RK!9Rf)PebkPkP0ec5^do9K?+~>
RK!9Rf)PebkPkP0ec5^do9K?+~>
RK!9Rf)PebkPkP0ec5^do9K?+~>
RK!94f)PfEkPkSY1=cF*`KgIR~>
RK!94f)PfEkPkSY1=cF*`KgIR~>
RK!94f)PfEkPkSY1=cF*`KgIR~>
RK!8ef)Pflk5PFMec5]!Q2c@~>
RK!8ef)Pflk5PFMec5]!Q2c@~>
RK!8ef)Pflk5PFMec5]!Q2c@~>
RK!81f)Pg6k5PG4eGoU<QN)I~>
RK!81f)Pg6k5PG4eGoU<QN)I~>
RK!81f)Pg6k5PG4eGoU<QN)I~>
Rf<Eb*7t5l1B$A8!W,.5!!'d"s*t~>
Rf<Eb*7t5l1B$A8!W,.5!!'d"s*t~>
Rf<Eb*7t5l1B$A8!W,.5!!'d"s*t~>
Rf<BGf)Pf(jSo4Sec5\kQN)I~>
Rf<BGf)Pf(jSo4Sec5\kQN)I~>
Rf<BGf)Pf(jSo4Sec5\kQN)I~>
Rf<B'f)PfWjSo57eGoU8QiDR~>
Rf<B'f)PfWjSo57eGoU8QiDR~>
Rf<B'f)PfWjSo57eGoU8QiDR~>
Rf<ASf)Pg$jSo8Z9@a(C\X3>H~>
Rf<ASf)Pg$jSo8Z9@a(C\X3>H~>
Rf<ASf)Pg$jSo8Z9@a(C\X3>H~>
Rf<@gf)PgAj8T+Yec5\`QiDR~>
Rf<@gf)PgAj8T+Yec5\`QiDR~>
Rf<@gf)PgAj8T+Yec5\`QiDR~>
S,WKYf)PeSir9#9eGoU3R/_[~>
S,WKYf)PeSir9#9eGoU3R/_[~>
S,WKYf)PeSir9#9eGoU3R/_[~>
S,WK<f)Pf>ir9&Y=OmHPZC(ZB~>
S,WK<f)Pf>ir9&Y=OmHPZC(ZB~>
S,WK<f)Pf>ir9&Y=OmHPZC(ZB~>
S,WJnf)PffiVrn]ec5\TR/_[~>
S,WJnf)PffiVrn]ec5\TR/_[~>
S,WJnf)PffiVrn]ec5\TR/_[~>
S,WJ>f)Pg1iVro>eGoU/RK%d~>
S,WJ>f)Pg1iVro>eGoU/RK%d~>
S,WJ>f)Pg1iVro>eGoU/RK%d~>
SGrWf0%^.),5^<u!+XR[!3DUgJ,~>
SGrWf0%^.),5^<u!+XR[!3DUgJ,~>
SGrWf0%^.),5^<u!+XR[!3DUgJ,~>
SGrTOf)Perhu<\bec5_HrL3b:~>
SGrTOf)Perhu<\bec5_HrL3b:~>
SGrTOf)Perhu<\bec5_HrL3b:~>
SGrT0f)PfPhu<]@eGoU*Rf@m~>
SGrT0f)PfPhu<]@eGoU*Rf@m~>
SGrT0f)PfPhu<]@eGoU*Rf@m~>
SGrS]f)PfthZ!Rnec5]GRf@m~>
SGrS]f)PfthZ!Rnec5]GRf@m~>
SGrS]f)PfthZ!Rnec5]GRf@m~>
SGrS#f)Pg=hZ!Shec5_>r1!_:~>
SGrS#f)Pg=hZ!Shec5_>r1!_:~>
SGrS#f)Pg=hZ!Shec5_>r1!_:~>
Sc8]_f)PeDh>[KCeGoU$S,\!~>
Sc8]_f)PeDh>[KCeGoU$S,\!~>
Sc8]_f)PeDh>[KCeGoU$S,\!~>
Sc8]Df)Pf5h#@A"ec5]JS,\!~>
Sc8]Df)Pf5h#@A"ec5]JS,\!~>
Sc8]Df)Pf5h#@A"ec5]JS,\!~>
Sc8]"f)Pf`h#@Akec5\`S,\!~>
Sc8]"f)Pf`h#@Akec5\`S,\!~>
Sc8]"f)Pf`h#@Akec5\`S,\!~>
Sc8\Jf)Pg,h#@EF%FtLZo:5i2~>
Sc8\Jf)Pg,h#@EF%FtLZo:5i2~>
Sc8\Jf)Pg,h#@EF%FtLZo:5i2~>
T)Sij5hH&;%JSWW!//o'!7dV>J,~>
T)Sij5hH&;%JSWW!//o'!7dV>J,~>
T)Sij5hH&;%JSWW!//o'!7dV>J,~>
T)SfUf)PeggA_/oec5]iSH"*~>
T)SfUf)PeggA_/oec5]iSH"*~>
T)SfUf)PeggA_/oec5]iSH"*~>
T)Sf8f)PfHgA_3H*7k/j]:AnO~>
T)Sf8f)PfHgA_3H*7k/j]:AnO~>
T)Sf8f)PfHgA_3H*7k/j]:AnO~>
T)Segf)Pfng&D&3f)PfSSH"*~>
T)Segf)Pfng&D&3f)PfSSH"*~>
T)Segf)Pfng&D&3f)PfSSH"*~>
T)Se2f)Pg8g&D&sf)PfJSH"*~>
T)Se2f)Pg8g&D&sf)PfJSH"*~>
T)Se2f)Pg8g&D&sf)PfJSH"*~>
TDnrf(>&Tf49!q5!V\(r!!'!gs*t~>
TDnrf(>&Tf49!q5!V\(r!!'!gs*t~>
TDnrf(>&Tf49!q5!V\(r!!'!gs*t~>
TDnoJf)Pf,fDbi9fDkoRSH"*~>
TDnoJf)Pf,fDbi9fDkoRSH"*~>
TDnoJf)Pf,fDbi9fDkoRSH"*~>
TDno*f)PfZfDbigfDkoTSH"*~>
TDno*f)PfZfDbigfDkoTSH"*~>
TDno*f)PfZfDbigfDkoTSH"*~>
TDnnUf)Pg&fDbiffDkoXSH"*~>
TDnnUf)Pg&fDbiffDkoXSH"*~>
TDnnUf)Pg&fDbiffDkoXSH"*~>
TDnmgf)PgCfDbicfDko[SH"*~>
TDnmgf)PgCfDbicfDko[SH"*~>
TDnmgf)PgCfDbicfDko[SH"*~>
T`5#\f)PeYf)G``fDko^SH"*~>
T`5#\f)PeYf)G``fDko^SH"*~>
T`5#\f)PeYf)G``fDko^SH"*~>
T`5#?f)PfAf)G`\fDkoaSH"*~>
T`5#?f)PfAf)G`\fDkoaSH"*~>
T`5#?f)PfAf)G`\fDkoaSH"*~>
T`5"jf)Pfif)G`YfDkodSH"*~>
T`5"jf)Pfif)G`YfDkodSH"*~>
T`5"jf)Pfif)G`YfDkodSH"*~>
U&P/[-J&4tjOX>2Ze,6X_OUXV~>
U&P/[-J&4tjOX>2Ze,6X_OUXV~>
U&P/[-J&4tjOX>2Ze,6X_OUXV~>
U&P+Jf)PguqptcIYh/pU`LQsY~>
U&P+Jf)PguqptcIYh/pU`LQsY~>
U&P+Jf)PguqptcIYh/pU`LQsY~>
UAk5?ec5]!ec,WOfDkolSH"*~>
UAk5?ec5]!ec,WOfDkolSH"*~>
UAk5?ec5]!ec,WOfDkolSH"*~>
U]1Ah;q:pKYLWXQWn7:Ob+/K^~>
U]1Ah;q:pKYLWXQWn7:Ob+/K^~>
U]1Ah;q:pKYLWXQWn7:Ob+/K^~>
U]1=peGoTtec,WHfDkorSH"*~>
U]1=peGoTtec,WHfDkorSH"*~>
U]1=peGoTtec,WHfDkorSH"*~>
V#LJX(=`Bbn(%F<UY#PHd%(,d~>
V#LJX(=`Bbn(%F<UY#PHd%(,d~>
V#LJX(=`Bbn(%F<UY#PHd%(,d~>
V>gSqHIVuq;:PUGT@a,Dd[^>f~>
V>gSqHIVuq;:PUGT@a,Dd[^>f~>
V>gSqHIVuq;:PUGT@a,Dd[^>f~>
V>gP:e,TK5eGfN<fDkp%SH"*~>
V>gP:e,TK5eGfN<fDkp%SH"*~>
V>gP:e,TK5eGfN<fDkp%SH"*~>
VZ-\h7FV;;^=</_Qe29<f:;kk~>
VZ-\h7FV;;^=</_Qe29<f:;kk~>
VZ-\h7FV;;^=</_Qe29<f:;kk~>
VZ-Xhdf9C*eGfN4fDkp*SH"*~>
VZ-Xhdf9C*eGfN4fDkp*SH"*~>
VZ-Xhdf9C*eGfN4fDkp*SH"*~>
VuHbSdf9Caq:,EEO4XF4gmnCp~>
VuHbSdf9Caq:,EEO4XF4gmnCp~>
VuHbSdf9Caq:,EEO4XF4gmnCp~>
W;cnrDUSRcF4:-hMV%n/hOOUr~>
W;cnrDUSRcF4:-hMV%n/hOOUr~>
W;cnrDUSRcF4:-hMV%n/hOOUr~>
W;ck4dJs9Oe,KE&fDkp0SH"*~>
W;ck4dJs9Oe,KE&fDkp0SH"*~>
W;ck4dJs9Oe,KE&fDkp0SH"*~>
WW*"g2:;I)hp_T*J_0r&j.-."~>
WW*"g2:;I)hp_T*J_0r&j.-."~>
WW*"g2:;I)hp_T*J_0r&j.-."~>
WW)s_dJs;<rR:cHIFnN"k+)I%~>
WW)s_dJs;<rR:cHIFnN"k+)I%~>
WW)s_dJs;<rR:cHIFnN"k+)I%~>
WrE(Od/X0Fdf0;kfDkp8SH"*~>
WrE(Od/X0Fdf0;kfDkp8SH"*~>
WrE(Od/X0Fdf0;kfDkp8SH"*~>
X8`4t@+##U-L]C_!-6]l!:$*SJ,~>
X8`4t@+##U-L]C_!-6]l!:$*SJ,~>
X8`4t@+##U-L]C_!-6]l!:$*SJ,~>
X8`1.d/X0GdJj2_fDkp<SH"*~>
X8`1.d/X0GdJj2_fDkp<SH"*~>
X8`1.d/X0GdJj2_fDkp<SH"*~>
XT&=f-IMkp2=])o!+sj`!:HBWJ,~>
XT&=f-IMkp2=])o!+sj`!:HBWJ,~>
XT&=f-IMkp2=])o!+sj`!:HBWJ,~>
XT&9Vd/X0\d/O)QfDkp@SH"*~>
XT&9Vd/X0\d/O)QfDkp@SH"*~>
XT&9Vd/X0\d/O)QfDkp@SH"*~>
XoACKd/X2ar6YHD=P*TRo:5i2~>
XoACKd/X2ar6YHD=P*TRo:5i2~>
XoACKd/X2ar6YHD=P*TRo:5i2~>
Y5\Ot;pbRFhp;<&:Y5XIopl&4~>
Y5\Ot;pbRFhp;<&:Y5XIopl&4~>
Y5\Ot;pbRFhp;<&:Y5XIopl&4~>
Y5\L'd/X0=cMml7fDkpGSH"*~>
Y5\L'd/X0=cMml7fDkpGSH"*~>
Y5\L'd/X0=cMml7fDkpGSH"*~>
YQ"Xc(=E0`6M/S'!'Ag5!;W/bJ,~>
YQ"Xc(=E0`6M/S'!'Ag5!;W/bJ,~>
YQ"Xc(=E0`6M/S'!'Ag5!;W/bJ,~>
Yl=b'I*hooa3FVa.bF_$qjd\:~>
Yl=b'I*hooa3FVa.bF_$qjd\:~>
Yl=b'I*hooa3FVa.bF_$qjd\:~>
Yl=^Ed/X2nrltHC(>&TerLEn<~>
Yl=^Ed/X2nrltHC(>&TerLEn<~>
Yl=^Ed/X2nrltHC(>&TerLEn<~>
Z2Xjt7FD/:(?WmA!<1RMS,\!~>
Z2Xjt7FD/:(?WmA!<1RMS,\!~>
Z2Xjt7FD/:(?WmA!<1RMS,\!~>
Z2Xftd/X0Hbl7\@fDkmkS,\!~>
Z2Xftd/X0Hbl7\@fDkmkS,\!~>
Z2Xftd/X0Hbl7\@fDkmkS,\!~>
ZMsp_d/X2EpWWX;qUbcJ17S;o~>
ZMsp_d/X2EpWWX;qUbcJ17S;o~>
ZMsp_d/X2EpWWX;qUbcJ17S;o~>
Zi:((DUAFad*)Fhpt,QH4e)J%~>
Zi:((DUAFad*)Fhpt,QH4e)J%~>
Zi:((DUAFad*)Fhpt,QH4e)J%~>
Zi:$@d/X0%b5VJ8fDknCS,\!~>
Zi:$@d/X0%b5VJ8fDknCS,\!~>
Zi:$@d/X0%b5VJ8fDknCS,\!~>
[/U0r377d--L8hS!;+nD!)]6cJ,~>
[/U0r377d--L8hS!;+nD!)]6cJ,~>
[/U0r377d--L8hS!;+nD!)]6cJ,~>
[/U,kd/X0Sao;A3fDknTS,\!~>
[/U,kd/X0Sao;A3fDknTS,\!~>
[/U,kd/X0Sao;A3fDknTS,\!~>
[Jp6[d/X2SqT8a;nCR^@@%71H~>
[Jp6[d/X2SqT8a;nCR^@@%71H~>
[Jp6[d/X2SqT8a;nCR^@@%71H~>
[f6C*@aP/Uf?!slmaqL>BUf$P~>
[f6C*@aP/Uf?!slmaqL>BUf$P~>
[f6C*@aP/Uf?!slmaqL>BUf$P~>
[f6?9d/X02a8Z/+fDkngS,\!~>
[f6?9d/X02a8Z/+fDkngS,\!~>
[f6?9d/X02a8Z/+fDkngS,\!~>
\,QKq-IMkp2=SZd!9r,9!-=Y0J,~>
\,QKq-IMkp2=SZd!9r,9!-=Y0J,~>
\,QKq-IMkp2=SZd!9r,9!-=Y0J,~>
\,QGbd/X0\`r?&%fDknsS,\!~>
\,QGbd/X0\`r?&%fDknsS,\!~>
\,QGbd/X0\`r?&%fDknsS,\!~>
\GlQVd/X2ar5Sa:jk'P5I[g@f~>
\GlQVd/X2ar5Sa:jk'P5I[g@f~>
\GlQVd/X2ar5Sa:jk'P5I[g@f~>
\c2^*<RCdHho5Tqj4F>3K:Dmk~>
\c2^*<RCdHho5Tqj4F>3K:Dmk~>
\c2^*<RCdHho5Tqj4F>3K:Dmk~>
\c2Z3d/X0=`;]hqfDko,S,\!~>
\c2Z3d/X0=`;]hqfDko,S,\!~>
\c2Z3d/X0=`;]hqfDko,S,\!~>
])Mfo(=E0`6M/4r!8Z9-!0!EIJ,~>
])Mfo(=E0`6M/4r!8Z9-!0!EIJ,~>
])Mfo(=E0`6M/4r!8Z9-!0!EIJ,~>
]Dhp2IF/#pa2@oWgXlK+OIQ9#~>
]Dhp2IF/#pa2@oWgXlK+OIQ9#~>
]Dhp2IF/#pa2@oWgXlK+OIQ9#~>
]DhlQd/X2mrkna9f[p0(Pah]'~>
]DhlQd/X2mrkna9f[p0(Pah]'~>
]DhlQd/X2mrkna9f[p0(Pah]'~>
]`/$*8(%A<(?WL6!7od&!198UJ,~>
]`/$*8(%A<(?WL6!7od&!198UJ,~>
]`/$*8(%A<(?WL6!7od&!198UJ,~>
]`.u+d/X0H_>aMbfDkoAS,\!~>
]`.u+d/X0H_>aMbfDkoAS,\!~>
]`.u+d/X0H_>aMbfDkoAS,\!~>
^&J)jd/X2EpVHk0dF\F!T:>k2~>
^&J)jd/X2EpVHk0dF\F!T:>k2~>
^&J)jd/X2EpVHk0dF\F!T:>k2~>
^Ae64E7"Xcd(oY]cI`*sURV:6~>
^Ae64E7"Xcd(oY]cI`*sURV:6~>
^Ae64E7"Xcd(oY]cI`*sURV:6~>
^Ae2Kd/X0$^]+;XfDkoLS,\!~>
^Ae2Kd/X0$^]+;XfDkoLS,\!~>
^Ae2Kd/X0$^]+;XfDkoLS,\!~>
^]+?)377d--L8GH!6Njn!32OgJ,~>
^]+?)377d--L8GH!6Njn!32OgJ,~>
^]+?)377d--L8GH!6Njn!32OgJ,~>
^]+;"d/X0R^Ae2RfDkoRS,\!~>
^]+;"d/X0R^Ae2RfDkoRS,\!~>
^]+;"d/X0R^Ae2RfDkoRS,\!~>
_#FDfd/X2SqS)t0`7P%iZ((cD~>
_#FDfd/X2SqS)t0`7P%iZ((cD~>
_#FDfd/X2SqS)t0`7P%iZ((cD~>
_>aQ5@aP/Uf=h1a_:S_f[%%)G~>
_>aQ5@aP/Uf=h1a_:S_f[%%)G~>
_>aQ5@aP/Uf=h1a_:S_f[%%)G~>
_>aMEd/X02]`.uGfDko\S,\!~>
_>aMEd/X02]`.uGfDko\S,\!~>
_>aMEd/X02]`.uGfDko\S,\!~>
_Z'Z'-IMkp2=S9Y!5$k`!4n["J,~>
_Z'Z'-IMkp2=S9Y!5$k`!4n["J,~>
_Z'Z'-IMkp2=S9Y!5$k`!4n["J,~>
_Z'Umd/X0\]Dhl@fDkobS,\!~>
_Z'Umd/X0\]Dhl@fDkobS,\!~>
_Z'Umd/X0\]Dhl@fDkobS,\!~>
_uB_ad/X2ar4Dt/[FbHZ^mk@S~>
_uB_ad/X2ar4Dt/[FbHZ^mk@S~>
_uB_ad/X2ar4Dt/[FbHZ^mk@S~>
`;]l5<RCdHhn&gfZIf-W_jg[V~>
`;]l5<RCdHhn&gfZIf-W_jg[V~>
`;]l5<RCdHhn&gfZIf-W_jg[V~>
`;]h>d/X0=\c2Z4fDkojS,\!~>
`;]h>d/X0=\c2Z4fDkojS,\!~>
`;]h>d/X0=\c2Z4fDkojS,\!~>
`W#u%(=E0`6M.hg!3=`P!6CZ0J,~>
`W#u%(=E0`6M.hg!3=`P!6CZ0J,~>
`W#u%(=E0`6M.hg!3=`P!6CZ0J,~>
`r?)=IF/#pa12-LVq:tLbFAN^~>
`r?)=IF/#pa12-LVq:tLbFAN^~>
`r?)=IF/#pa12-LVq:tLbFAN^~>
`r?%\d/X2mrj_t.Ut>YIcC=ia~>
`r?%\d/X2mrj_t.Ut>YIcC=ia~>
`r?%\d/X2mrj_t.Ut>YIcC=ia~>
a8Z258(%A<(?W++!2.sE!7@;9J,~>
a8Z258(%A<(?W++!2.sE!7@;9J,~>
a8Z258(%A<(?W++!2.sE!7@;9J,~>
a8Z.7d/X0H[f6>ufDkp#S,\!~>
a8Z.7d/X0H[f6>ufDkp#S,\!~>
a8Z.7d/X0H[f6>ufDkp#S,\!~>
aSu7ud/X2EpU:)%RFhK>esl\i~>
aSu7ud/X2EpU:)%RFhK>esl\i~>
aSu7ud/X2EpU:)%RFhK>esl\i~>
ao;D?E7"Xcd'`lRQ.Q':fUMnk~>
ao;D?E7"Xcd'`lRQ.Q':fUMnk~>
ao;D?E7"Xcd'`lRQ.Q':fUMnk~>
ao;@Vd/X0$[/U,gfDkp+S,\!~>
ao;@Vd/X0$[/U,gfDkp+S,\!~>
ao;@Vd/X0$[/U,gfDkp+S,\!~>
b5VM4377d-,3uW9!0,V2!8X.EJ,~>
b5VM4377d-,3uW9!0,V2!8X.EJ,~>
b5VM4377d-,3uW9!0,V2!8X.EJ,~>
b5VI.d/X0RZi:#]fDkp/S,\!~>
b5VI.d/X0RZi:#]fDkp/S,\!~>
b5VI.d/X0RZi:#]fDkp/S,\!~>
bPqRrd/X2SqQp2%K\-8)ig]su~>
bPqRrd/X2SqQp2%K\-8)ig]su~>
bPqRrd/X2SqQp2%K\-8)ig]su~>
bl7_@A'k8Vf<YDVJ(O`$jI?1"~>
bl7_@A'k8Vf<YDVJ(O`$jI?1"~>
bl7_@A'k8Vf<YDVJ(O`$jI?1"~>
bl7[Pd/X02Z2XfMfDkp6S,\!~>
bl7[Pd/X02Z2XfMfDkp6S,\!~>
bl7[Pd/X02Z2XfMfDkp6S,\!~>
c2Rh3.ae:t2=RmN!-Qoo!9p!QJ,~>
c2Rh3.ae:t2=RmN!-Qoo!9p!QJ,~>
c2Rh3.ae:t2=RmN!-Qoo!9p!QJ,~>
c2Rd$d/X0\Yl=]BfDkp;S,\!~>
c2Rd$d/X0\Yl=]BfDkp;S,\!~>
c2Rd$d/X0\Yl=]BfDkp;S,\!~>
cMmmmd/X2ar362$C"NCcm@4-+~>
cMmmmd/X2ar362$C"NCcm@4-+~>
cMmmmd/X2ar362$C"NCcm@4-+~>
ci4%@<RCdHhlm%[@b:Y\n!j?-~>
ci4%@<RCdHhlm%[@b:Y\n!j?-~>
ci4%@<RCdHhlm%[@b:Y\n!j?-~>
ci4!Id/X0=Y5\K,fDkpAS,\!~>
ci4!Id/X0=Y5\K,fDkpAS,\!~>
ci4!Id/X0=Y5\K,fDkpAS,\!~>
d/O.0(=E0`6M.G\!)qMM!:u][J,~>
d/O.0(=E0`6M.G\!)qMM!:u][J,~>
d/O.0(=E0`6M.G\!)qMM!:u][J,~>
dJj7HIaJ,qa0#@A9@s4Ep7))4~>
dJj7HIaJ,qa0#@A9@s4Ep7))4~>
dJj7HIaJ,qa0#@A9@s4Ep7))4~>
dJj3qd/X2mriQ2#5hH&:pRD25~>
dJj3qd/X2mriQ2#5hH&:pRD25~>
dJj3qd/X2mriQ2#5hH&:pRD25~>
dJj2fdJs:`jfJI^2:qm/qO@M8~>
dJj2fdJs:`jfJI^2:qm/qO@M8~>
dJj2fdJs:`jfJI^2:qm/qO@M8~>
df0="d/X0HX8`/DfDkpLS,\!~>
df0="d/X0HX8`/DfDkpLS,\!~>
df0="d/X0HX8`/DfDkpLS,\!~>
df0;sdJs;FpT+>G!!*"fs*t~>
df0;sdJs;FpT+>G!!*"fs*t~>
df0;sdJs;FpT+>G!!*"fs*t~>
e,KF;d/X0nX8`1ufDkm\Rf@m~>
e,KF;d/X0nX8`1ufDkm\Rf@m~>
e,KF;d/X0nX8`1ufDkm\Rf@m~>
e,KEodJs9%WrE(rfDkmuRf@m~>
e,KEodJs9%WrE(rfDkmuRf@m~>
e,KEodJs9%WrE(rfDkmuRf@m~>
e,KEDdf9Cml`0sbq:GZI31Bkt~>
e,KEDdf9Cml`0sbq:GZI31Bkt~>
e,KEDdf9Cml`0sbq:GZI31Bkt~>
e,KDXdf9BTWW)tmfDkn<Rf@m~>
e,KDXdf9BTWW)tmfDkn<Rf@m~>
e,KDXdf9BTWW)tmfDkn<Rf@m~>
eGfRK%Fb@Y?i$c%!;4tE!)8p^J,~>
eGfRK%Fb@Y?i$c%!;4tE!)8p^J,~>
eGfRK%Fb@Y?i$c%!;4tE!)8p^J,~>
eGfOEdf9C"W;ckhfDknORf@m~>
eGfOEdf9C"W;ckhfDknORf@m~>
eGfOEdf9C"W;ckhfDknORf@m~>
eGfO>e,TK4VuHbffDknWRf@m~>
eGfO>e,TK4VuHbffDknWRf@m~>
eGfO>e,TK4VuHbffDknWRf@m~>
eGfO8eGoV-n>H9dq:GZICmtBS~>
eGfO8eGoV-n>H9dq:GZICmtBS~>
eGfO8eGoV-n>H9dq:GZICmtBS~>
eGfO?eGoT`V>gNJf`2#2Rf@m~>
eGfO?eGoT`V>gNJf`2#2Rf@m~>
eGfO?eGoT`V>gNJf`2#2Rf@m~>
e,KD*f)Phfr2'Dn>hK)WVOIO8~>
e,KD*f)Phfr2'Dn>hK)WVOIO8~>
e,KD*f)Phfr2'Dn>hK)WVOIO8~>
e,KDhf)Pg.V#LF?f`2#bRf@m~>
e,KDhf)Pg.V#LF?f`2#bRf@m~>
e,KDhf)Pg.V#LF?f`2#bRf@m~>
e,KE9fDkoDU]1=pf`2$#Rf@m~>
e,KE9fDkoDU]1=pf`2$#Rf@m~>
e,KE9fDkoDU]1=pf`2$#Rf@m~>
e,KEhf`2%>oV;Edg=cN-*;5j$J,~>
e,KEhf`2%>oV;Edg=cN-*;5j$J,~>
e,KEhf`2%>oV;Edg=cN-*;5j$J,~>
e,KIA*81Ama.iS7q_Hn+!/d3EJ,~>
e,KIA*81Ama.iS7q_Hn+!/d3EJ,~>
e,KIA*81Ama.iS7q_Hn+!/d3EJ,~>
df0<,gAh8"rh9>lP1os:aI3'Y~>
df0<,gAh8"rh9>lP1os:aI3'Y~>
df0<,gAh8"rh9>lP1os:aI3'Y~>
df0<ng].?aje2VRhV8)31A%"7J,~>
df0<ng].?aje2VRhV8)31A%"7J,~>
df0<ng].?aje2VRhV8)31A%"7J,~>
df0@HDVY9mWh04jMVS74[[@)F~>
df0@HDVY9mWh04jMVS74[[@)F~>
df0@HDVY9mWh04jMVS74[[@)F~>
dJj4%h>dRRpR_BbjPBk;;u)g\J,~>
dJj4%h>dRRpR_BbjPBk;;u)g\J,~>
dJj4%h>dRRpR_BbjPBk;;u)g\J,~>
d/O*/huEceg780CTAKVKbEr6Z~>
d/O*/huEceg780CTAKVKbEr6Z~>
d/O*/huEceg780CTAKVKbEr6Z~>
d/O.9;;hKT[%%'rqJkHo!1T;SJ,~>
d/O.9;;hKT[%%'rqJkHo!1T;SJ,~>
d/O.9;;hKT[%%'rqJkHo!1T;SJ,~>
ci4%.39'u>KDh8=!U`;7!!.NFQN)I~>
ci4%.39'u>KDh8=!U`;7!!.NFQN)I~>
ci4%.39'u>KDh8=!U`;7!!.NFQN)I~>
cMmq"*9@/$D=a.p!S]6g!!-BtQ2c@~>
cMmq"*9@/$D=a.p!S]6g!!-BtQ2c@~>
cMmq"*9@/$D=a.p!S]6g!!-BtQ2c@~>
c2Rgo39L8BK_Lf4!TQu=!!.94PlH7~>
c2Rgo39L8BK_Lf4!TQu=!!.94PlH7~>
c2Rgo39L8BK_Lf4!TQu=!!.94PlH7~>
bl7_0E9R?'S,8HM!Uadg!!/PbPQ-.~>
bl7_0E9R?'S,8HM!Uadg!!/PbPQ-.~>
bl7_0E9R?'S,8HM!Uadg!!/PbPQ-.~>
bPqV>U$Ma[<R-a,!r/oBm/R/P_NFkK~>
bPqV>U$Ma[<R-a,!r/oBm/R/P_NFkK~>
bPqV>U$Ma[<R-a,!r/oBm/R/P_NFkK~>
ao;D'PjeYS.^f)4rrMJMn,NMFZM'C[J,~>
ao;D'PjeYS.^f)4rrMJMn,NMFZM'C[J,~>
ao;D'PjeYS.^f)4rrMJMn,NMFZM'C[J,~>
a8Z5*T0i2N!dqrXMZ3b=Y?LT!!ctpCNrOV~>
a8Z5*T0i2N!dqrXMZ3b=Y?LT!!ctpCNrOV~>
a8Z5*T0i2N!dqrXMZ3b=Y?LT!!ctpCNrOV~>
`W$AGjhQt$AlCj)O0-FiL&VS\ijkb:?lVUQMP.lTMuS;~>
`W$AGjhQt$AlCj)O0-FiL&VS\ijkb:?lVUQMP.lTMuS;~>
`W$AGjhQt$AlCj)O0-FiL&VS\ijkb:?lVUQMP.lTMuS;~>
%%EndData
showpage
%%Trailer
end
%%EOF
