%!PS
%%BoundingBox: -1 -1 86 126 
%%HiResBoundingBox: -0.19925 -0.19925 85.19923 125.19878 
%%Creator: MetaPost 1.208
%%CreationDate: 2011.08.07:1229
%%Pages: 1
%%BeginProlog
%%EndProlog
%%Page: 1 1
 0.6 0.89961 1 setrgbcolor 0.09962
 0 dtransform exch truncate exch idtransform pop setlinewidth [] 0 setdash
 1 setlinecap 1 setlinejoin 10 setmiterlimit
newpath 19.31818 0 moveto
19.31818 124.99953 lineto stroke
newpath 34.77272 0 moveto
34.77272 124.99953 lineto stroke
newpath 50.22726 0 moveto
50.22726 124.99953 lineto stroke
newpath 65.68181 0 moveto
65.68181 124.99953 lineto stroke
newpath 81.13635 0 moveto
81.13635 124.99953 lineto stroke
 0 0.09962 dtransform truncate idtransform setlinewidth pop
newpath 0 34.65627 moveto
84.99998 34.65627 lineto stroke
newpath 0 64.27701 moveto
84.99998 64.27701 lineto stroke
newpath 0 93.89775 moveto
84.99998 93.89775 lineto stroke
newpath 0 123.5185 moveto
84.99998 123.5185 lineto stroke
 0.6 0.6 0.6 setrgbcolor
newpath -0.19925 5.23477 moveto
-0.19925 4.83627 lineto
0.19925 4.83627 lineto
85.19923 4.83627 lineto
85.19923 5.23477 lineto
84.80074 5.23477 lineto
 closepath fill
newpath 3.66438 -0.19925 moveto
4.06288 -0.19925 lineto
4.06288 0.19925 lineto
4.06288 125.19878 lineto
3.66438 125.19878 lineto
3.66438 124.80028 lineto
 closepath fill
 0 0.50197 0 setrgbcolor 0 0.79701
 dtransform truncate idtransform setlinewidth pop 0 setlinecap
newpath 3.86363 123.5185 moveto
4.3794 123.51906 4.89497 123.4993 5.40918 123.45924 curveto
5.92628 123.41896 6.44154 123.3582 6.9545 123.28152 curveto
7.47273 123.20406 7.98843 123.11037 8.50005 122.99716 curveto
9.01996 122.88211 9.53522 122.74701 10.04535 122.59433 curveto
10.56638 122.43839 11.08177 122.26422 11.59091 122.073 curveto
12.11304 121.87689 12.62827 121.66298 13.13646 121.4332 curveto
13.65941 121.19675 14.17465 120.94363 14.68176 120.67491 curveto
15.20523 120.39752 15.71977 120.10367 16.22731 119.79813 curveto
16.75049 119.48317 17.26614 119.15587 17.77263 118.81471 curveto
18.29749 118.4612 18.81227 118.09296 19.31818 117.71283 curveto
19.84305 117.31847 20.35823 116.91138 20.86372 116.49246 curveto
21.38855 116.05753 21.90274 115.60995 22.40904 115.1536 curveto
22.93304 114.68127 23.4485 114.19957 23.95459 113.7081 curveto
24.48041 113.19746 24.99599 112.67639 25.4999 112.14412 curveto
26.02548 111.58894 26.53818 111.02176 27.04546 110.44983 curveto
27.56842 109.86021 28.08566 109.26552 28.591 108.66074 curveto
29.11772 108.03038 29.63138 107.38924 30.1363 106.7413 curveto
30.66039 106.0688 31.17503 105.389 31.68185 104.7034 curveto
32.20564 103.99484 32.72105 103.28012 33.22717 102.55885 curveto
33.75189 101.81107 34.26659 101.0563 34.77272 100.29582 curveto
35.29706 99.50797 35.8122 98.71402 36.31827 97.91432 curveto
36.84216 97.08646 37.35634 96.2525 37.86359 95.41434 curveto
38.3866 94.55013 38.90225 93.68149 39.40913 92.80771 curveto
39.93314 91.90442 40.44774 90.9957 40.95444 90.0826 curveto
41.4779 89.13927 41.99295 88.19127 42.5 87.23901 curveto
43.02344 86.25598 43.53835 85.26843 44.04555 84.27693 curveto
44.56874 83.25417 45.0837 82.2272 45.59085 81.19638 curveto
46.11365 80.13374 46.62814 79.06703 47.1364 77.99734 curveto
47.65842 76.8987 48.17386 75.79692 48.68172 74.69165 curveto
49.20457 73.55376 49.71939 72.41217 50.22726 71.2675 curveto
50.74979 70.08984 51.26495 68.90894 51.77281 67.72487 curveto
52.29497 66.50748 52.80937 65.2868 53.31813 64.06375 curveto
53.83951 62.81036 54.3549 61.55452 54.86368 60.29597 curveto
55.38615 59.00351 55.9016 57.7082 56.40898 56.40974 curveto
56.93109 55.07356 57.44464 53.73405 57.95454 52.39317 curveto
58.47493 51.02469 58.99153 49.65475 59.50009 48.28181 curveto
60.0228 46.8707 60.53699 45.45645 61.0454 44.04012 curveto
61.56636 42.58879 62.08127 41.13528 62.59094 39.67995 curveto
63.11171 38.19298 63.62703 36.7041 64.13626 35.21313 curveto
64.65758 33.68678 65.17253 32.15826 65.68181 30.62785 curveto
66.20293 29.06189 66.71814 27.49396 67.22736 25.92407 curveto
67.74817 24.31848 68.26271 22.71088 68.77267 21.1018 curveto
69.29288 19.46042 69.8083 17.81752 70.31822 16.17291 curveto
70.83931 14.4923 71.35463 12.8099 71.86353 11.12555 curveto
72.38445 9.40137 72.89864 7.67516 73.40909 5.94785 curveto
73.92813 4.19148 74.44331 2.43398 74.95464 0.67535 curveto stroke
showpage
%%EOF
