%!PS
%%BoundingBox: -18 -1 156 56 
%%HiResBoundingBox: -17.46794 -0.19925 155.19922 55.55498 
%%Creator: MetaPost 1.208
%%CreationDate: 2011.08.07:1229
%%Pages: 1
%*Font: ccr7 6.97385 6.97385 61:f9bf76
%%BeginProlog
%%EndProlog
%%Page: 1 1
 0.6 0.89961 1 setrgbcolor 0.09962
 0 dtransform exch truncate exch idtransform pop setlinewidth [] 0 setdash
 1 setlinecap 1 setlinejoin 10 setmiterlimit
newpath 9.45122 0 moveto
9.45122 49.14633 lineto stroke
newpath 17.01219 0 moveto
17.01219 49.14633 lineto stroke
newpath 24.57317 0 moveto
24.57317 49.14633 lineto stroke
newpath 32.13414 0 moveto
32.13414 49.14633 lineto stroke
newpath 39.69511 0 moveto
39.69511 49.14633 lineto stroke
newpath 47.25609 0 moveto
47.25609 49.14633 lineto stroke
newpath 54.81706 0 moveto
54.81706 49.14633 lineto stroke
newpath 62.37804 0 moveto
62.37804 49.14633 lineto stroke
newpath 69.93901 0 moveto
69.93901 49.14633 lineto stroke
newpath 77.49998 0 moveto
77.49998 49.14633 lineto stroke
newpath 85.06096 0 moveto
85.06096 49.14633 lineto stroke
newpath 92.62193 0 moveto
92.62193 49.14633 lineto stroke
newpath 100.1829 0 moveto
100.1829 49.14633 lineto stroke
newpath 107.74388 0 moveto
107.74388 49.14633 lineto stroke
newpath 115.30486 0 moveto
115.30486 49.14633 lineto stroke
newpath 122.86583 0 moveto
122.86583 49.14633 lineto stroke
newpath 130.4268 0 moveto
130.4268 49.14633 lineto stroke
newpath 137.98778 0 moveto
137.98778 49.14633 lineto stroke
newpath 145.54875 0 moveto
145.54875 49.14633 lineto stroke
newpath 153.10973 0 moveto
153.10973 49.14633 lineto stroke
 0 0.09962 dtransform truncate idtransform setlinewidth pop
newpath 0 9.45122 moveto
154.99997 9.45122 lineto stroke
newpath 0 17.01219 moveto
154.99997 17.01219 lineto stroke
newpath 0 24.57317 moveto
154.99997 24.57317 lineto stroke
newpath 0 32.13414 moveto
154.99997 32.13414 lineto stroke
newpath 0 39.69511 moveto
154.99997 39.69511 lineto stroke
newpath 0 47.25609 moveto
154.99997 47.25609 lineto stroke
 0.6 0.6 0.6 setrgbcolor
newpath -0.19925 2.0895 moveto
-0.19925 1.691 lineto
0.19925 1.691 lineto
155.19922 1.691 lineto
155.19922 2.0895 lineto
154.80072 2.0895 lineto
 closepath fill
newpath 1.691 -0.19925 moveto
2.0895 -0.19925 lineto
2.0895 0.19925 lineto
2.0895 49.34558 lineto
1.691 49.34558 lineto
1.691 48.94708 lineto
 closepath fill
 0 0.50197 0 setrgbcolor
newpath 2.28876 47.6546 moveto
1.49173 46.85757 lineto
102.30539 1.49173 lineto
103.10242 2.28876 lineto
 closepath fill
 1 1 1 setrgbcolor
newpath 2.68726 47.25609 moveto
2.68726 47.46747 2.60329 47.67018 2.45381 47.81966 curveto
2.30434 47.96913 2.10162 48.0531 1.89024 48.0531 curveto
1.67886 48.0531 1.47615 47.96913 1.32668 47.81966 curveto
1.1772 47.67018 1.09323 47.46747 1.09323 47.25609 curveto
1.09323 47.04471 1.1772 46.842 1.32668 46.69252 curveto
1.47615 46.54305 1.67886 46.45908 1.89024 46.45908 curveto
2.10162 46.45908 2.30434 46.54305 2.45381 46.69252 curveto
2.60329 46.842 2.68726 47.04471 2.68726 47.25609 curveto closepath fill
 0 0 0 setrgbcolor 0 0.3985 dtransform truncate idtransform setlinewidth pop
newpath 2.68726 47.25609 moveto
2.68726 47.46748 2.60327 47.67018 2.45381 47.81966 curveto
2.30434 47.96912 2.10164 48.0531 1.89024 48.0531 curveto
1.67885 48.0531 1.47615 47.96912 1.32668 47.81966 curveto
1.17722 47.67018 1.09323 47.46748 1.09323 47.25609 curveto
1.09323 47.0447 1.17722 46.842 1.32668 46.69252 curveto
1.47615 46.54306 1.67885 46.45908 1.89024 46.45908 curveto
2.10164 46.45908 2.30434 46.54306 2.45381 46.69252 curveto
2.60327 46.842 2.68726 47.0447 2.68726 47.25609 curveto closepath stroke
 1 1 1 setrgbcolor
newpath 78.297 13.2317 moveto
78.297 13.44308 78.21303 13.6458 78.06355 13.79527 curveto
77.91408 13.94475 77.71136 14.02872 77.49998 14.02872 curveto
77.2886 14.02872 77.08589 13.94475 76.93642 13.79527 curveto
76.78694 13.6458 76.70297 13.44308 76.70297 13.2317 curveto
76.70297 13.02032 76.78694 12.81761 76.93642 12.66814 curveto
77.08589 12.51866 77.2886 12.4347 77.49998 12.4347 curveto
77.71136 12.4347 77.91408 12.51866 78.06355 12.66814 curveto
78.21303 12.81761 78.297 13.02032 78.297 13.2317 curveto closepath fill
 0 0 0 setrgbcolor
newpath 78.297 13.2317 moveto
78.297 13.4431 78.21301 13.6458 78.06355 13.79527 curveto
77.91408 13.94473 77.71138 14.02872 77.49998 14.02872 curveto
77.28859 14.02872 77.08589 13.94473 76.93642 13.79527 curveto
76.78696 13.6458 76.70297 13.4431 76.70297 13.2317 curveto
76.70297 13.02031 76.78696 12.81761 76.93642 12.66814 curveto
77.08589 12.51868 77.28859 12.4347 77.49998 12.4347 curveto
77.71138 12.4347 77.91408 12.51868 78.06355 12.66814 curveto
78.21301 12.81761 78.297 13.02031 78.297 13.2317 curveto closepath stroke
 1 1 1 setrgbcolor
newpath 103.50092 1.89024 moveto
103.50092 2.10162 103.41695 2.30434 103.26747 2.45381 curveto
103.118 2.60329 102.91528 2.68726 102.7039 2.68726 curveto
102.49252 2.68726 102.28981 2.60329 102.14034 2.45381 curveto
101.99086 2.30434 101.90689 2.10162 101.90689 1.89024 curveto
101.90689 1.67886 101.99086 1.47615 102.14034 1.32668 curveto
102.28981 1.1772 102.49252 1.09323 102.7039 1.09323 curveto
102.91528 1.09323 103.118 1.1772 103.26747 1.32668 curveto
103.41695 1.47615 103.50092 1.67886 103.50092 1.89024 curveto closepath fill
 0 0 0 setrgbcolor
newpath 103.50092 1.89024 moveto
103.50092 2.10164 103.41693 2.30434 103.26747 2.45381 curveto
103.118 2.60327 102.9153 2.68726 102.7039 2.68726 curveto
102.49251 2.68726 102.28981 2.60327 102.14034 2.45381 curveto
101.99088 2.30434 101.90689 2.10164 101.90689 1.89024 curveto
101.90689 1.67885 101.99088 1.47615 102.14034 1.32668 curveto
102.28981 1.17722 102.49251 1.09323 102.7039 1.09323 curveto
102.9153 1.09323 103.118 1.17722 103.26747 1.32668 curveto
103.41693 1.47615 103.50092 1.67885 103.50092 1.89024 curveto closepath stroke
-17.46794 50.71208 moveto
(lamp) ccr7 6.97385 fshow
79.59998 15.3317 moveto
(w) ccr7 6.97385 fshow
85.12787 15.3317 moveto
(oman) ccr7 6.97385 fshow
104.8039 3.99023 moveto
(shado) ccr7 6.97385 fshow
124.51959 3.99023 moveto
(w) ccr7 6.97385 fshow
showpage
%%EOF
