%!PS
%%BoundingBox: -28 -1 86 70 
%%HiResBoundingBox: -27.21255 -0.19925 85.19923 69.74469 
%%Creator: MetaPost 1.208
%%CreationDate: 2011.08.07:1229
%%Pages: 1
%*Font: ccr7 6.97385 6.97385 62:d346e8
%*Font: eurm7 6.97385 6.97385 12:8
%%BeginProlog
%%EndProlog
%%Page: 1 1
 0.6 0.89961 1 setrgbcolor 0.09962
 0 dtransform exch truncate exch idtransform pop setlinewidth [] 0 setdash
 1 setlinecap 1 setlinejoin 10 setmiterlimit
newpath 19.31818 0 moveto
19.31818 69.54544 lineto stroke
newpath 34.77272 0 moveto
34.77272 69.54544 lineto stroke
newpath 50.22726 0 moveto
50.22726 69.54544 lineto stroke
newpath 65.68181 0 moveto
65.68181 69.54544 lineto stroke
newpath 81.13635 0 moveto
81.13635 69.54544 lineto stroke
 0 0.09962 dtransform truncate idtransform setlinewidth pop
newpath 0 19.31818 moveto
84.99998 19.31818 lineto stroke
newpath 0 34.77272 moveto
84.99998 34.77272 lineto stroke
newpath 0 50.22726 moveto
84.99998 50.22726 lineto stroke
newpath 0 65.68181 moveto
84.99998 65.68181 lineto stroke
 0.6 0.6 0.6 setrgbcolor
newpath -0.19925 4.06288 moveto
-0.19925 3.66438 lineto
0.19925 3.66438 lineto
85.19923 3.66438 lineto
85.19923 4.06288 lineto
84.80074 4.06288 lineto
 closepath fill
newpath 3.66438 -0.19925 moveto
4.06288 -0.19925 lineto
4.06288 0.19925 lineto
4.06288 69.74469 lineto
3.66438 69.74469 lineto
3.66438 69.34619 lineto
 closepath fill
 0 0.50197 0 setrgbcolor 0 0.79701
 dtransform truncate idtransform setlinewidth pop
newpath 3.86363 3.86363 moveto
81.13635 50.22726 lineto
81.13635 3.86363 lineto
 closepath stroke
 0 0 0 setrgbcolor
newpath 18.86964 12.86708 moveto
20.48798 10.16989 21.36363 7.06203 21.36363 3.86363 curveto stroke
 1 1 1 setrgbcolor
newpath 81.93336 50.22726 moveto
81.93336 50.43864 81.8494 50.64136 81.69992 50.79083 curveto
81.55045 50.9403 81.34773 51.02428 81.13635 51.02428 curveto
80.92497 51.02428 80.72226 50.9403 80.57278 50.79083 curveto
80.42331 50.64136 80.33934 50.43864 80.33934 50.22726 curveto
80.33934 50.01588 80.42331 49.81317 80.57278 49.6637 curveto
80.72226 49.51422 80.92497 49.43025 81.13635 49.43025 curveto
81.34773 49.43025 81.55045 49.51422 81.69992 49.6637 curveto
81.8494 49.81317 81.93336 50.01588 81.93336 50.22726 curveto closepath fill
 0 0 0 setrgbcolor 0 0.3985 dtransform truncate idtransform setlinewidth pop
newpath 81.93336 50.22726 moveto
81.93336 50.43866 81.84938 50.64136 81.69992 50.79083 curveto
81.55045 50.94029 81.34775 51.02428 81.13635 51.02428 curveto
80.92496 51.02428 80.72226 50.94029 80.57278 50.79083 curveto
80.42332 50.64136 80.33934 50.43866 80.33934 50.22726 curveto
80.33934 50.01587 80.42332 49.81317 80.57278 49.6637 curveto
80.72226 49.51424 80.92496 49.43025 81.13635 49.43025 curveto
81.34775 49.43025 81.55045 49.51424 81.69992 49.6637 curveto
81.84938 49.81317 81.93336 50.01587 81.93336 50.22726 curveto closepath stroke
 1 1 1 setrgbcolor
newpath 4.66064 3.86363 moveto
4.66064 4.07501 4.57668 4.27773 4.4272 4.4272 curveto
4.27773 4.57668 4.07501 4.66064 3.86363 4.66064 curveto
3.65225 4.66064 3.44954 4.57668 3.30006 4.4272 curveto
3.15059 4.27773 3.06662 4.07501 3.06662 3.86363 curveto
3.06662 3.65225 3.15059 3.44954 3.30006 3.30006 curveto
3.44954 3.15059 3.65225 3.06662 3.86363 3.06662 curveto
4.07501 3.06662 4.27773 3.15059 4.4272 3.30006 curveto
4.57668 3.44954 4.66064 3.65225 4.66064 3.86363 curveto closepath fill
 0 0 0 setrgbcolor
newpath 4.66064 3.86363 moveto
4.66064 4.07503 4.57666 4.27773 4.4272 4.4272 curveto
4.27773 4.57666 4.07503 4.66064 3.86363 4.66064 curveto
3.65224 4.66064 3.44954 4.57666 3.30006 4.4272 curveto
3.1506 4.27773 3.06662 4.07503 3.06662 3.86363 curveto
3.06662 3.65224 3.1506 3.44954 3.30006 3.30006 curveto
3.44954 3.1506 3.65224 3.06662 3.86363 3.06662 curveto
4.07503 3.06662 4.27773 3.1506 4.4272 3.30006 curveto
4.57666 3.44954 4.66064 3.65224 4.66064 3.86363 curveto closepath stroke
57.69966 52.32726 moveto
(ro) ccr7 6.97385 fshow
65.02637 52.32726 moveto
(c) ccr7 6.97385 fshow
68.35416 52.32726 moveto
(k) ccr7 6.97385 fshow
72.38077 52.32726 moveto
(et) ccr7 6.97385 fshow
-27.21255 5.96362 moveto
(observ) ccr7 6.97385 fshow
-4.91966 5.96362 moveto
(er) ccr7 6.97385 fshow
23.29025 7.48488 moveto
(\022) eurm7 6.97385 fshow
showpage
%%EOF
