%!PS
%%BoundingBox: -1 -1 87 70 
%%HiResBoundingBox: -0.19925 -0.19925 86.6082 69.74469 
%%Creator: MetaPost 1.208
%%CreationDate: 2011.08.07:1229
%%Pages: 1
%*Font: ccr7 6.97385 6.97385 68:c09
%*Font: eurm5 4.98132 4.98132 30:c
%%BeginProlog
%%EndProlog
%%Page: 1 1
 0.6 0.89961 1 setrgbcolor 0.09962
 0 dtransform exch truncate exch idtransform pop setlinewidth [] 0 setdash
 1 setlinecap 1 setlinejoin 10 setmiterlimit
newpath 19.31818 0 moveto
19.31818 69.54544 lineto stroke
newpath 34.77272 0 moveto
34.77272 69.54544 lineto stroke
newpath 50.22726 0 moveto
50.22726 69.54544 lineto stroke
newpath 65.68181 0 moveto
65.68181 69.54544 lineto stroke
newpath 81.13635 0 moveto
81.13635 69.54544 lineto stroke
 0 0.09962 dtransform truncate idtransform setlinewidth pop
newpath 0 19.31818 moveto
84.99998 19.31818 lineto stroke
newpath 0 34.77272 moveto
84.99998 34.77272 lineto stroke
newpath 0 50.22726 moveto
84.99998 50.22726 lineto stroke
newpath 0 65.68181 moveto
84.99998 65.68181 lineto stroke
 0.6 0.6 0.6 setrgbcolor
newpath -0.19925 4.06288 moveto
-0.19925 3.66438 lineto
0.19925 3.66438 lineto
85.19923 3.66438 lineto
85.19923 4.06288 lineto
84.80074 4.06288 lineto
 closepath fill
newpath 3.66438 -0.19925 moveto
4.06288 -0.19925 lineto
4.06288 0.19925 lineto
4.06288 69.74469 lineto
3.66438 69.74469 lineto
3.66438 69.34619 lineto
 closepath fill
 0 0.50197 0 setrgbcolor 0 0.79701
 dtransform truncate idtransform setlinewidth pop 0 setlinecap
newpath 3.86363 3.86363 moveto
65.68181 3.86363 lineto stroke
 0.79701 0 dtransform exch truncate exch idtransform pop setlinewidth
newpath 3.86363 3.86363 moveto
3.86363 50.22726 lineto stroke
 1 1 1 setrgbcolor
newpath 66.47882 3.86363 moveto
66.47882 4.07501 66.39485 4.27773 66.24538 4.4272 curveto
66.0959 4.57668 65.89319 4.66064 65.68181 4.66064 curveto
65.47043 4.66064 65.26772 4.57668 65.11824 4.4272 curveto
64.96877 4.27773 64.8848 4.07501 64.8848 3.86363 curveto
64.8848 3.65225 64.96877 3.44954 65.11824 3.30006 curveto
65.26772 3.15059 65.47043 3.06662 65.68181 3.06662 curveto
65.89319 3.06662 66.0959 3.15059 66.24538 3.30006 curveto
66.39485 3.44954 66.47882 3.65225 66.47882 3.86363 curveto closepath fill
 0 0 0 setrgbcolor 0 0.3985 dtransform truncate idtransform setlinewidth pop
newpath 66.47882 3.86363 moveto
66.47882 4.07503 66.39484 4.27773 66.24538 4.4272 curveto
66.0959 4.57666 65.8932 4.66064 65.68181 4.66064 curveto
65.47041 4.66064 65.26772 4.57666 65.11824 4.4272 curveto
64.96878 4.27773 64.8848 4.07503 64.8848 3.86363 curveto
64.8848 3.65224 64.96878 3.44954 65.11824 3.30006 curveto
65.26772 3.1506 65.47041 3.06662 65.68181 3.06662 curveto
65.8932 3.06662 66.0959 3.1506 66.24538 3.30006 curveto
66.39484 3.44954 66.47882 3.65224 66.47882 3.86363 curveto closepath stroke
 1 1 1 setrgbcolor
newpath 4.66064 50.22726 moveto
4.66064 50.43864 4.57668 50.64136 4.4272 50.79083 curveto
4.27773 50.9403 4.07501 51.02428 3.86363 51.02428 curveto
3.65225 51.02428 3.44954 50.9403 3.30006 50.79083 curveto
3.15059 50.64136 3.06662 50.43864 3.06662 50.22726 curveto
3.06662 50.01588 3.15059 49.81317 3.30006 49.6637 curveto
3.44954 49.51422 3.65225 49.43025 3.86363 49.43025 curveto
4.07501 49.43025 4.27773 49.51422 4.4272 49.6637 curveto
4.57668 49.81317 4.66064 50.01588 4.66064 50.22726 curveto closepath fill
 0 0 0 setrgbcolor
newpath 4.66064 50.22726 moveto
4.66064 50.43866 4.57666 50.64136 4.4272 50.79083 curveto
4.27773 50.94029 4.07503 51.02428 3.86363 51.02428 curveto
3.65224 51.02428 3.44954 50.94029 3.30006 50.79083 curveto
3.1506 50.64136 3.06662 50.43866 3.06662 50.22726 curveto
3.06662 50.01587 3.1506 49.81317 3.30006 49.6637 curveto
3.44954 49.51424 3.65224 49.43025 3.86363 49.43025 curveto
4.07503 49.43025 4.27773 49.51424 4.4272 49.6637 curveto
4.57666 49.81317 4.66064 50.01587 4.66064 50.22726 curveto closepath stroke
67.7818 7.56873 moveto
(ship) ccr7 6.97385 fshow
82.1599 5.96362 moveto
(0) eurm5 4.98132 fshow
5.96362 53.93236 moveto
(ship) ccr7 6.97385 fshow
20.34172 52.32726 moveto
(1) eurm5 4.98132 fshow
showpage
%%EOF
