%!PS
%%BoundingBox: -16 -1 93 86 
%%HiResBoundingBox: -15.01729 -0.19925 92.22218 85.19934 
%%Creator: MetaPost 1.208
%%CreationDate: 2011.08.07:1229
%%Pages: 1
%*Font: ccr7 6.97385 6.97385 61:f9b376
%%BeginProlog
%%EndProlog
%%Page: 1 1
 0.6 0.89961 1 setrgbcolor 0.09962
 0 dtransform exch truncate exch idtransform pop setlinewidth [] 0 setdash
 1 setlinecap 1 setlinejoin 10 setmiterlimit
newpath 10.11906 0 moveto
10.11906 85.00009 lineto stroke
newpath 18.21431 0 moveto
18.21431 85.00009 lineto stroke
newpath 26.30956 0 moveto
26.30956 85.00009 lineto stroke
newpath 34.4048 0 moveto
34.4048 85.00009 lineto stroke
newpath 42.50005 0 moveto
42.50005 85.00009 lineto stroke
newpath 50.59529 0 moveto
50.59529 85.00009 lineto stroke
newpath 58.69054 0 moveto
58.69054 85.00009 lineto stroke
newpath 66.78578 0 moveto
66.78578 85.00009 lineto stroke
newpath 74.88103 0 moveto
74.88103 85.00009 lineto stroke
newpath 82.97627 0 moveto
82.97627 85.00009 lineto stroke
 0 0.09962 dtransform truncate idtransform setlinewidth pop
newpath 0 10.11906 moveto
85.00009 10.11906 lineto stroke
newpath 0 18.21431 moveto
85.00009 18.21431 lineto stroke
newpath 0 26.30956 moveto
85.00009 26.30956 lineto stroke
newpath 0 34.4048 moveto
85.00009 34.4048 lineto stroke
newpath 0 42.50005 moveto
85.00009 42.50005 lineto stroke
newpath 0 50.59529 moveto
85.00009 50.59529 lineto stroke
newpath 0 58.69054 moveto
85.00009 58.69054 lineto stroke
newpath 0 66.78578 moveto
85.00009 66.78578 lineto stroke
newpath 0 74.88103 moveto
85.00009 74.88103 lineto stroke
newpath 0 82.97627 moveto
85.00009 82.97627 lineto stroke
 0.6 0.6 0.6 setrgbcolor
newpath -0.19925 2.22307 moveto
-0.19925 1.82457 lineto
0.19925 1.82457 lineto
85.19934 1.82457 lineto
85.19934 2.22307 lineto
84.80084 2.22307 lineto
 closepath fill
newpath 1.82457 -0.19925 moveto
2.22307 -0.19925 lineto
2.22307 0.19925 lineto
2.22307 85.19934 lineto
1.82457 85.19934 lineto
1.82457 84.80084 lineto
 closepath fill
 0 0.50197 0 setrgbcolor
newpath 2.42233 67.1843 moveto
1.6253 66.38727 lineto
50.19678 1.6253 lineto
50.9938 2.42233 lineto
 closepath fill
 1 1 1 setrgbcolor
newpath 2.82083 66.78578 moveto
2.82083 66.99716 2.73686 67.19987 2.58739 67.34935 curveto
2.43791 67.49883 2.2352 67.5828 2.02382 67.5828 curveto
1.81244 67.5828 1.60973 67.49883 1.46025 67.34935 curveto
1.31078 67.19987 1.2268 66.99716 1.2268 66.78578 curveto
1.2268 66.5744 1.31078 66.37169 1.46025 66.22221 curveto
1.60973 66.07274 1.81244 65.98877 2.02382 65.98877 curveto
2.2352 65.98877 2.43791 66.07274 2.58739 66.22221 curveto
2.73686 66.37169 2.82083 66.5744 2.82083 66.78578 curveto closepath fill
 0 0 0 setrgbcolor 0 0.3985 dtransform truncate idtransform setlinewidth pop
newpath 2.82083 66.78578 moveto
2.82083 66.99718 2.73685 67.19987 2.58739 67.34935 curveto
2.43791 67.49881 2.23521 67.5828 2.02382 67.5828 curveto
1.81242 67.5828 1.60973 67.49881 1.46025 67.34935 curveto
1.31079 67.19987 1.2268 66.99718 1.2268 66.78578 curveto
1.2268 66.57439 1.31079 66.37169 1.46025 66.22221 curveto
1.60973 66.07275 1.81242 65.98877 2.02382 65.98877 curveto
2.23521 65.98877 2.43791 66.07275 2.58739 66.22221 curveto
2.73685 66.37169 2.82083 66.57439 2.82083 66.78578 curveto closepath stroke
 1 1 1 setrgbcolor
newpath 51.3923 2.02382 moveto
51.3923 2.2352 51.30833 2.43791 51.15886 2.58739 curveto
51.00938 2.73686 50.80667 2.82083 50.59529 2.82083 curveto
50.38391 2.82083 50.1812 2.73686 50.03172 2.58739 curveto
49.88225 2.43791 49.79828 2.2352 49.79828 2.02382 curveto
49.79828 1.81244 49.88225 1.60973 50.03172 1.46025 curveto
50.1812 1.31078 50.38391 1.2268 50.59529 1.2268 curveto
50.80667 1.2268 51.00938 1.31078 51.15886 1.46025 curveto
51.30833 1.60973 51.3923 1.81244 51.3923 2.02382 curveto closepath fill
 0 0 0 setrgbcolor
newpath 51.3923 2.02382 moveto
51.3923 2.23521 51.30832 2.43791 51.15886 2.58739 curveto
51.00938 2.73685 50.80669 2.82083 50.59529 2.82083 curveto
50.3839 2.82083 50.1812 2.73685 50.03172 2.58739 curveto
49.88226 2.43791 49.79828 2.23521 49.79828 2.02382 curveto
49.79828 1.81242 49.88226 1.60973 50.03172 1.46025 curveto
50.1812 1.31079 50.3839 1.2268 50.59529 1.2268 curveto
50.80669 1.2268 51.00938 1.31079 51.15886 1.46025 curveto
51.30832 1.60973 51.3923 1.81242 51.3923 2.02382 curveto closepath stroke
4.12381 70.24178 moveto
(ladder) ccr7 6.97385 fshow
28.60501 70.24178 moveto
(top) ccr7 6.97385 fshow
52.69528 4.12381 moveto
(ladder) ccr7 6.97385 fshow
77.17648 4.12381 moveto
(base) ccr7 6.97385 fshow
-15.01729 31.98335 moveto
(w) ccr7 6.97385 fshow
-9.4894 31.98335 moveto
(all) ccr7 6.97385 fshow
showpage
%%EOF
