{
  "type": "service_account",
  "project_id": "rluk-372400",
  "private_key_id": "8d610e0110575873a3098126c1e5bb4d7f7efe30",
  "private_key": "-----BEGIN PRIVATE KEY-----\nMIIEvQIBADANBgkqhkiG9w0BAQEFAASCBKcwggSjAgEAAoIBAQDk4JKvY4N2RJvW\nHwyuII21dWhtn5BYakn3IejT+EyI30ZricTLT+ayqe5vQpFqFsHNw5jKU0IKYU9+\nfGygwZknWGedtNHOnpunSQIOVrYUydjkNMjfSczzp7ELXvSu98FdQ1kx/DNTv3Dy\nGSA+7RiDQHSowzQ4iJTs1H8IurBOeEFdelT9IyJIg54OVQmucvA5zk6CAl2EumaJ\nm1srQjMcojKWogpC+VGFOUDWiKEB+QaHqmJefdMuButgHugcdpMZ7qE6SJkasUyP\nEt+R/9JS2IrNZ16nSdhTHWr4m0kPMkd+CqOq+AngXi0Kyhv1r9lXnH5dyjTri1Wv\nji0GUV5lAgMBAAECggEAGqJhn4Ril4A7bEr3tEm4g+3SRbOEXi2cRuSMziH+cg0d\nikUhgBFfxNnOk+b4uhJE4leJL75JmKCjWhJLp9dvpar9f9Y7diJx9aEi2p1PmhK1\nKTVVTNqvPYl9qleV/Mh7GYnNVupE5NGJ6LpwzLHVoOx+xubUbGHEhtzhnZfwDWlr\nwalPNPtM1k5h5byrpxkscVa8L/60IpL+00dHkrzrB5E8Fz0KvP5317fojxa0xk/Y\n3IQEqJZph/nT00rbHSSrCdIp3/6JxR/TFP7AZ1QsFBchsUyG38BSaFiMoX+xEIxh\nPqRVEGYXnax8c+x3unoROgLZRvicp1H40QJUuQqCYQKBgQD5DFj1KiGY/LBoS07/\nlZWnoR+01IScfIieDNjNV0IrwUYCArEdY0zhldYP0GM5eSwD1vemzAtDGV5a216Y\n0T1vZcy25MOJN3atRW/rgq/8KR9JnwvFAbmzAvL15Pv3/kwhvqQL0b2udf+mjQy0\ntfLaNiuPPmz4IZim3XgGLHFxdQKBgQDrRBZaF12ENQrXO4+eQOp1Eo72XZ8uvKn5\nSOl2nae4qL2He/PydiGoxlwmXdTZCoipdN5l0jkGUyYC/s/no3Ht1CYWgM67rc29\nfMPRquSkl52RqSOfAhWafZEfkAuEryuJqNuZ9J0PlA5lcoOppY3pbURQSeoQdzes\n9VO9XtwrMQKBgE9S2XqtAqqBwYZWhkDt2g7cSQcFsX9OQw1kNiGhK1hYZP368YLU\nwAYR/W5oB1Kk/5nxfEvKLcQfbmgt+wFdk93JZNzUHFu2KLyjozQ2GeuNBYQjflIv\nbIBR7iTX3FFu07zjxchl865/sv/PaT6dvU43dsRXM8oMmVx8qd/9g9yJAoGAeZ2q\nyEuHxg39WqGpbi80g+xiBq0C2pAgdYLhXLXGu8hOoTjMNCwo3iwb+qFKpB+z4ZVO\nWehAHirhXW8HXkC5Zi3iuoM/WvlPf4J9X2ct5n+Rrnh2t33GWSRL3rsBmUdMBE9L\npdwzTJhGkN6PfSTdpSscwzxSSMy39SqkbSIaQiECgYEA1cd0CAoGK93yDrhkPkge\nWD1c6iaEzJm5MgdD7kMU8d8MyJBmMfIoX/moAEWCfwesqnVc7dBi9gCYfp1sPVw7\nXZTGaZju3/VuEP1WALfTBIly7qJfeoZklSMRdBHWBFkzeggUbZWoVRMBytJeKsTr\n64TjAc4tCxg8QNhKnK4R2q4=\n-----END PRIVATE KEY-----\n",
  "client_email": "rluk-srvc@rluk-372400.iam.gserviceaccount.com",
  "client_id": "113580017850624329823",
  "auth_uri": "https://accounts.google.com/o/oauth2/auth",
  "token_uri": "https://oauth2.googleapis.com/token",
  "auth_provider_x509_cert_url": "https://www.googleapis.com/oauth2/v1/certs",
  "client_x509_cert_url": "https://www.googleapis.com/robot/v1/metadata/x509/rluk-srvc%40rluk-372400.iam.gserviceaccount.com"
}
