{
  "person": {
    "name": "KAMIL",
    "age": 24,
    "description": "Lorem ipsum dolor sit amet, consectetur adipisicing elit. Repellendus, non, dolorem, cumque distinctio magni quam expedita velit laborum sunt amet facere tempora ut fuga aliquam ad asperiores voluptatem dolorum! Quasi.",
    "educations": [
      {
        "year": "1990",
        "title": "I was born in Katowice",
        "description": "Lorem ipsum dolor sit amet, consectetur adipisicing elit. Sapiente, exercitationem, totam, dolores iste dolore est aut modi."
      },
      {
        "year": "2005",
        "title": "Secondary school specializing in artistic",
        "description": "Eos, explicabo, nam, tenetur et ab eius deserunt aspernatur ipsum ducimus quibusdam quis voluptatibus."
      },
      {
        "year": "2009",
        "title": "First level graduation in Graphic Design",
        "description": "Aspernatur, mollitia, quos maxime eius suscipit sed beatae ducimus quaerat quibusdam perferendis? Iusto, quibusdam asperiores unde repellat."
      },
      {
        "year": "2012",
        "title": "Second level graduation in Graphic Design",
        "description": "Ducimus, aliquam tempore autem itaque et accusantium!  "
      }
    ]
  }
}
