Update cmakelist.txt

1 job for master in 1 minute and 26 seconds
Status Job ID Name Coverage
  Test
failed #124803352
current_version

00:01:26

 
Name Stage Failure
failed
current_version Test
          ^~~~~~~~~~~~~~~~~~~~~~~~
compilation terminated.
CMakeFiles/EnhancedConsoleText_test.dir/build.make:62: recipe for target 'CMakeFiles/EnhancedConsoleText_test.dir/test.cxx.o' failed
make[2]: *** [CMakeFiles/EnhancedConsoleText_test.dir/test.cxx.o] Error 1
CMakeFiles/Makefile2:104: recipe for target 'CMakeFiles/EnhancedConsoleText_test.dir/all' failed
make[1]: *** [CMakeFiles/EnhancedConsoleText_test.dir/all] Error 2
Makefile:83: recipe for target 'all' failed
make: *** [all] Error 2
ERROR: Job failed: exit code 1