add test target

1 job for master in 1 minute and 5 seconds
Status Job ID Name Coverage
  Test
failed #124797287
current_version

00:01:05

 
Name Stage Failure
failed
current_version Test
 }
^
CMakeFiles/EnhancedConsoleText_test.dir/build.make:62: recipe for target 'CMakeFiles/EnhancedConsoleText_test.dir/test/test.cxx.o' failed
make[2]: *** [CMakeFiles/EnhancedConsoleText_test.dir/test/test.cxx.o] Error 1
CMakeFiles/Makefile2:67: recipe for target 'CMakeFiles/EnhancedConsoleText_test.dir/all' failed
make[1]: *** [CMakeFiles/EnhancedConsoleText_test.dir/all] Error 2
Makefile:83: recipe for target 'all' failed
make: *** [all] Error 2
ERROR: Job failed: exit code 1