{
  "dependencies": {
    "chai": "registry:npm/chai#3.5.0+20160723033700",
    "moment": "registry:npm/moment#2.10.5+20160211003958"
  },
  "globalDependencies": {
    "mocha": "registry:dt/mocha#2.2.5+20170311011848",
    "webix": "registry:dt/webix#3.3.0+20160919061116"
  }
}
