,open,close,high,low
2020-12-01,61.0,62.16,62.5,60.0
2020-12-02,62.24,63.75,64.2,61.61
2020-12-03,63.6,63.99,64.4,63.06
2020-12-04,63.35,63.35,63.87,62.07
2020-12-07,63.35,61.96,64.21,61.77
2020-12-08,61.59,62.1,63.45,61.59
2020-12-09,62.3,60.69,62.74,60.54
2020-12-10,60.72,59.68,61.27,59.1
2020-12-11,59.6,59.08,60.18,58.36
2020-12-14,59.29,59.62,60.18,58.45
2020-12-15,59.3,58.42,59.5,57.78
2020-12-16,58.5,59.56,60.2,58.39
2020-12-17,59.4,60.28,60.48,58.51
2020-12-18,60.02,59.3,60.77,58.91
2020-12-21,58.81,60.2,60.63,58.22
2020-12-22,60.2,57.85,60.3,57.68
2020-12-23,57.6,58.29,58.37,56.63
2020-12-24,58.14,57.69,58.79,57.56
2020-12-25,57.6,56.9,57.6,55.82
2020-12-28,56.3,57.18,57.98,56.27
2020-12-29,57.01,57.27,57.99,57.0
2020-12-30,57.0,56.88,57.36,56.4
2020-12-31,56.95,57.97,58.77,56.9
2021-01-04,58.0,56.49,58.0,56.16
2021-01-05,56.05,54.9,56.05,52.68
2021-01-06,54.86,55.16,55.7,54.16
2021-01-07,55.17,55.41,55.94,54.25
2021-01-08,55.41,55.09,55.88,54.6
2021-01-11,55.06,54.42,55.26,53.88
2021-01-12,54.27,56.61,56.66,53.05
2021-01-13,56.61,55.02,57.07,54.55
2021-01-14,54.88,54.95,55.95,54.27
2021-01-15,55.0,55.92,56.95,54.79
2021-01-18,55.9,55.35,56.15,54.9
2021-01-19,55.69,56.8,57.56,55.36
2021-01-20,56.95,55.25,57.14,55.16
2021-01-21,55.31,54.8,55.45,54.1
2021-01-22,54.66,53.0,54.66,53.0
2021-01-25,53.02,53.2,53.3,52.12
2021-01-26,53.2,50.73,53.2,50.6
2021-01-27,50.62,50.83,51.49,50.6
2021-01-28,50.22,49.79,50.59,49.5
2021-01-29,49.9,48.33,50.05,47.85
2021-02-01,48.5,48.93,49.12,48.16
2021-02-02,48.85,48.46,48.97,47.96
2021-02-03,48.0,47.64,48.59,47.1
2021-02-04,48.16,47.94,48.6,47.03
2021-02-05,47.7,48.66,49.31,47.15
2021-02-08,48.45,47.2,48.98,47.13
2021-02-09,47.38,47.8,47.97,45.96
2021-02-10,47.5,49.02,49.88,47.5
2021-02-18,50.14,51.06,52.23,49.76
2021-02-19,50.71,53.0,53.03,50.45
2021-02-22,53.15,52.39,53.63,52.09
2021-02-23,52.15,53.51,54.27,52.01
2021-02-24,53.48,53.16,54.54,52.8
2021-02-25,53.61,54.42,55.55,52.58
2021-02-26,53.68,52.09,54.26,51.88
2021-03-01,52.17,51.86,52.38,50.95
2021-03-02,51.89,51.7,52.25,51.0
2021-03-03,51.64,54.98,55.13,51.64
2021-03-04,54.5,55.47,56.49,54.3
2021-03-05,55.19,53.33,55.77,52.87
2021-03-08,53.41,52.97,54.98,52.74
2021-03-09,53.14,52.51,53.89,51.85
2021-03-10,52.78,50.99,52.97,50.88
2021-03-11,50.85,52.02,52.66,50.85
2021-03-12,52.0,51.39,52.02,51.01
2021-03-15,51.1,51.63,51.96,50.6
2021-03-16,51.99,52.04,52.48,51.42
2021-03-17,51.9,49.9,51.9,49.39
2021-03-18,49.8,49.78,50.48,49.66
2021-03-19,49.5,49.03,49.92,48.58
2021-03-22,48.69,49.11,49.75,48.64
2021-03-23,49.11,49.14,49.77,48.5
2021-03-24,48.81,48.11,49.02,48.0
2021-03-25,48.61,48.75,49.25,48.22
2021-03-26,48.96,49.85,50.16,48.88
2021-03-29,49.84,49.62,50.13,49.11
2021-03-30,49.61,48.88,49.62,48.6
2021-03-31,48.93,48.55,49.25,48.25
2021-04-01,48.72,48.88,49.09,48.45
2021-04-02,49.0,48.6,49.0,48.3
2021-04-06,48.66,48.71,48.85,48.38
2021-04-07,48.74,48.02,49.0,47.76
2021-04-08,47.88,48.13,48.48,47.8
2021-04-09,48.04,47.24,48.04,47.08
2021-04-12,47.23,46.65,47.29,46.46
2021-04-13,46.77,46.72,46.89,46.04
2021-04-14,46.59,46.6,47.02,46.41
2021-04-15,46.4,45.51,46.43,44.98
2021-04-16,45.74,46.82,46.96,45.52
2021-04-19,46.6,47.41,47.41,46.23
2021-04-20,47.19,47.0,47.68,46.93
2021-04-21,46.78,47.3,47.36,46.53
2021-04-22,47.88,47.26,48.34,47.05
2021-04-23,47.26,47.15,47.89,46.86
2021-04-26,47.1,45.78,47.1,45.76
2021-04-27,45.8,46.36,46.87,45.7
2021-04-28,46.6,47.37,47.65,46.18
2021-04-29,47.3,48.35,48.49,46.98
2021-04-30,49.22,48.61,49.23,48.27
2021-05-06,48.37,48.18,48.89,48.1
2021-05-07,48.18,47.76,48.76,47.5
2021-05-10,47.7,48.29,48.43,47.63
2021-05-11,47.88,48.7,48.87,47.71
2021-05-12,48.41,47.94,48.94,47.69
2021-05-13,47.5,47.5,47.84,47.09
2021-05-14,47.6,50.91,51.28,47.56
2021-05-17,50.65,49.95,50.89,49.54
2021-05-18,49.92,51.67,52.12,49.88
2021-05-19,51.28,50.98,51.48,50.4
2021-05-20,50.65,51.09,51.51,50.18
2021-05-21,51.06,49.96,51.45,49.9
2021-05-24,49.91,50.22,50.84,49.72
2021-05-25,50.43,52.1,52.33,49.8
2021-05-26,52.14,51.79,52.55,51.5
2021-05-27,51.52,51.44,52.0,51.09
2021-05-28,51.65,51.78,52.2,51.16
2021-05-31,51.54,50.96,51.54,50.5
2021-06-01,50.63,50.51,50.81,50.07
2021-06-02,50.54,49.48,50.64,49.29
2021-06-03,49.26,49.18,50.13,49.1
2021-06-04,49.0,49.73,50.17,48.92
2021-06-07,49.78,49.44,49.78,49.0
2021-06-08,49.45,49.31,50.12,48.99
2021-06-09,49.25,49.67,50.32,49.18
2021-06-10,49.46,48.9,49.92,48.79
2021-06-11,48.95,47.87,48.98,47.5
2021-06-15,47.6,47.32,47.71,46.68
2021-06-16,47.41,47.27,47.76,47.03
2021-06-17,47.3,46.71,47.58,46.6
2021-06-18,46.56,46.72,47.04,46.33
2021-06-21,46.45,45.96,46.49,45.71
2021-06-22,46.2,46.8,47.05,46.06
2021-06-23,46.63,46.84,47.48,46.58
2021-06-24,46.94,46.33,47.28,46.17
2021-06-25,46.38,47.13,47.39,46.11
2021-06-28,47.11,46.55,47.12,46.21
2021-06-29,46.4,45.53,46.6,45.3
2021-06-30,45.51,45.91,45.96,45.28
2021-07-01,46.09,46.08,46.54,45.57
2021-07-02,45.65,44.55,45.71,44.51
2021-07-05,44.55,45.81,46.1,44.2
2021-07-06,45.7,46.68,46.86,45.55
2021-07-07,46.43,46.01,47.28,45.77
2021-07-08,46.17,44.68,46.18,44.3
2021-07-09,44.48,44.66,44.89,44.34
2021-07-12,44.9,44.35,44.95,44.07
2021-07-13,44.31,44.65,44.76,44.08
2021-07-14,44.58,43.6,44.58,43.43
2021-07-15,43.99,45.35,45.53,43.7
2021-07-16,45.0,44.48,45.43,44.09
2021-07-19,44.28,44.74,44.75,43.61
2021-07-20,44.28,44.48,44.66,44.12
2021-07-21,44.38,44.15,44.87,43.73
2021-07-22,44.06,44.7,45.18,43.84
2021-07-23,44.44,44.19,44.69,43.89
2021-07-26,43.8,41.92,43.82,41.8
2021-07-27,41.88,40.9,42.07,40.85
2021-07-28,41.0,40.78,41.43,40.7
2021-07-29,41.07,40.45,41.17,39.91
2021-07-30,40.41,40.47,41.25,39.94
2021-08-02,40.11,40.86,41.55,39.48
2021-08-03,40.51,40.51,41.15,40.29
2021-08-04,40.51,40.3,40.69,40.02
2021-08-05,40.28,40.49,41.24,40.17
2021-08-06,39.1,38.82,39.28,38.71
2021-08-09,38.8,40.0,40.45,38.65
2021-08-10,39.9,40.65,40.7,39.72
2021-08-11,40.4,40.46,41.12,40.18
2021-08-12,40.5,39.98,40.82,39.91
2021-08-13,39.94,40.05,40.25,39.58
