,open,close,high,low
2020-12-01,9.72,10.24,10.29,9.65
2020-12-02,10.3,10.42,10.67,10.23
2020-12-03,10.3,10.32,10.63,10.19
2020-12-04,10.32,10.28,10.4,10.17
2020-12-07,10.32,10.3,10.45,10.03
2020-12-08,10.3,10.36,10.5,10.23
2020-12-09,10.49,10.19,10.5,10.17
2020-12-10,10.19,10.48,10.62,10.16
2020-12-11,10.51,9.43,10.55,9.43
2020-12-14,9.34,9.42,9.82,9.24
2020-12-15,9.54,9.96,10.11,9.52
2020-12-16,10.05,9.55,10.22,9.32
2020-12-17,9.42,9.35,9.45,9.07
2020-12-18,10.25,10.29,10.29,10.1
2020-12-21,10.36,9.92,10.49,9.87
2020-12-22,9.96,9.63,9.97,9.53
2020-12-23,9.6,9.73,9.9,9.52
2020-12-24,9.71,9.78,10.04,9.69
2020-12-25,9.76,9.6,9.79,9.53
2020-12-28,9.58,9.59,9.7,9.42
2020-12-29,9.55,9.62,9.77,9.34
2020-12-30,9.55,9.7,9.8,9.54
2020-12-31,9.73,9.87,9.91,9.64
2021-01-04,9.93,10.04,10.21,9.85
2021-01-05,10.04,9.87,10.05,9.47
2021-01-06,9.86,10.4,10.4,9.68
2021-01-07,10.41,10.64,10.78,10.13
2021-01-08,10.88,10.92,11.4,10.74
2021-01-11,10.94,11.34,11.76,10.87
2021-01-12,11.2,11.29,11.33,10.9
2021-01-13,11.3,11.13,11.59,11.04
2021-01-14,11.1,10.9,11.52,10.85
2021-01-15,10.91,11.15,11.33,10.79
2021-01-18,11.15,11.91,12.05,11.15
2021-01-19,11.88,11.68,11.89,11.45
2021-01-20,11.52,11.79,12.0,11.52
2021-01-21,11.71,11.46,11.97,11.35
2021-01-22,11.31,11.65,11.83,11.2
2021-01-25,11.7,12.18,12.36,11.52
2021-01-26,12.12,11.25,12.15,11.08
2021-01-27,11.25,11.3,11.54,11.1
2021-01-28,11.16,11.0,11.22,10.7
2021-01-29,11.12,10.86,11.28,10.6
2021-02-01,10.92,11.44,11.49,10.89
2021-02-02,11.53,11.4,11.61,11.22
2021-02-03,11.4,11.61,11.77,11.32
2021-02-04,11.63,11.1,11.69,11.05
2021-02-05,11.27,11.54,11.99,11.21
2021-02-08,11.62,11.75,11.76,11.12
2021-02-09,11.74,12.15,12.3,11.6
2021-02-10,12.07,12.29,12.43,11.97
2021-02-18,12.81,12.87,13.19,12.48
2021-02-19,12.89,12.33,12.97,11.9
2021-02-22,12.31,11.61,12.39,11.5
2021-02-23,11.52,11.2,11.75,11.15
2021-02-24,11.22,10.89,11.38,10.78
2021-02-25,11.09,11.2,11.64,11.05
2021-02-26,10.92,10.95,11.2,10.84
2021-03-01,11.15,11.47,11.53,11.1
2021-03-02,11.45,10.98,11.49,10.64
2021-03-03,10.85,11.14,11.16,10.67
2021-03-04,11.0,10.61,11.0,10.5
2021-03-05,10.28,10.57,10.69,10.27
2021-03-08,10.65,10.12,10.96,10.02
2021-03-09,10.01,10.1,10.4,9.69
2021-03-10,10.3,10.61,10.72,10.23
2021-03-11,10.5,9.85,10.7,9.57
2021-03-12,10.04,10.16,10.43,9.96
2021-03-15,9.98,9.99,10.37,9.77
2021-03-16,9.95,10.13,10.24,9.94
2021-03-17,10.16,10.37,10.71,10.05
2021-03-18,10.46,10.56,10.74,10.28
2021-03-19,10.38,10.04,10.39,10.01
2021-03-22,10.0,10.38,10.4,9.91
2021-03-23,10.4,10.15,10.51,10.04
2021-03-24,10.13,10.0,10.19,9.96
2021-03-25,10.34,9.85,10.45,9.63
2021-03-26,9.98,10.1,10.47,9.9
2021-03-29,9.58,9.47,9.58,9.09
2021-03-30,9.37,9.73,9.8,9.25
2021-03-31,9.69,9.28,9.76,9.11
2021-04-01,9.2,9.32,9.43,9.19
2021-04-02,9.38,9.29,9.5,9.12
2021-04-06,9.3,9.3,9.36,9.2
2021-04-07,9.37,9.48,9.54,9.25
2021-04-08,9.52,9.6,9.68,9.39
2021-04-09,9.62,9.49,9.72,9.48
2021-04-12,9.5,9.29,9.75,9.25
2021-04-13,9.23,9.06,9.32,8.94
2021-04-14,9.05,9.38,9.42,9.0
2021-04-15,9.45,9.1,9.49,9.06
2021-04-16,9.17,9.18,9.32,9.1
2021-04-19,9.19,9.72,9.77,9.13
2021-04-20,9.7,9.66,9.77,9.62
2021-04-21,9.45,9.7,9.75,9.44
2021-04-22,9.79,9.99,10.05,9.5
2021-04-23,10.33,10.06,10.44,9.86
2021-04-26,10.18,10.48,10.65,10.17
2021-04-27,10.54,10.54,10.57,10.36
2021-04-28,10.55,10.71,10.82,10.44
2021-04-29,10.59,10.65,10.72,10.4
2021-04-30,10.65,10.78,10.93,10.61
2021-05-06,10.78,10.72,11.07,10.51
2021-05-07,10.8,10.51,10.82,10.46
2021-05-10,10.44,10.13,10.54,10.0
2021-05-11,10.05,9.92,10.2,9.81
2021-05-12,9.9,10.07,10.12,9.8
2021-05-13,9.95,9.86,10.03,9.75
2021-05-14,9.81,9.9,9.97,9.7
2021-05-17,9.95,10.24,10.55,9.95
2021-05-18,10.3,10.34,10.45,10.26
2021-05-19,10.35,10.29,10.4,10.13
2021-05-20,10.31,10.46,10.63,10.13
2021-05-21,10.45,10.34,10.59,10.23
2021-05-24,10.25,10.3,10.35,10.12
2021-05-25,10.3,10.85,10.9,10.24
2021-05-26,10.8,10.3,10.92,10.19
2021-05-27,10.31,10.31,10.4,10.13
2021-05-28,10.31,10.41,10.67,10.29
2021-05-31,10.31,10.24,10.35,10.06
2021-06-01,10.2,10.08,10.25,10.03
2021-06-02,10.1,9.83,10.13,9.73
2021-06-03,9.83,9.76,10.03,9.72
2021-06-04,9.76,9.95,9.97,9.62
2021-06-07,9.94,10.14,10.18,9.83
2021-06-08,10.13,10.01,10.22,9.96
2021-06-09,10.05,9.71,10.07,9.69
2021-06-10,9.77,9.73,9.95,9.68
2021-06-11,9.8,9.67,9.8,9.5
2021-06-15,9.66,9.38,9.69,9.2
2021-06-16,9.41,9.28,9.44,9.26
2021-06-17,9.21,9.1,9.34,9.04
2021-06-18,9.18,9.05,9.32,9.04
2021-06-21,9.04,8.89,9.06,8.75
2021-06-22,8.96,8.94,9.02,8.85
2021-06-23,8.96,9.33,9.43,8.96
2021-06-24,9.36,8.95,9.39,8.92
2021-06-25,8.9,9.15,9.16,8.78
2021-06-28,9.15,9.28,9.32,8.98
2021-06-29,9.3,9.43,9.52,9.24
2021-06-30,9.4,9.41,9.5,9.24
2021-07-01,9.41,9.19,9.42,9.06
2021-07-02,9.1,8.89,9.16,8.84
2021-07-05,8.9,8.54,8.9,8.38
2021-07-06,8.34,8.4,8.43,8.16
2021-07-07,8.31,8.45,8.57,8.31
2021-07-08,8.5,8.16,8.5,8.14
2021-07-09,8.17,8.25,8.37,8.0
2021-07-12,8.33,8.29,8.42,8.07
2021-07-13,8.26,8.45,8.47,8.2
2021-07-14,8.52,8.38,8.52,8.25
2021-07-15,8.38,8.45,8.49,8.21
2021-07-16,8.41,8.23,8.44,8.2
2021-07-19,8.1,8.23,8.3,8.08
2021-07-20,8.18,8.12,8.23,8.08
2021-07-21,8.11,8.22,8.38,8.11
2021-07-22,8.22,8.4,8.62,8.18
2021-07-23,8.42,7.99,8.46,7.95
2021-07-26,7.8,7.78,8.05,7.63
2021-07-27,7.78,7.25,7.84,7.25
2021-07-28,7.21,7.55,7.62,7.2
2021-07-29,7.69,7.7,8.05,7.68
2021-07-30,7.7,7.5,7.7,7.37
2021-08-02,7.5,7.77,7.9,7.45
2021-08-03,7.72,7.66,7.84,7.62
2021-08-04,7.7,7.67,7.8,7.4
2021-08-05,7.6,7.45,7.74,7.44
2021-08-06,7.43,7.3,7.48,7.28
2021-08-09,7.26,7.9,8.02,7.22
2021-08-10,7.8,8.08,8.14,7.65
2021-08-11,8.09,8.06,8.32,8.02
2021-08-12,8.03,7.7,8.08,7.69
2021-08-13,7.66,7.59,7.74,7.55
