,open,close,high,low
2020-12-01,32.37,33.04,33.19,32.35
2020-12-02,33.04,32.74,33.45,32.74
2020-12-03,32.89,32.83,33.34,32.6
2020-12-04,32.61,32.62,32.86,32.44
2020-12-07,32.62,31.9,32.95,31.79
2020-12-08,31.9,32.15,32.31,31.75
2020-12-09,32.21,31.42,32.35,31.18
2020-12-10,31.42,31.41,31.74,31.12
2020-12-11,31.3,30.95,31.6,30.54
2020-12-14,31.0,31.24,31.39,30.63
2020-12-15,31.24,31.7,32.12,30.92
2020-12-16,31.66,32.2,32.36,31.51
2020-12-17,32.1,32.07,32.34,31.65
2020-12-18,32.04,32.52,32.75,32.01
2020-12-21,32.68,32.53,32.99,32.18
2020-12-22,32.55,32.85,33.68,32.55
2020-12-23,33.1,32.33,33.15,32.02
2020-12-24,32.34,31.15,32.52,31.0
2020-12-25,31.14,31.72,31.89,31.01
2020-12-28,31.6,30.8,31.97,30.72
2020-12-29,30.82,31.06,31.29,30.3
2020-12-30,30.95,31.12,31.41,30.7
2020-12-31,31.99,34.23,34.23,31.77
2021-01-04,34.8,34.18,34.83,33.78
2021-01-05,33.86,34.5,35.2,33.65
2021-01-06,34.71,34.31,34.8,33.88
2021-01-07,34.5,33.25,34.55,32.85
2021-01-08,33.35,33.34,33.71,32.69
2021-01-11,33.34,32.77,33.46,32.5
2021-01-12,32.74,34.38,34.5,32.4
2021-01-13,33.99,33.37,34.0,33.0
2021-01-14,33.35,33.2,33.35,32.3
2021-01-15,33.16,32.66,33.16,32.41
2021-01-18,32.66,32.89,33.11,32.42
2021-01-19,32.78,32.3,32.78,32.02
2021-01-20,32.11,33.12,33.16,31.82
2021-01-21,33.1,33.5,33.96,33.1
2021-01-22,33.29,34.38,34.5,33.02
2021-01-25,34.18,34.49,34.94,33.53
2021-01-26,34.17,32.87,34.43,32.65
2021-01-27,32.51,32.41,33.36,32.38
2021-01-28,32.11,31.44,32.68,31.08
2021-01-29,31.8,30.3,31.95,30.08
2021-02-01,30.31,30.46,30.95,30.31
2021-02-02,30.62,30.87,30.95,29.71
2021-02-03,30.55,30.25,30.69,29.87
2021-02-04,30.35,29.98,30.6,29.18
2021-02-05,30.27,30.07,30.97,29.95
2021-02-08,30.07,30.01,30.45,29.85
2021-02-09,30.01,30.29,30.44,29.7
2021-02-10,30.3,31.48,31.58,30.18
2021-02-18,31.5,30.99,31.88,30.7
2021-02-19,30.92,31.85,31.85,30.8
2021-02-22,31.85,32.24,32.39,31.7
2021-02-23,32.2,31.9,32.38,31.0
2021-02-24,31.74,31.77,31.92,31.34
2021-02-25,31.65,31.61,31.89,31.36
2021-02-26,31.3,31.2,31.32,30.76
2021-03-01,31.39,31.65,31.78,31.18
2021-03-02,32.0,31.52,32.01,31.38
2021-03-03,31.53,34.07,34.5,31.41
2021-03-04,33.33,32.53,34.5,32.21
2021-03-05,32.31,33.1,33.39,31.75
2021-03-08,33.04,32.74,33.94,32.21
2021-03-09,32.42,32.2,33.24,31.73
2021-03-10,32.55,32.41,32.85,31.97
2021-03-11,32.75,33.1,33.47,32.42
2021-03-12,33.13,33.44,34.0,32.9
2021-03-15,33.7,33.53,34.2,33.3
2021-03-16,33.52,34.06,34.09,33.17
2021-03-17,34.06,34.17,34.37,33.78
2021-03-18,34.34,34.02,34.47,33.93
2021-03-19,34.03,33.37,34.03,33.1
2021-03-22,33.7,34.15,34.35,33.67
2021-03-23,34.03,34.38,34.93,34.03
2021-03-24,34.36,33.79,34.46,33.71
2021-03-25,33.83,33.42,33.96,33.37
2021-03-26,33.48,33.21,33.69,32.66
2021-03-29,33.28,34.15,34.48,32.7
2021-03-30,34.19,34.05,34.43,33.8
2021-03-31,33.89,33.98,34.18,33.06
2021-04-01,34.35,33.68,34.35,33.3
2021-04-02,33.85,33.66,34.05,33.51
2021-04-06,33.35,33.5,34.07,33.1
2021-04-07,33.48,33.71,34.18,33.45
2021-04-08,33.65,33.82,34.33,33.51
2021-04-09,33.9,34.18,34.3,33.73
2021-04-12,34.33,32.9,34.47,32.9
2021-04-13,32.8,32.99,33.42,32.8
2021-04-14,32.99,33.6,33.68,32.87
2021-04-15,33.28,32.98,33.55,32.82
2021-04-16,33.17,34.01,34.07,33.0
2021-04-19,34.2,34.4,34.48,33.82
2021-04-20,34.38,34.44,34.84,34.3
2021-04-21,34.45,37.1,37.37,34.44
2021-04-22,37.09,37.89,38.01,36.86
2021-04-23,38.0,37.82,38.2,37.4
2021-04-26,38.58,38.83,40.9,38.58
2021-04-27,39.35,39.02,40.1,38.74
2021-04-28,36.73,35.12,37.73,35.12
2021-04-29,35.12,34.86,36.27,34.82
2021-04-30,34.7,34.79,35.83,34.3
2021-05-06,35.99,35.85,36.94,35.44
2021-05-07,35.81,35.2,36.2,35.15
2021-05-10,35.1,34.21,35.53,33.9
2021-05-11,34.19,33.9,35.0,33.46
2021-05-12,33.9,33.63,33.99,33.26
2021-05-13,33.5,33.01,33.8,32.89
2021-05-14,33.1,33.38,33.57,32.89
2021-05-17,33.49,33.03,33.78,32.81
2021-05-18,32.81,31.96,32.98,29.83
2021-05-19,32.08,32.23,32.58,31.52
2021-05-20,32.08,31.74,32.4,31.64
2021-05-21,31.88,31.14,31.9,31.12
2021-05-24,31.0,31.43,31.52,30.35
2021-05-25,31.47,31.72,32.12,30.7
2021-05-26,31.52,31.91,32.15,31.52
2021-05-27,31.91,32.18,32.39,31.59
2021-05-28,32.18,31.6,32.47,31.5
2021-05-31,31.6,31.54,31.95,31.32
2021-06-01,31.54,31.17,31.75,30.85
2021-06-02,31.04,31.12,31.28,30.9
2021-06-03,31.12,30.75,31.23,30.59
2021-06-04,30.63,30.7,30.98,30.27
2021-06-07,30.72,31.3,31.54,30.72
2021-06-08,31.38,30.8,31.46,30.66
2021-06-09,30.9,31.83,32.1,30.5
2021-06-10,31.7,31.71,32.23,31.5
2021-06-11,31.72,31.01,31.73,30.97
2021-06-15,30.98,30.84,31.15,30.75
2021-06-16,30.8,30.57,30.98,30.48
2021-06-17,30.81,30.71,30.9,30.49
2021-06-18,30.7,30.9,31.13,30.55
2021-06-21,30.83,31.51,31.55,30.71
2021-06-22,31.56,31.56,31.69,31.4
2021-06-23,22.32,22.52,22.98,22.28
2021-06-24,22.36,21.73,22.46,21.7
2021-06-25,21.68,21.79,21.91,21.56
2021-06-28,21.79,21.93,22.1,21.7
2021-06-29,22.02,22.3,22.51,21.91
2021-06-30,22.3,22.48,22.88,21.95
2021-07-01,22.46,22.1,22.71,22.03
2021-07-02,22.19,21.88,22.2,21.8
2021-07-05,21.95,21.94,22.0,21.7
2021-07-06,22.03,21.41,22.08,21.25
2021-07-07,21.36,21.31,21.49,21.24
2021-07-08,21.32,20.9,21.4,20.42
2021-07-09,20.77,20.8,21.02,20.54
2021-07-12,20.83,21.0,21.13,20.78
2021-07-13,20.99,20.77,20.99,20.63
2021-07-14,20.82,20.88,21.15,20.65
2021-07-15,20.67,20.75,20.87,20.62
2021-07-16,20.75,21.29,21.43,20.7
2021-07-19,21.25,21.0,21.26,20.95
2021-07-20,20.95,21.05,21.2,20.75
2021-07-21,21.18,21.75,21.8,21.06
2021-07-22,21.68,21.21,21.68,21.06
2021-07-23,21.1,20.61,21.12,20.23
2021-07-26,20.46,20.02,20.58,19.28
2021-07-27,19.98,19.22,20.2,19.22
2021-07-28,19.12,18.97,19.2,18.5
2021-07-29,19.05,18.91,19.25,18.87
2021-07-30,18.91,19.02,19.1,18.25
2021-08-02,19.11,19.5,19.52,18.5
2021-08-03,19.6,21.45,21.45,19.56
2021-08-04,21.8,22.69,23.48,21.66
2021-08-05,22.44,21.66,23.0,21.66
2021-08-06,21.6,20.71,21.65,20.5
2021-08-09,20.44,20.5,20.66,20.2
2021-08-10,20.49,20.23,20.5,20.06
2021-08-11,20.33,20.18,20.5,19.96
2021-08-12,20.24,19.68,20.26,19.6
2021-08-13,19.65,19.9,20.08,19.52
