{
    "/js/app.js": "/js/app.js?id=c389af3bf6f017db202a",
    "/css/app.css": "/css/app.css?id=4f98c2e238c12741b60e",
    "/css/auth.css": "/css/auth.css?id=452a002710d80b3af4cb",
    "/js/app.js.map": "/js/app.js.map?id=2876de746bbfba790515",
    "/css/app.css.map": "/css/app.css.map?id=5145fba573a5a646e2f2",
    "/css/auth.css.map": "/css/auth.css.map?id=3b235c8cbdf7d03bdb55",
    "/js/vendor.js": "/js/vendor.js?id=1dd22d0981d6330a3046",
    "/js/vendor.js.map": "/js/vendor.js.map?id=c2643acf7bea1d3247b7",
    "/js/manifest.js": "/js/manifest.js?id=d64713044d4b02b1808b",
    "/js/manifest.js.map": "/js/manifest.js.map?id=924070783f24a786c985"
}
