%!PS-Adobe-3.0 EPSF-3.0
%%Creator: (MATLAB, The Mathworks, Inc. Version 9.8.0.1451342 \(R2020a\) Update 5. Operating System: Windows 10)
%%Title: (F:/Documents/UNIVESIDAD/NOVENO SEMESTRE/Electiva profesional/Segundo corte/pru-gyr-m.eps)
%%CreationDate: 2021-04-11T21:59:15
%%Pages: (atend)
%%BoundingBox:     0     0   500   401
%%LanguageLevel: 3
%%EndComments
%%BeginProlog
%%BeginResource: procset (Apache XML Graphics Std ProcSet) 1.2 0
%%Version: 1.2 0
%%Copyright: (Copyright 2001-2003,2010 The Apache Software Foundation. License terms: http://www.apache.org/licenses/LICENSE-2.0)
/bd{bind def}bind def
/ld{load def}bd
/GR/grestore ld
/GS/gsave ld
/RM/rmoveto ld
/C/curveto ld
/t/show ld
/L/lineto ld
/ML/setmiterlimit ld
/CT/concat ld
/f/fill ld
/N/newpath ld
/S/stroke ld
/CC/setcmykcolor ld
/A/ashow ld
/cp/closepath ld
/RC/setrgbcolor ld
/LJ/setlinejoin ld
/GC/setgray ld
/LW/setlinewidth ld
/M/moveto ld
/re {4 2 roll M
1 index 0 rlineto
0 exch rlineto
neg 0 rlineto
cp } bd
/_ctm matrix def
/_tm matrix def
/BT { _ctm currentmatrix pop matrix _tm copy pop 0 0 moveto } bd
/ET { _ctm setmatrix } bd
/iTm { _ctm setmatrix _tm concat } bd
/Tm { _tm astore pop iTm 0 0 moveto } bd
/ux 0.0 def
/uy 0.0 def
/F {
  /Tp exch def
  /Tf exch def
  Tf findfont Tp scalefont setfont
  /cf Tf def  /cs Tp def
} bd
/ULS {currentpoint /uy exch def /ux exch def} bd
/ULE {
  /Tcx currentpoint pop def
  gsave
  newpath
  cf findfont cs scalefont dup
  /FontMatrix get 0 get /Ts exch def /FontInfo get dup
  /UnderlinePosition get Ts mul /To exch def
  /UnderlineThickness get Ts mul /Tt exch def
  ux uy To add moveto  Tcx uy To add lineto
  Tt setlinewidth stroke
  grestore
} bd
/OLE {
  /Tcx currentpoint pop def
  gsave
  newpath
  cf findfont cs scalefont dup
  /FontMatrix get 0 get /Ts exch def /FontInfo get dup
  /UnderlinePosition get Ts mul /To exch def
  /UnderlineThickness get Ts mul /Tt exch def
  ux uy To add cs add moveto Tcx uy To add cs add lineto
  Tt setlinewidth stroke
  grestore
} bd
/SOE {
  /Tcx currentpoint pop def
  gsave
  newpath
  cf findfont cs scalefont dup
  /FontMatrix get 0 get /Ts exch def /FontInfo get dup
  /UnderlinePosition get Ts mul /To exch def
  /UnderlineThickness get Ts mul /Tt exch def
  ux uy To add cs 10 mul 26 idiv add moveto Tcx uy To add cs 10 mul 26 idiv add lineto
  Tt setlinewidth stroke
  grestore
} bd
/QT {
/Y22 exch store
/X22 exch store
/Y21 exch store
/X21 exch store
currentpoint
/Y21 load 2 mul add 3 div exch
/X21 load 2 mul add 3 div exch
/X21 load 2 mul /X22 load add 3 div
/Y21 load 2 mul /Y22 load add 3 div
/X22 load /Y22 load curveto
} bd
/SSPD {
dup length /d exch dict def
{
/v exch def
/k exch def
currentpagedevice k known {
/cpdv currentpagedevice k get def
v cpdv ne {
/upd false def
/nullv v type /nulltype eq def
/nullcpdv cpdv type /nulltype eq def
nullv nullcpdv or
{
/upd true def
} {
/sametype v type cpdv type eq def
sametype {
v type /arraytype eq {
/vlen v length def
/cpdvlen cpdv length def
vlen cpdvlen eq {
0 1 vlen 1 sub {
/i exch def
/obj v i get def
/cpdobj cpdv i get def
obj cpdobj ne {
/upd true def
exit
} if
} for
} {
/upd true def
} ifelse
} {
v type /dicttype eq {
v {
/dv exch def
/dk exch def
/cpddv cpdv dk get def
dv cpddv ne {
/upd true def
exit
} if
} forall
} {
/upd true def
} ifelse
} ifelse
} if
} ifelse
upd true eq {
d k v put
} if
} if
} if
} forall
d length 0 gt {
d setpagedevice
} if
} bd
/RE { % /NewFontName [NewEncodingArray] /FontName RE -
  findfont dup length dict begin
  {
    1 index /FID ne
    {def} {pop pop} ifelse
  } forall
  /Encoding exch def
  /FontName 1 index def
  currentdict definefont pop
  end
} bind def
%%EndResource
%%BeginResource: procset (Apache XML Graphics EPS ProcSet) 1.0 0
%%Version: 1.0 0
%%Copyright: (Copyright 2002-2003 The Apache Software Foundation. License terms: http://www.apache.org/licenses/LICENSE-2.0)
/BeginEPSF { %def
/b4_Inc_state save def         % Save state for cleanup
/dict_count countdictstack def % Count objects on dict stack
/op_count count 1 sub def      % Count objects on operand stack
userdict begin                 % Push userdict on dict stack
/showpage { } def              % Redefine showpage, { } = null proc
0 setgray 0 setlinecap         % Prepare graphics state
1 setlinewidth 0 setlinejoin
10 setmiterlimit [ ] 0 setdash newpath
/languagelevel where           % If level not equal to 1 then
{pop languagelevel             % set strokeadjust and
1 ne                           % overprint to their defaults.
{false setstrokeadjust false setoverprint
} if
} if
} bd
/EndEPSF { %def
count op_count sub {pop} repeat            % Clean up stacks
countdictstack dict_count sub {end} repeat
b4_Inc_state restore
} bd
%%EndResource
%FOPBeginFontDict
%%IncludeResource: font Courier-Oblique
%%IncludeResource: font Courier-BoldOblique
%%IncludeResource: font Courier-Bold
%%IncludeResource: font ZapfDingbats
%%IncludeResource: font Symbol
%%IncludeResource: font Helvetica
%%IncludeResource: font Helvetica-Oblique
%%IncludeResource: font Helvetica-Bold
%%IncludeResource: font Helvetica-BoldOblique
%%IncludeResource: font Times-Roman
%%IncludeResource: font Times-Italic
%%IncludeResource: font Times-Bold
%%IncludeResource: font Times-BoldItalic
%%IncludeResource: font Courier
%FOPEndFontDict
%%BeginResource: encoding WinAnsiEncoding
/WinAnsiEncoding [
/.notdef /.notdef /.notdef /.notdef /.notdef
/.notdef /.notdef /.notdef /.notdef /.notdef
/.notdef /.notdef /.notdef /.notdef /.notdef
/.notdef /.notdef /.notdef /.notdef /.notdef
/.notdef /.notdef /.notdef /.notdef /.notdef
/.notdef /.notdef /.notdef /.notdef /.notdef
/.notdef /.notdef /space /exclam /quotedbl
/numbersign /dollar /percent /ampersand /quotesingle
/parenleft /parenright /asterisk /plus /comma
/hyphen /period /slash /zero /one
/two /three /four /five /six
/seven /eight /nine /colon /semicolon
/less /equal /greater /question /at
/A /B /C /D /E
/F /G /H /I /J
/K /L /M /N /O
/P /Q /R /S /T
/U /V /W /X /Y
/Z /bracketleft /backslash /bracketright /asciicircum
/underscore /quoteleft /a /b /c
/d /e /f /g /h
/i /j /k /l /m
/n /o /p /q /r
/s /t /u /v /w
/x /y /z /braceleft /bar
/braceright /asciitilde /bullet /Euro /bullet
/quotesinglbase /florin /quotedblbase /ellipsis /dagger
/daggerdbl /circumflex /perthousand /Scaron /guilsinglleft
/OE /bullet /Zcaron /bullet /bullet
/quoteleft /quoteright /quotedblleft /quotedblright /bullet
/endash /emdash /asciitilde /trademark /scaron
/guilsinglright /oe /bullet /zcaron /Ydieresis
/space /exclamdown /cent /sterling /currency
/yen /brokenbar /section /dieresis /copyright
/ordfeminine /guillemotleft /logicalnot /sfthyphen /registered
/macron /degree /plusminus /twosuperior /threesuperior
/acute /mu /paragraph /middot /cedilla
/onesuperior /ordmasculine /guillemotright /onequarter /onehalf
/threequarters /questiondown /Agrave /Aacute /Acircumflex
/Atilde /Adieresis /Aring /AE /Ccedilla
/Egrave /Eacute /Ecircumflex /Edieresis /Igrave
/Iacute /Icircumflex /Idieresis /Eth /Ntilde
/Ograve /Oacute /Ocircumflex /Otilde /Odieresis
/multiply /Oslash /Ugrave /Uacute /Ucircumflex
/Udieresis /Yacute /Thorn /germandbls /agrave
/aacute /acircumflex /atilde /adieresis /aring
/ae /ccedilla /egrave /eacute /ecircumflex
/edieresis /igrave /iacute /icircumflex /idieresis
/eth /ntilde /ograve /oacute /ocircumflex
/otilde /odieresis /divide /oslash /ugrave
/uacute /ucircumflex /udieresis /yacute /thorn
/ydieresis
] def
%%EndResource
%FOPBeginFontReencode
/Courier-Oblique findfont
dup length dict begin
  {1 index /FID ne {def} {pop pop} ifelse} forall
  /Encoding WinAnsiEncoding def
  currentdict
end
/Courier-Oblique exch definefont pop
/Courier-BoldOblique findfont
dup length dict begin
  {1 index /FID ne {def} {pop pop} ifelse} forall
  /Encoding WinAnsiEncoding def
  currentdict
end
/Courier-BoldOblique exch definefont pop
/Courier-Bold findfont
dup length dict begin
  {1 index /FID ne {def} {pop pop} ifelse} forall
  /Encoding WinAnsiEncoding def
  currentdict
end
/Courier-Bold exch definefont pop
/Helvetica findfont
dup length dict begin
  {1 index /FID ne {def} {pop pop} ifelse} forall
  /Encoding WinAnsiEncoding def
  currentdict
end
/Helvetica exch definefont pop
/Helvetica-Oblique findfont
dup length dict begin
  {1 index /FID ne {def} {pop pop} ifelse} forall
  /Encoding WinAnsiEncoding def
  currentdict
end
/Helvetica-Oblique exch definefont pop
/Helvetica-Bold findfont
dup length dict begin
  {1 index /FID ne {def} {pop pop} ifelse} forall
  /Encoding WinAnsiEncoding def
  currentdict
end
/Helvetica-Bold exch definefont pop
/Helvetica-BoldOblique findfont
dup length dict begin
  {1 index /FID ne {def} {pop pop} ifelse} forall
  /Encoding WinAnsiEncoding def
  currentdict
end
/Helvetica-BoldOblique exch definefont pop
/Times-Roman findfont
dup length dict begin
  {1 index /FID ne {def} {pop pop} ifelse} forall
  /Encoding WinAnsiEncoding def
  currentdict
end
/Times-Roman exch definefont pop
/Times-Italic findfont
dup length dict begin
  {1 index /FID ne {def} {pop pop} ifelse} forall
  /Encoding WinAnsiEncoding def
  currentdict
end
/Times-Italic exch definefont pop
/Times-Bold findfont
dup length dict begin
  {1 index /FID ne {def} {pop pop} ifelse} forall
  /Encoding WinAnsiEncoding def
  currentdict
end
/Times-Bold exch definefont pop
/Times-BoldItalic findfont
dup length dict begin
  {1 index /FID ne {def} {pop pop} ifelse} forall
  /Encoding WinAnsiEncoding def
  currentdict
end
/Times-BoldItalic exch definefont pop
/Courier findfont
dup length dict begin
  {1 index /FID ne {def} {pop pop} ifelse} forall
  /Encoding WinAnsiEncoding def
  currentdict
end
/Courier exch definefont pop
%FOPEndFontReencode
%%EndProlog
%%Page: 1 1
%%PageBoundingBox: 0 0 500 401
%%BeginPageSetup
[1 0 0 -1 0 401] CT
%%EndPageSetup
GS
[0.75 0 0 0.75 0 -0.25] CT
1 GC
N
0 0 666 535 re
f
GR
GS
[0.75 0 0 0.75 0 -0.25] CT
1 GC
N
0 0 666 535 re
f
GR
GS
[0.75 0 0 0.75 0 -0.25] CT
1 GC
N
87 476 M
603 476 L
603 40 L
87 40 L
cp
f
GR
GS
[0.75 0 0 0.75 0 -0.25] CT
0.149 GC
2 setlinecap
1 LJ
0.667 LW
N
87 476 M
603 476 L
S
GR
GS
[0.75 0 0 0.75 0 -0.25] CT
0.149 GC
2 setlinecap
1 LJ
0.667 LW
N
87 40 M
603 40 L
S
GR
GS
[0.75 0 0 0.75 0 -0.25] CT
0.149 GC
2 setlinecap
1 LJ
0.667 LW
N
87 476 M
87 470.84 L
S
GR
GS
[0.75 0 0 0.75 0 -0.25] CT
0.149 GC
2 setlinecap
1 LJ
0.667 LW
N
138.6 476 M
138.6 470.84 L
S
GR
GS
[0.75 0 0 0.75 0 -0.25] CT
0.149 GC
2 setlinecap
1 LJ
0.667 LW
N
190.2 476 M
190.2 470.84 L
S
GR
GS
[0.75 0 0 0.75 0 -0.25] CT
0.149 GC
2 setlinecap
1 LJ
0.667 LW
N
241.8 476 M
241.8 470.84 L
S
GR
GS
[0.75 0 0 0.75 0 -0.25] CT
0.149 GC
2 setlinecap
1 LJ
0.667 LW
N
293.4 476 M
293.4 470.84 L
S
GR
GS
[0.75 0 0 0.75 0 -0.25] CT
0.149 GC
2 setlinecap
1 LJ
0.667 LW
N
345 476 M
345 470.84 L
S
GR
GS
[0.75 0 0 0.75 0 -0.25] CT
0.149 GC
2 setlinecap
1 LJ
0.667 LW
N
396.6 476 M
396.6 470.84 L
S
GR
GS
[0.75 0 0 0.75 0 -0.25] CT
0.149 GC
2 setlinecap
1 LJ
0.667 LW
N
448.2 476 M
448.2 470.84 L
S
GR
GS
[0.75 0 0 0.75 0 -0.25] CT
0.149 GC
2 setlinecap
1 LJ
0.667 LW
N
499.8 476 M
499.8 470.84 L
S
GR
GS
[0.75 0 0 0.75 0 -0.25] CT
0.149 GC
2 setlinecap
1 LJ
0.667 LW
N
551.4 476 M
551.4 470.84 L
S
GR
GS
[0.75 0 0 0.75 0 -0.25] CT
0.149 GC
2 setlinecap
1 LJ
0.667 LW
N
603 476 M
603 470.84 L
S
GR
GS
[0.75 0 0 0.75 0 -0.25] CT
0.149 GC
2 setlinecap
1 LJ
0.667 LW
N
87 40 M
87 45.16 L
S
GR
GS
[0.75 0 0 0.75 0 -0.25] CT
0.149 GC
2 setlinecap
1 LJ
0.667 LW
N
138.6 40 M
138.6 45.16 L
S
GR
GS
[0.75 0 0 0.75 0 -0.25] CT
0.149 GC
2 setlinecap
1 LJ
0.667 LW
N
190.2 40 M
190.2 45.16 L
S
GR
GS
[0.75 0 0 0.75 0 -0.25] CT
0.149 GC
2 setlinecap
1 LJ
0.667 LW
N
241.8 40 M
241.8 45.16 L
S
GR
GS
[0.75 0 0 0.75 0 -0.25] CT
0.149 GC
2 setlinecap
1 LJ
0.667 LW
N
293.4 40 M
293.4 45.16 L
S
GR
GS
[0.75 0 0 0.75 0 -0.25] CT
0.149 GC
2 setlinecap
1 LJ
0.667 LW
N
345 40 M
345 45.16 L
S
GR
GS
[0.75 0 0 0.75 0 -0.25] CT
0.149 GC
2 setlinecap
1 LJ
0.667 LW
N
396.6 40 M
396.6 45.16 L
S
GR
GS
[0.75 0 0 0.75 0 -0.25] CT
0.149 GC
2 setlinecap
1 LJ
0.667 LW
N
448.2 40 M
448.2 45.16 L
S
GR
GS
[0.75 0 0 0.75 0 -0.25] CT
0.149 GC
2 setlinecap
1 LJ
0.667 LW
N
499.8 40 M
499.8 45.16 L
S
GR
GS
[0.75 0 0 0.75 0 -0.25] CT
0.149 GC
2 setlinecap
1 LJ
0.667 LW
N
551.4 40 M
551.4 45.16 L
S
GR
GS
[0.75 0 0 0.75 0 -0.25] CT
0.149 GC
2 setlinecap
1 LJ
0.667 LW
N
603 40 M
603 45.16 L
S
GR
GS
[0.75 0 0 0.75 65.25 360.75001] CT
0.149 GC
/Helvetica 13.333 F
GS
[1 0 0 1 0 0] CT
-4 14 moveto 
1 -1 scale
(0) t 
GR
GR
GS
[0.75 0 0 0.75 103.95 360.75001] CT
0.149 GC
/Helvetica 13.333 F
GS
[1 0 0 1 0 0] CT
-9.5 14 moveto 
1 -1 scale
(0.1) t 
GR
GR
GS
[0.75 0 0 0.75 142.65 360.75001] CT
0.149 GC
/Helvetica 13.333 F
GS
[1 0 0 1 0 0] CT
-9.5 14 moveto 
1 -1 scale
(0.2) t 
GR
GR
GS
[0.75 0 0 0.75 181.35 360.75001] CT
0.149 GC
/Helvetica 13.333 F
GS
[1 0 0 1 0 0] CT
-9.5 14 moveto 
1 -1 scale
(0.3) t 
GR
GR
GS
[0.75 0 0 0.75 220.05 360.75001] CT
0.149 GC
/Helvetica 13.333 F
GS
[1 0 0 1 0 0] CT
-9.5 14 moveto 
1 -1 scale
(0.4) t 
GR
GR
GS
[0.75 0 0 0.75 258.75 360.75001] CT
0.149 GC
/Helvetica 13.333 F
GS
[1 0 0 1 0 0] CT
-9.5 14 moveto 
1 -1 scale
(0.5) t 
GR
GR
GS
[0.75 0 0 0.75 297.45 360.75001] CT
0.149 GC
/Helvetica 13.333 F
GS
[1 0 0 1 0 0] CT
-9.5 14 moveto 
1 -1 scale
(0.6) t 
GR
GR
GS
[0.75 0 0 0.75 336.14999 360.75001] CT
0.149 GC
/Helvetica 13.333 F
GS
[1 0 0 1 0 0] CT
-9.5 14 moveto 
1 -1 scale
(0.7) t 
GR
GR
GS
[0.75 0 0 0.75 374.85001 360.75001] CT
0.149 GC
/Helvetica 13.333 F
GS
[1 0 0 1 0 0] CT
-9.5 14 moveto 
1 -1 scale
(0.8) t 
GR
GR
GS
[0.75 0 0 0.75 413.54997 360.75001] CT
0.149 GC
/Helvetica 13.333 F
GS
[1 0 0 1 0 0] CT
-9.5 14 moveto 
1 -1 scale
(0.9) t 
GR
GR
GS
[0.75 0 0 0.75 452.25 360.75001] CT
0.149 GC
/Helvetica 13.333 F
GS
[1 0 0 1 0 0] CT
-4 14 moveto 
1 -1 scale
(1) t 
GR
GR
GS
[0.75 0 0 0.75 258.75018 374.50002] CT
0.149 GC
/Helvetica 14.667 F
GS
[1 0 0 1 0 0] CT
-63.5 15 moveto 
1 -1 scale
(Tiempo \(segundos\)) t 
GR
GR
GS
[0.75 0 0 0.75 0 -0.25] CT
0.149 GC
2 setlinecap
1 LJ
0.667 LW
N
87 476 M
87 40 L
S
GR
GS
[0.75 0 0 0.75 0 -0.25] CT
0.149 GC
2 setlinecap
1 LJ
0.667 LW
N
603 476 M
603 40 L
S
GR
GS
[0.75 0 0 0.75 0 -0.25] CT
0.149 GC
2 setlinecap
1 LJ
0.667 LW
N
87 476 M
92.16 476 L
S
GR
GS
[0.75 0 0 0.75 0 -0.25] CT
0.149 GC
2 setlinecap
1 LJ
0.667 LW
N
87 403.333 M
92.16 403.333 L
S
GR
GS
[0.75 0 0 0.75 0 -0.25] CT
0.149 GC
2 setlinecap
1 LJ
0.667 LW
N
87 330.667 M
92.16 330.667 L
S
GR
GS
[0.75 0 0 0.75 0 -0.25] CT
0.149 GC
2 setlinecap
1 LJ
0.667 LW
N
87 258 M
92.16 258 L
S
GR
GS
[0.75 0 0 0.75 0 -0.25] CT
0.149 GC
2 setlinecap
1 LJ
0.667 LW
N
87 185.333 M
92.16 185.333 L
S
GR
GS
[0.75 0 0 0.75 0 -0.25] CT
0.149 GC
2 setlinecap
1 LJ
0.667 LW
N
87 112.667 M
92.16 112.667 L
S
GR
GS
[0.75 0 0 0.75 0 -0.25] CT
0.149 GC
2 setlinecap
1 LJ
0.667 LW
N
87 40 M
92.16 40 L
S
GR
GS
[0.75 0 0 0.75 0 -0.25] CT
0.149 GC
2 setlinecap
1 LJ
0.667 LW
N
603 476 M
597.84 476 L
S
GR
GS
[0.75 0 0 0.75 0 -0.25] CT
0.149 GC
2 setlinecap
1 LJ
0.667 LW
N
603 403.333 M
597.84 403.333 L
S
GR
GS
[0.75 0 0 0.75 0 -0.25] CT
0.149 GC
2 setlinecap
1 LJ
0.667 LW
N
603 330.667 M
597.84 330.667 L
S
GR
GS
[0.75 0 0 0.75 0 -0.25] CT
0.149 GC
2 setlinecap
1 LJ
0.667 LW
N
603 258 M
597.84 258 L
S
GR
GS
[0.75 0 0 0.75 0 -0.25] CT
0.149 GC
2 setlinecap
1 LJ
0.667 LW
N
603 185.333 M
597.84 185.333 L
S
GR
GS
[0.75 0 0 0.75 0 -0.25] CT
0.149 GC
2 setlinecap
1 LJ
0.667 LW
N
603 112.667 M
597.84 112.667 L
S
GR
GS
[0.75 0 0 0.75 0 -0.25] CT
0.149 GC
2 setlinecap
1 LJ
0.667 LW
N
603 40 M
597.84 40 L
S
GR
GS
[0.75 0 0 0.75 61.25 356.75] CT
0.149 GC
/Helvetica 13.333 F
GS
[1 0 0 1 0 0] CT
-27 5.5 moveto 
1 -1 scale
(-300) t 
GR
GR
GS
[0.75 0 0 0.75 61.25 302.25001] CT
0.149 GC
/Helvetica 13.333 F
GS
[1 0 0 1 0 0] CT
-27 5.5 moveto 
1 -1 scale
(-200) t 
GR
GR
GS
[0.75 0 0 0.75 61.25 247.74999] CT
0.149 GC
/Helvetica 13.333 F
GS
[1 0 0 1 0 0] CT
-27 5.5 moveto 
1 -1 scale
(-100) t 
GR
GR
GS
[0.75 0 0 0.75 61.25 193.25] CT
0.149 GC
/Helvetica 13.333 F
GS
[1 0 0 1 0 0] CT
-8 5.5 moveto 
1 -1 scale
(0) t 
GR
GR
GS
[0.75 0 0 0.75 61.25 138.75] CT
0.149 GC
/Helvetica 13.333 F
GS
[1 0 0 1 0 0] CT
-23 5.5 moveto 
1 -1 scale
(100) t 
GR
GR
GS
[0.75 0 0 0.75 61.25 84.25] CT
0.149 GC
/Helvetica 13.333 F
GS
[1 0 0 1 0 0] CT
-23 5.5 moveto 
1 -1 scale
(200) t 
GR
GR
GS
[0.75 0 0 0.75 61.25 29.75] CT
0.149 GC
/Helvetica 13.333 F
GS
[1 0 0 1 0 0] CT
-23 5.5 moveto 
1 -1 scale
(300) t 
GR
GR
GS
[0 -0.75 0.75 0 38 193.24984] CT
0.149 GC
/Helvetica 14.667 F
GS
[1 0 0 1 0 0] CT
-74.5 -4 moveto 
1 -1 scale
(Velocidad angular \(\260/s\)) t 
GR
GR
GS
[0.75 0 0 0.75 258.75025 27.68751] CT
/Helvetica-Bold 14.667 F
GS
[1 0 0 1 0 0] CT
-119 -4 moveto 
1 -1 scale
(Girosc\363pio de MPU6050 calibrado) t 
GR
GR
GS
[0.75 0 0 0.75 0 -0.25] CT
1 0 0 RC
1 LJ
0.667 LW
N
87 258.437 M
92.16 263.87 L
97.32 255.043 L
102.48 261.324 L
107.64 256.156 L
112.8 267.259 L
117.96 261.385 L
123.12 251.869 L
128.28 266.973 L
133.44 259.379 L
138.6 267.766 L
143.76 259.142 L
148.92 257.109 L
154.08 250.541 L
159.24 201.515 L
164.4 72.445 L
169.56 72.445 L
174.72 72.445 L
179.88 174.624 L
185.04 281.713 L
190.2 324.925 L
195.36 321.057 L
200.52 433.568 L
205.68 433.568 L
210.84 433.568 L
216 371.582 L
221.16 212.1 L
226.32 180.729 L
231.48 270.929 L
236.64 273.288 L
241.8 273.866 L
246.96 258.459 L
252.12 250.921 L
257.28 253.175 L
262.44 325.487 L
267.6 256.084 L
272.76 264.592 L
277.92 246.964 L
283.08 248.436 L
288.24 275.53 L
293.4 202.011 L
298.56 261.92 L
303.72 279.04 L
308.88 288.932 L
314.04 250.188 L
319.2 255.191 L
324.36 252.282 L
329.52 246.276 L
334.68 254.613 L
339.84 252.761 L
345 284.523 L
350.16 389.149 L
355.32 379.159 L
360.48 192.45 L
365.64 286.094 L
370.8 295.219 L
375.96 241.966 L
381.12 266.945 L
386.28 268.692 L
391.44 244.463 L
396.6 257.941 L
401.76 115.42 L
406.92 94.596 L
412.08 203.647 L
417.24 286.408 L
422.4 279.432 L
427.56 270.125 L
432.72 265.237 L
437.88 249.89 L
443.04 254.646 L
448.2 256.321 L
453.36 254.106 L
458.52 260.487 L
463.68 254.894 L
468.84 250.513 L
474 259.969 L
479.16 254.899 L
484.32 252.034 L
489.48 262.636 L
494.64 259.302 L
499.8 256.63 L
504.96 258.994 L
510.12 258.79 L
515.28 254.607 L
520.44 257.109 L
525.6 258.244 L
530.76 254.216 L
535.92 256.696 L
541.08 257.836 L
546.24 257.186 L
551.4 256.095 L
556.56 258.696 L
561.72 256.833 L
566.88 256.778 L
572.04 255.39 L
577.2 255.605 L
582.36 255.687 L
587.52 260.966 L
592.68 261.11 L
597.84 259.451 L
603 256.437 L
S
GR
GS
[0.75 0 0 0.75 0 -0.25] CT
0 1 0 RC
1 LJ
0.667 LW
N
87 256.261 M
92.16 244.915 L
97.32 256.999 L
102.48 252.762 L
107.64 255.363 L
112.8 254.327 L
117.96 249.593 L
123.12 259.259 L
128.28 257.716 L
133.44 262.515 L
138.6 254.459 L
143.76 257.336 L
148.92 254.85 L
154.08 252.861 L
159.24 243.835 L
164.4 357.867 L
169.56 284.64 L
174.72 373.66 L
179.88 212.123 L
185.04 248.475 L
190.2 253.104 L
195.36 251.412 L
200.52 300.465 L
205.68 387.182 L
210.84 172.084 L
216 119.245 L
221.16 252.068 L
226.32 247.935 L
231.48 239.851 L
236.64 248.106 L
241.8 254.961 L
246.96 271.519 L
252.12 325.929 L
257.28 438.523 L
262.44 438.523 L
267.6 274.098 L
272.76 253.28 L
277.92 253.225 L
283.08 237.652 L
288.24 174.586 L
293.4 77.399 L
298.56 176.928 L
303.72 149.062 L
308.88 272.269 L
314.04 322.38 L
319.2 262.477 L
324.36 266.56 L
329.52 257.798 L
334.68 263.623 L
339.84 272.792 L
345 266.565 L
350.16 226.582 L
355.32 245.841 L
360.48 232.814 L
365.64 266.229 L
370.8 260.686 L
375.96 261.827 L
381.12 263.055 L
386.28 236.925 L
391.44 255.379 L
396.6 249.985 L
401.76 345.805 L
406.92 331.004 L
412.08 170.023 L
417.24 229.828 L
422.4 253.473 L
427.56 249.048 L
432.72 257.099 L
437.88 259.92 L
443.04 257.831 L
448.2 256.636 L
453.36 261.865 L
458.52 259.237 L
463.68 251.384 L
468.84 259.699 L
474 260.636 L
479.16 256.25 L
484.32 253.131 L
489.48 257.038 L
494.64 256.228 L
499.8 255.225 L
504.96 254.823 L
510.12 258.553 L
515.28 259.314 L
520.44 253.908 L
525.6 256.195 L
530.76 254.206 L
535.92 254.713 L
541.08 257.914 L
546.24 253.699 L
551.4 254.173 L
556.56 257.082 L
561.72 253.919 L
566.88 256.2 L
572.04 253.374 L
577.2 254.839 L
582.36 252.42 L
587.52 258.09 L
592.68 255.324 L
597.84 253.401 L
603 253.754 L
S
GR
GS
[0.75 0 0 0.75 0 -0.25] CT
0 0 1 RC
1 LJ
0.667 LW
N
87 263.983 M
92.16 265.956 L
97.32 264.876 L
102.48 263.873 L
107.64 259.729 L
112.8 270.475 L
117.96 263.361 L
123.12 257.696 L
128.28 262.81 L
133.44 260.192 L
138.6 261.708 L
143.76 265.813 L
148.92 254.087 L
154.08 250.582 L
159.24 245.187 L
164.4 264.86 L
169.56 275.985 L
174.72 250.169 L
179.88 317.291 L
185.04 285.738 L
190.2 263.598 L
195.36 247.81 L
200.52 241.369 L
205.68 80.526 L
210.84 179.217 L
216 281.903 L
221.16 270.26 L
226.32 273.863 L
231.48 267.356 L
236.64 257.305 L
241.8 256.627 L
246.96 268.408 L
252.12 263.868 L
257.28 240.641 L
262.44 283.226 L
267.6 223.074 L
272.76 289.7 L
277.92 217.233 L
283.08 269.753 L
288.24 265.785 L
293.4 256.07 L
298.56 268.805 L
303.72 252.235 L
308.88 234.343 L
314.04 274.613 L
319.2 259.36 L
324.36 249.91 L
329.52 246.521 L
334.68 239.87 L
339.84 253.266 L
345 426.358 L
350.16 441.649 L
355.32 441.649 L
360.48 268.221 L
365.64 272.772 L
370.8 289.805 L
375.96 272.26 L
381.12 315.439 L
386.28 299.619 L
391.44 261.702 L
396.6 196.608 L
401.76 80.526 L
406.92 80.526 L
412.08 90.665 L
417.24 173.569 L
422.4 213.596 L
427.56 262.562 L
432.72 255.012 L
437.88 271.301 L
443.04 270.761 L
448.2 263.603 L
453.36 259.096 L
458.52 263.08 L
463.68 259.966 L
468.84 269.075 L
474 264.937 L
479.16 255.156 L
484.32 265.499 L
489.48 264.733 L
494.64 262.187 L
499.8 265.895 L
504.96 262.556 L
510.12 257.139 L
515.28 262.936 L
520.44 258.363 L
525.6 255.641 L
530.76 259.277 L
535.92 263.41 L
541.08 258.589 L
546.24 256.88 L
551.4 260.749 L
556.56 259.603 L
561.72 257.178 L
566.88 258.776 L
572.04 259.829 L
577.2 262.49 L
582.36 262.821 L
587.52 259.713 L
592.68 260.633 L
597.84 260.567 L
603 262.137 L
S
GR
GS
[0.75 0 0 0.75 0 -0.25] CT
1 GC
N
592 71 M
592 51 L
400 51 L
400 71 L
cp
f
GR
GS
[0.75 0 0 0.75 335.25 45.5] CT
/Helvetica 12 F
GS
[1 0 0 1 0 0] CT
0 5 moveto 
1 -1 scale
(ax) t 
GR
GR
GS
[0.75 0 0 0.75 0 -0.25] CT
1 0 0 RC
1 LJ
0.667 LW
N
404 61 M
444 61 L
S
GR
GS
[0.75 0 0 0.75 383.25 45.5] CT
/Helvetica 12 F
GS
[1 0 0 1 0 0] CT
0 5 moveto 
1 -1 scale
(ay) t 
GR
GR
GS
[0.75 0 0 0.75 0 -0.25] CT
0 1 0 RC
1 LJ
0.667 LW
N
468 61 M
508 61 L
S
GR
GS
[0.75 0 0 0.75 431.25 45.5] CT
/Helvetica 12 F
GS
[1 0 0 1 0 0] CT
0 5 moveto 
1 -1 scale
(az) t 
GR
GR
GS
[0.75 0 0 0.75 0 -0.25] CT
0 0 1 RC
1 LJ
0.667 LW
N
532 61 M
572 61 L
S
GR
GS
[0.75 0 0 0.75 0 -0.25] CT
0.149 GC
10.0 ML
0.667 LW
N
400 71 M
400 51 L
592 51 L
592 71 L
cp
S
GR
%%Trailer
%%Pages: 1
%%EOF
