%!PS-Adobe-3.0 EPSF-3.0
%%Title: /home/pi/Desktop/prue-ace.eps
%%Creator: matplotlib version 3.0.2, http://matplotlib.org/
%%CreationDate: Sun Apr 11 20:14:15 2021
%%Orientation: portrait
%%BoundingBox: -28 143 640 648
%%EndComments
%%BeginProlog
/mpldict 8 dict def
mpldict begin
/m { moveto } bind def
/l { lineto } bind def
/r { rlineto } bind def
/c { curveto } bind def
/cl { closepath } bind def
/box {
m
1 index 0 r
0 exch r
neg 0 r
cl
} bind def
/clipbox {
box
clip
newpath
} bind def
%!PS-Adobe-3.0 Resource-Font
%%Title: DejaVu Sans
%%Copyright: Copyright (c) 2003 by Bitstream, Inc. All Rights Reserved. Copyright (c) 2006 by Tavmjong Bah. All Rights Reserved. DejaVu changes are in public domain 
%%Creator: Converted from TrueType to type 3 by PPR
25 dict begin
/_d{bind def}bind def
/_m{moveto}_d
/_l{lineto}_d
/_cl{closepath eofill}_d
/_c{curveto}_d
/_sc{7 -1 roll{setcachedevice}{pop pop pop pop pop pop}ifelse}_d
/_e{exec}_d
/FontName /DejaVuSans def
/PaintType 0 def
/FontMatrix[.001 0 0 .001 0 0]def
/FontBBox[-1021 -463 1793 1232]def
/FontType 3 def
/Encoding [ /space /comma /period /zero /one /two /four /five /six /seven /eight /A /M /P /U /a /b /c /d /e /i /l /m /o /r /t /x /y /z /minus ] def
/FontInfo 10 dict dup begin
/FamilyName (DejaVu Sans) def
/FullName (DejaVu Sans) def
/Notice (Copyright (c) 2003 by Bitstream, Inc. All Rights Reserved. Copyright (c) 2006 by Tavmjong Bah. All Rights Reserved. DejaVu changes are in public domain ) def
/Weight (Book) def
/Version (Version 2.35) def
/ItalicAngle 0.0 def
/isFixedPitch false def
/UnderlinePosition -130 def
/UnderlineThickness 90 def
end readonly def
/CharStrings 31 dict dup begin
/.notdef 0 def
/space{318 0 0 0 0 0 _sc
}_d
/comma{318 0 77 -115 220 124 _sc
117 124 _m
220 124 _l
220 40 _l
140 -115 _l
77 -115 _l
117 40 _l
117 124 _l
_cl}_d
/period{318 0 107 0 210 124 _sc
107 124 _m
210 124 _l
210 0 _l
107 0 _l
107 124 _l
_cl}_d
/zero{636 0 66 -13 570 742 _sc
318 664 _m
267 664 229 639 203 589 _c
177 539 165 464 165 364 _c
165 264 177 189 203 139 _c
229 89 267 64 318 64 _c
369 64 407 89 433 139 _c
458 189 471 264 471 364 _c
471 464 458 539 433 589 _c
407 639 369 664 318 664 _c
318 742 _m
399 742 461 709 505 645 _c
548 580 570 486 570 364 _c
570 241 548 147 505 83 _c
461 19 399 -13 318 -13 _c
236 -13 173 19 130 83 _c
87 147 66 241 66 364 _c
66 486 87 580 130 645 _c
173 709 236 742 318 742 _c
_cl}_d
/one{636 0 110 0 544 729 _sc
124 83 _m
285 83 _l
285 639 _l
110 604 _l
110 694 _l
284 729 _l
383 729 _l
383 83 _l
544 83 _l
544 0 _l
124 0 _l
124 83 _l
_cl}_d
/two{{636 0 73 0 536 742 _sc
192 83 _m
536 83 _l
536 0 _l
73 0 _l
73 83 _l
110 121 161 173 226 239 _c
290 304 331 346 348 365 _c
380 400 402 430 414 455 _c
426 479 433 504 433 528 _c
433 566 419 598 392 622 _c
365 646 330 659 286 659 _c
255 659 222 653 188 643 _c
154 632 117 616 78 594 _c
78 694 _l
118 710 155 722 189 730 _c
223 738 255 742 284 742 _c
}_e{359 742 419 723 464 685 _c
509 647 532 597 532 534 _c
532 504 526 475 515 449 _c
504 422 484 390 454 354 _c
446 344 420 317 376 272 _c
332 227 271 164 192 83 _c
_cl}_e}_d
/four{636 0 49 0 580 729 _sc
378 643 _m
129 254 _l
378 254 _l
378 643 _l
352 729 _m
476 729 _l
476 254 _l
580 254 _l
580 172 _l
476 172 _l
476 0 _l
378 0 _l
378 172 _l
49 172 _l
49 267 _l
352 729 _l
_cl}_d
/five{{636 0 77 -13 549 729 _sc
108 729 _m
495 729 _l
495 646 _l
198 646 _l
198 467 _l
212 472 227 476 241 478 _c
255 480 270 482 284 482 _c
365 482 429 459 477 415 _c
525 370 549 310 549 234 _c
549 155 524 94 475 51 _c
426 8 357 -13 269 -13 _c
238 -13 207 -10 175 -6 _c
143 -1 111 6 77 17 _c
77 116 _l
106 100 136 88 168 80 _c
199 72 232 69 267 69 _c
}_e{323 69 368 83 401 113 _c
433 143 450 183 450 234 _c
450 284 433 324 401 354 _c
368 384 323 399 267 399 _c
241 399 214 396 188 390 _c
162 384 135 375 108 363 _c
108 729 _l
_cl}_e}_d
/six{{636 0 70 -13 573 742 _sc
330 404 _m
286 404 251 388 225 358 _c
199 328 186 286 186 234 _c
186 181 199 139 225 109 _c
251 79 286 64 330 64 _c
374 64 409 79 435 109 _c
461 139 474 181 474 234 _c
474 286 461 328 435 358 _c
409 388 374 404 330 404 _c
526 713 _m
526 623 _l
501 635 476 644 451 650 _c
425 656 400 659 376 659 _c
310 659 260 637 226 593 _c
}_e{192 549 172 482 168 394 _c
187 422 211 444 240 459 _c
269 474 301 482 336 482 _c
409 482 467 459 509 415 _c
551 371 573 310 573 234 _c
573 159 550 99 506 54 _c
462 9 403 -13 330 -13 _c
246 -13 181 19 137 83 _c
92 147 70 241 70 364 _c
70 479 97 571 152 639 _c
206 707 280 742 372 742 _c
396 742 421 739 447 735 _c
472 730 498 723 526 713 _c
_cl}_e}_d
/seven{636 0 82 0 551 729 _sc
82 729 _m
551 729 _l
551 687 _l
286 0 _l
183 0 _l
432 646 _l
82 646 _l
82 729 _l
_cl}_d
/eight{{636 0 68 -13 568 742 _sc
318 346 _m
271 346 234 333 207 308 _c
180 283 167 249 167 205 _c
167 161 180 126 207 101 _c
234 76 271 64 318 64 _c
364 64 401 76 428 102 _c
455 127 469 161 469 205 _c
469 249 455 283 429 308 _c
402 333 365 346 318 346 _c
219 388 _m
177 398 144 418 120 447 _c
96 476 85 511 85 553 _c
85 611 105 657 147 691 _c
188 725 245 742 318 742 _c
}_e{390 742 447 725 489 691 _c
530 657 551 611 551 553 _c
551 511 539 476 515 447 _c
491 418 459 398 417 388 _c
464 377 501 355 528 323 _c
554 291 568 251 568 205 _c
568 134 546 80 503 43 _c
459 5 398 -13 318 -13 _c
237 -13 175 5 132 43 _c
89 80 68 134 68 205 _c
68 251 81 291 108 323 _c
134 355 171 377 219 388 _c
183 544 _m
183 506 194 476 218 455 _c
}_e{242 434 275 424 318 424 _c
360 424 393 434 417 455 _c
441 476 453 506 453 544 _c
453 582 441 611 417 632 _c
393 653 360 664 318 664 _c
275 664 242 653 218 632 _c
194 611 183 582 183 544 _c
_cl}_e}_d
/A{684 0 8 0 676 729 _sc
342 632 _m
208 269 _l
476 269 _l
342 632 _l
286 729 _m
398 729 _l
676 0 _l
573 0 _l
507 187 _l
178 187 _l
112 0 _l
8 0 _l
286 729 _l
_cl}_d
/M{863 0 98 0 765 729 _sc
98 729 _m
245 729 _l
431 233 _l
618 729 _l
765 729 _l
765 0 _l
669 0 _l
669 640 _l
481 140 _l
382 140 _l
194 640 _l
194 0 _l
98 0 _l
98 729 _l
_cl}_d
/P{603 0 98 0 569 729 _sc
197 648 _m
197 374 _l
321 374 _l
367 374 402 385 427 409 _c
452 433 465 467 465 511 _c
465 555 452 588 427 612 _c
402 636 367 648 321 648 _c
197 648 _l
98 729 _m
321 729 _l
402 729 464 710 506 673 _c
548 636 569 582 569 511 _c
569 439 548 384 506 348 _c
464 311 402 293 321 293 _c
197 293 _l
197 0 _l
98 0 _l
98 729 _l
_cl}_d
/U{732 0 87 -13 645 729 _sc
87 729 _m
186 729 _l
186 286 _l
186 208 200 151 228 117 _c
256 83 302 66 366 66 _c
429 66 475 83 503 117 _c
531 151 546 208 546 286 _c
546 729 _l
645 729 _l
645 274 _l
645 178 621 107 574 59 _c
527 11 458 -13 366 -13 _c
274 -13 204 11 157 59 _c
110 107 87 178 87 274 _c
87 729 _l
_cl}_d
/a{{613 0 60 -13 522 560 _sc
343 275 _m
270 275 220 266 192 250 _c
164 233 150 205 150 165 _c
150 133 160 107 181 89 _c
202 70 231 61 267 61 _c
317 61 357 78 387 114 _c
417 149 432 196 432 255 _c
432 275 _l
343 275 _l
522 312 _m
522 0 _l
432 0 _l
432 83 _l
411 49 385 25 355 10 _c
325 -5 287 -13 243 -13 _c
187 -13 142 2 109 33 _c
76 64 60 106 60 159 _c
}_e{60 220 80 266 122 298 _c
163 329 224 345 306 345 _c
432 345 _l
432 354 _l
432 395 418 427 391 450 _c
364 472 326 484 277 484 _c
245 484 215 480 185 472 _c
155 464 127 453 100 439 _c
100 522 _l
132 534 164 544 195 550 _c
226 556 256 560 286 560 _c
365 560 424 539 463 498 _c
502 457 522 395 522 312 _c
_cl}_e}_d
/b{{635 0 91 -13 580 760 _sc
487 273 _m
487 339 473 390 446 428 _c
418 466 381 485 334 485 _c
286 485 249 466 222 428 _c
194 390 181 339 181 273 _c
181 207 194 155 222 117 _c
249 79 286 61 334 61 _c
381 61 418 79 446 117 _c
473 155 487 207 487 273 _c
181 464 _m
199 496 223 520 252 536 _c
281 552 316 560 356 560 _c
422 560 476 533 518 481 _c
559 428 580 359 580 273 _c
}_e{580 187 559 117 518 65 _c
476 13 422 -13 356 -13 _c
316 -13 281 -5 252 10 _c
223 25 199 49 181 82 _c
181 0 _l
91 0 _l
91 760 _l
181 760 _l
181 464 _l
_cl}_e}_d
/c{{550 0 55 -13 488 560 _sc
488 526 _m
488 442 _l
462 456 437 466 411 473 _c
385 480 360 484 334 484 _c
276 484 230 465 198 428 _c
166 391 150 339 150 273 _c
150 206 166 154 198 117 _c
230 80 276 62 334 62 _c
360 62 385 65 411 72 _c
437 79 462 90 488 104 _c
488 21 _l
462 9 436 0 410 -5 _c
383 -10 354 -13 324 -13 _c
242 -13 176 12 128 64 _c
}_e{79 115 55 185 55 273 _c
55 362 79 432 128 483 _c
177 534 244 560 330 560 _c
358 560 385 557 411 551 _c
437 545 463 537 488 526 _c
_cl}_e}_d
/d{{635 0 55 -13 544 760 _sc
454 464 _m
454 760 _l
544 760 _l
544 0 _l
454 0 _l
454 82 _l
435 49 411 25 382 10 _c
353 -5 319 -13 279 -13 _c
213 -13 159 13 117 65 _c
75 117 55 187 55 273 _c
55 359 75 428 117 481 _c
159 533 213 560 279 560 _c
319 560 353 552 382 536 _c
411 520 435 496 454 464 _c
148 273 _m
148 207 161 155 188 117 _c
215 79 253 61 301 61 _c
}_e{348 61 385 79 413 117 _c
440 155 454 207 454 273 _c
454 339 440 390 413 428 _c
385 466 348 485 301 485 _c
253 485 215 466 188 428 _c
161 390 148 339 148 273 _c
_cl}_e}_d
/e{{615 0 55 -13 562 560 _sc
562 296 _m
562 252 _l
149 252 _l
153 190 171 142 205 110 _c
238 78 284 62 344 62 _c
378 62 412 66 444 74 _c
476 82 509 95 541 113 _c
541 28 _l
509 14 476 3 442 -3 _c
408 -9 373 -13 339 -13 _c
251 -13 182 12 131 62 _c
80 112 55 181 55 268 _c
55 357 79 428 127 481 _c
175 533 241 560 323 560 _c
397 560 455 536 498 489 _c
}_e{540 441 562 377 562 296 _c
472 322 _m
471 371 457 410 431 440 _c
404 469 368 484 324 484 _c
274 484 234 469 204 441 _c
174 413 156 373 152 322 _c
472 322 _l
_cl}_e}_d
/i{278 0 94 0 184 760 _sc
94 547 _m
184 547 _l
184 0 _l
94 0 _l
94 547 _l
94 760 _m
184 760 _l
184 646 _l
94 646 _l
94 760 _l
_cl}_d
/l{278 0 94 0 184 760 _sc
94 760 _m
184 760 _l
184 0 _l
94 0 _l
94 760 _l
_cl}_d
/m{{974 0 91 0 889 560 _sc
520 442 _m
542 482 569 511 600 531 _c
631 550 668 560 711 560 _c
767 560 811 540 842 500 _c
873 460 889 403 889 330 _c
889 0 _l
799 0 _l
799 327 _l
799 379 789 418 771 444 _c
752 469 724 482 686 482 _c
639 482 602 466 575 435 _c
548 404 535 362 535 309 _c
535 0 _l
445 0 _l
445 327 _l
445 379 435 418 417 444 _c
398 469 369 482 331 482 _c
}_e{285 482 248 466 221 435 _c
194 404 181 362 181 309 _c
181 0 _l
91 0 _l
91 547 _l
181 547 _l
181 462 _l
201 495 226 520 255 536 _c
283 552 317 560 357 560 _c
397 560 430 550 458 530 _c
486 510 506 480 520 442 _c
_cl}_e}_d
/o{612 0 55 -13 557 560 _sc
306 484 _m
258 484 220 465 192 427 _c
164 389 150 338 150 273 _c
150 207 163 156 191 118 _c
219 80 257 62 306 62 _c
354 62 392 80 420 118 _c
448 156 462 207 462 273 _c
462 337 448 389 420 427 _c
392 465 354 484 306 484 _c
306 560 _m
384 560 445 534 490 484 _c
534 433 557 363 557 273 _c
557 183 534 113 490 63 _c
445 12 384 -13 306 -13 _c
227 -13 165 12 121 63 _c
77 113 55 183 55 273 _c
55 363 77 433 121 484 _c
165 534 227 560 306 560 _c
_cl}_d
/r{411 0 91 0 411 560 _sc
411 463 _m
401 469 390 473 378 476 _c
366 478 353 480 339 480 _c
288 480 249 463 222 430 _c
194 397 181 350 181 288 _c
181 0 _l
91 0 _l
91 547 _l
181 547 _l
181 462 _l
199 495 224 520 254 536 _c
284 552 321 560 365 560 _c
371 560 378 559 386 559 _c
393 558 401 557 411 555 _c
411 463 _l
_cl}_d
/t{392 0 27 0 368 702 _sc
183 702 _m
183 547 _l
368 547 _l
368 477 _l
183 477 _l
183 180 _l
183 135 189 106 201 94 _c
213 81 238 75 276 75 _c
368 75 _l
368 0 _l
276 0 _l
206 0 158 13 132 39 _c
106 65 93 112 93 180 _c
93 477 _l
27 477 _l
27 547 _l
93 547 _l
93 702 _l
183 702 _l
_cl}_d
/x{592 0 29 0 559 547 _sc
549 547 _m
351 281 _l
559 0 _l
453 0 _l
294 215 _l
135 0 _l
29 0 _l
241 286 _l
47 547 _l
153 547 _l
298 352 _l
443 547 _l
549 547 _l
_cl}_d
/y{592 0 30 -207 562 547 _sc
322 -50 _m
296 -114 271 -157 247 -177 _c
223 -197 191 -207 151 -207 _c
79 -207 _l
79 -132 _l
132 -132 _l
156 -132 175 -126 189 -114 _c
203 -102 218 -75 235 -31 _c
251 9 _l
30 547 _l
125 547 _l
296 119 _l
467 547 _l
562 547 _l
322 -50 _l
_cl}_d
/z{525 0 43 0 482 547 _sc
55 547 _m
482 547 _l
482 465 _l
144 72 _l
482 72 _l
482 0 _l
43 0 _l
43 82 _l
381 475 _l
55 475 _l
55 547 _l
_cl}_d
/minus{838 0 106 272 732 355 _sc
106 355 _m
732 355 _l
732 272 _l
106 272 _l
106 355 _l
_cl}_d
end readonly def

/BuildGlyph
 {exch begin
 CharStrings exch
 2 copy known not{pop /.notdef}if
 true 3 1 roll get exec
 end}_d

/BuildChar {
 1 index /Encoding get exch get
 1 index /BuildGlyph get exec
}_d

FontName currentdict end definefont pop
end
%%EndProlog
mpldict begin
-28.8 143.64 translate
669.6 504.72 0 0 clipbox
gsave
0 0 m
669.6 0 l
669.6 504.72 l
0 504.72 l
cl
1.000 setgray
fill
grestore
gsave
83.7 267.5016 m
319.581818 267.5016 l
319.581818 444.1536 l
83.7 444.1536 l
cl
1.000 setgray
fill
grestore
0.800 setlinewidth
1 setlinejoin
0 setlinecap
[] 0 setdash
0.000 setgray
gsave
/o {
gsave
newpath
translate
0.8 setlinewidth
1 setlinejoin
0 setlinecap
0 0 m
0 -3.5 l

gsave
0.000 setgray
fill
grestore
stroke
grestore
} bind def
92.2559 267.502 o
grestore
/DejaVuSans findfont
10.000 scalefont
setfont
gsave
89.076173 252.907850 translate
0.000000 rotate
0.000000 0.000000 m /zero glyphshow
grestore
gsave
/o {
gsave
newpath
translate
0.8 setlinewidth
1 setlinejoin
0 setlinecap
0 0 m
0 -3.5 l

gsave
0.000 setgray
fill
grestore
stroke
grestore
} bind def
135.577 267.502 o
grestore
gsave
129.217297 252.907850 translate
0.000000 rotate
0.000000 0.000000 m /two glyphshow
6.362305 0.000000 m /zero glyphshow
grestore
gsave
/o {
gsave
newpath
translate
0.8 setlinewidth
1 setlinejoin
0 setlinecap
0 0 m
0 -3.5 l

gsave
0.000 setgray
fill
grestore
stroke
grestore
} bind def
178.897 267.502 o
grestore
gsave
172.538108 252.907850 translate
0.000000 rotate
0.000000 0.000000 m /four glyphshow
6.362305 0.000000 m /zero glyphshow
grestore
gsave
/o {
gsave
newpath
translate
0.8 setlinewidth
1 setlinejoin
0 setlinecap
0 0 m
0 -3.5 l

gsave
0.000 setgray
fill
grestore
stroke
grestore
} bind def
222.218 267.502 o
grestore
gsave
215.858920 252.907850 translate
0.000000 rotate
0.000000 0.000000 m /six glyphshow
6.362305 0.000000 m /zero glyphshow
grestore
gsave
/o {
gsave
newpath
translate
0.8 setlinewidth
1 setlinejoin
0 setlinecap
0 0 m
0 -3.5 l

gsave
0.000 setgray
fill
grestore
stroke
grestore
} bind def
265.539 267.502 o
grestore
gsave
259.179731 252.907850 translate
0.000000 rotate
0.000000 0.000000 m /eight glyphshow
6.362305 0.000000 m /zero glyphshow
grestore
gsave
/o {
gsave
newpath
translate
0.8 setlinewidth
1 setlinejoin
0 setlinecap
0 0 m
0 -3.5 l

gsave
0.000 setgray
fill
grestore
stroke
grestore
} bind def
308.86 267.502 o
grestore
gsave
299.320855 252.907850 translate
0.000000 rotate
0.000000 0.000000 m /one glyphshow
6.362305 0.000000 m /zero glyphshow
12.724609 0.000000 m /zero glyphshow
grestore
gsave
/o {
gsave
newpath
translate
0.8 setlinewidth
1 setlinejoin
0 setlinecap
0 0 m
-3.5 0 l

gsave
0.000 setgray
fill
grestore
stroke
grestore
} bind def
83.7 307.55 o
grestore
gsave
52.418750 303.753289 translate
0.000000 rotate
0.000000 0.000000 m /minus glyphshow
8.378906 0.000000 m /zero glyphshow
14.741211 0.000000 m /period glyphshow
17.919922 0.000000 m /five glyphshow
grestore
gsave
/o {
gsave
newpath
translate
0.8 setlinewidth
1 setlinejoin
0 setlinecap
0 0 m
-3.5 0 l

gsave
0.000 setgray
fill
grestore
stroke
grestore
} bind def
83.7 350.054 o
grestore
gsave
60.793750 346.257024 translate
0.000000 rotate
0.000000 0.000000 m /zero glyphshow
6.362305 0.000000 m /period glyphshow
9.541016 0.000000 m /zero glyphshow
grestore
gsave
/o {
gsave
newpath
translate
0.8 setlinewidth
1 setlinejoin
0 setlinecap
0 0 m
-3.5 0 l

gsave
0.000 setgray
fill
grestore
stroke
grestore
} bind def
83.7 392.558 o
grestore
gsave
60.793750 388.760760 translate
0.000000 rotate
0.000000 0.000000 m /zero glyphshow
6.362305 0.000000 m /period glyphshow
9.541016 0.000000 m /five glyphshow
grestore
gsave
/o {
gsave
newpath
translate
0.8 setlinewidth
1 setlinejoin
0 setlinecap
0 0 m
-3.5 0 l

gsave
0.000 setgray
fill
grestore
stroke
grestore
} bind def
83.7 435.061 o
grestore
gsave
60.793750 431.264495 translate
0.000000 rotate
0.000000 0.000000 m /one glyphshow
6.362305 0.000000 m /period glyphshow
9.541016 0.000000 m /zero glyphshow
grestore
1.500 setlinewidth
2 setlinecap
0.122 0.467 0.706 setrgbcolor
gsave
235.9 176.7 83.7 267.5 clipbox
94.421901 351.178754 m
96.587941 351.241015 l
98.753982 349.559959 l
100.920023 350.05805 l
103.086063 351.220261 l
105.252104 350.929709 l
107.418144 351.033477 l
109.584185 350.888201 l
111.750225 349.72599 l
113.916266 349.061869 l
116.082307 332.126787 l
118.248347 288.232548 l
120.414388 275.531236 l
122.580428 384.218767 l
124.746469 436.123964 l
126.912509 418.856821 l
129.07855 423.526421 l
131.244591 392.375001 l
133.410631 380.213288 l
135.576672 332.14754 l
137.742712 320.421656 l
139.908753 307.720345 l
142.074793 314.112508 l
144.240834 321.293315 l
146.406875 339.058548 l
148.572915 352.631518 l
150.738956 354.354082 l
152.904996 347.754381 l
155.071037 340.781112 l
157.237077 337.169954 l
159.403118 345.097897 l
161.569159 359.812325 l
163.735199 347.505335 l
165.90124 342.773474 l
168.06728 341.465986 l
170.233321 343.956439 l
172.399361 359.189712 l
174.565402 352.423981 l
176.731443 334.554978 l
178.897483 362.427301 l
181.063524 335.986989 l
183.229564 352.673026 l
185.395605 340.38679 l
187.561645 363.963081 l
189.727686 359.251973 l
191.893727 349.580713 l
194.059767 350.722171 l
196.225808 337.958598 l
198.391848 344.018701 l
200.557889 345.824279 l
202.723929 357.736947 l
204.88997 353.980514 l
207.056011 345.533727 l
209.222051 353.295639 l
211.388092 348.584532 l
213.554132 350.05805 l
215.720173 350.05805 l
217.886213 349.248653 l
220.052254 335.530406 l
222.218295 357.882224 l
224.384335 358.919913 l
226.550376 339.639654 l
228.716416 355.163479 l
230.882457 349.684482 l
233.048497 326.585528 l
235.214538 331.462666 l
237.380579 336.65111 l
239.546619 346.073325 l
241.71266 353.461669 l
243.8787 346.405385 l
246.044741 327.270403 l
248.210781 289.706066 l
250.376822 337.792568 l
252.542863 328.183569 l
254.708903 333.164475 l
256.874944 395.529576 l
259.040984 364.295141 l
261.207025 359.418003 l
263.373065 354.312574 l
265.539106 356.118153 l
267.705147 353.752222 l
269.871187 358.753883 l
272.037228 353.503177 l
274.203268 353.544685 l
276.369309 357.197349 l
278.535349 354.623881 l
280.70139 358.338807 l
282.867431 355.516293 l
285.033471 356.387952 l
287.199512 358.380315 l
289.365552 359.314235 l
291.531593 357.674686 l
293.697633 357.985993 l
295.863674 356.076645 l
298.029715 360.310416 l
300.195755 358.214284 l
302.361796 355.952123 l
304.527836 357.09358 l
306.693877 358.504837 l
308.859917 359.39725 l
stroke
grestore
0.800 setlinewidth
0 setlinejoin
[] 0 setdash
0.000 setgray
gsave
83.7 267.5016 m
83.7 444.1536 l
stroke
grestore
gsave
319.581818 267.5016 m
319.581818 444.1536 l
stroke
grestore
gsave
83.7 267.5016 m
319.581818 267.5016 l
stroke
grestore
gsave
83.7 444.1536 m
319.581818 444.1536 l
stroke
grestore
/DejaVuSans findfont
12.000 scalefont
setfont
gsave
194.406534 450.153600 translate
0.000000 rotate
0.000000 0.000000 m /a glyphshow
7.353516 0.000000 m /x glyphshow
grestore
gsave
366.758182 267.5016 m
602.64 267.5016 l
602.64 444.1536 l
366.758182 444.1536 l
cl
1.000 setgray
fill
grestore
1 setlinejoin
0 setlinecap
[] 0 setdash
gsave
/o {
gsave
newpath
translate
0.8 setlinewidth
1 setlinejoin
0 setlinecap
0 0 m
0 -3.5 l

gsave
0.000 setgray
fill
grestore
stroke
grestore
} bind def
375.314 267.502 o
grestore
/DejaVuSans findfont
10.000 scalefont
setfont
gsave
372.134355 252.907850 translate
0.000000 rotate
0.000000 0.000000 m /zero glyphshow
grestore
gsave
/o {
gsave
newpath
translate
0.8 setlinewidth
1 setlinejoin
0 setlinecap
0 0 m
0 -3.5 l

gsave
0.000 setgray
fill
grestore
stroke
grestore
} bind def
418.635 267.502 o
grestore
gsave
412.275478 252.907850 translate
0.000000 rotate
0.000000 0.000000 m /two glyphshow
6.362305 0.000000 m /zero glyphshow
grestore
gsave
/o {
gsave
newpath
translate
0.8 setlinewidth
1 setlinejoin
0 setlinecap
0 0 m
0 -3.5 l

gsave
0.000 setgray
fill
grestore
stroke
grestore
} bind def
461.956 267.502 o
grestore
gsave
455.596290 252.907850 translate
0.000000 rotate
0.000000 0.000000 m /four glyphshow
6.362305 0.000000 m /zero glyphshow
grestore
gsave
/o {
gsave
newpath
translate
0.8 setlinewidth
1 setlinejoin
0 setlinecap
0 0 m
0 -3.5 l

gsave
0.000 setgray
fill
grestore
stroke
grestore
} bind def
505.276 267.502 o
grestore
gsave
498.917101 252.907850 translate
0.000000 rotate
0.000000 0.000000 m /six glyphshow
6.362305 0.000000 m /zero glyphshow
grestore
gsave
/o {
gsave
newpath
translate
0.8 setlinewidth
1 setlinejoin
0 setlinecap
0 0 m
0 -3.5 l

gsave
0.000 setgray
fill
grestore
stroke
grestore
} bind def
548.597 267.502 o
grestore
gsave
542.237913 252.907850 translate
0.000000 rotate
0.000000 0.000000 m /eight glyphshow
6.362305 0.000000 m /zero glyphshow
grestore
gsave
/o {
gsave
newpath
translate
0.8 setlinewidth
1 setlinejoin
0 setlinecap
0 0 m
0 -3.5 l

gsave
0.000 setgray
fill
grestore
stroke
grestore
} bind def
591.918 267.502 o
grestore
gsave
582.379037 252.907850 translate
0.000000 rotate
0.000000 0.000000 m /one glyphshow
6.362305 0.000000 m /zero glyphshow
12.724609 0.000000 m /zero glyphshow
grestore
gsave
/o {
gsave
newpath
translate
0.8 setlinewidth
1 setlinejoin
0 setlinecap
0 0 m
-3.5 0 l

gsave
0.000 setgray
fill
grestore
stroke
grestore
} bind def
366.758 285.112 o
grestore
gsave
329.117557 281.315517 translate
0.000000 rotate
0.000000 0.000000 m /minus glyphshow
8.378906 0.000000 m /zero glyphshow
14.741211 0.000000 m /period glyphshow
17.919922 0.000000 m /seven glyphshow
24.282227 0.000000 m /five glyphshow
grestore
gsave
/o {
gsave
newpath
translate
0.8 setlinewidth
1 setlinejoin
0 setlinecap
0 0 m
-3.5 0 l

gsave
0.000 setgray
fill
grestore
stroke
grestore
} bind def
366.758 307.76 o
grestore
gsave
329.117557 303.963493 translate
0.000000 rotate
0.000000 0.000000 m /minus glyphshow
8.378906 0.000000 m /zero glyphshow
14.741211 0.000000 m /period glyphshow
17.919922 0.000000 m /five glyphshow
24.282227 0.000000 m /zero glyphshow
grestore
gsave
/o {
gsave
newpath
translate
0.8 setlinewidth
1 setlinejoin
0 setlinecap
0 0 m
-3.5 0 l

gsave
0.000 setgray
fill
grestore
stroke
grestore
} bind def
366.758 330.408 o
grestore
gsave
329.117557 326.611468 translate
0.000000 rotate
0.000000 0.000000 m /minus glyphshow
8.378906 0.000000 m /zero glyphshow
14.741211 0.000000 m /period glyphshow
17.919922 0.000000 m /two glyphshow
24.282227 0.000000 m /five glyphshow
grestore
gsave
/o {
gsave
newpath
translate
0.8 setlinewidth
1 setlinejoin
0 setlinecap
0 0 m
-3.5 0 l

gsave
0.000 setgray
fill
grestore
stroke
grestore
} bind def
366.758 353.056 o
grestore
gsave
337.492557 349.259444 translate
0.000000 rotate
0.000000 0.000000 m /zero glyphshow
6.362305 0.000000 m /period glyphshow
9.541016 0.000000 m /zero glyphshow
15.903320 0.000000 m /zero glyphshow
grestore
gsave
/o {
gsave
newpath
translate
0.8 setlinewidth
1 setlinejoin
0 setlinecap
0 0 m
-3.5 0 l

gsave
0.000 setgray
fill
grestore
stroke
grestore
} bind def
366.758 375.704 o
grestore
gsave
337.492557 371.907420 translate
0.000000 rotate
0.000000 0.000000 m /zero glyphshow
6.362305 0.000000 m /period glyphshow
9.541016 0.000000 m /two glyphshow
15.903320 0.000000 m /five glyphshow
grestore
gsave
/o {
gsave
newpath
translate
0.8 setlinewidth
1 setlinejoin
0 setlinecap
0 0 m
-3.5 0 l

gsave
0.000 setgray
fill
grestore
stroke
grestore
} bind def
366.758 398.352 o
grestore
gsave
337.492557 394.555396 translate
0.000000 rotate
0.000000 0.000000 m /zero glyphshow
6.362305 0.000000 m /period glyphshow
9.541016 0.000000 m /five glyphshow
15.903320 0.000000 m /zero glyphshow
grestore
gsave
/o {
gsave
newpath
translate
0.8 setlinewidth
1 setlinejoin
0 setlinecap
0 0 m
-3.5 0 l

gsave
0.000 setgray
fill
grestore
stroke
grestore
} bind def
366.758 421 o
grestore
gsave
337.492557 417.203372 translate
0.000000 rotate
0.000000 0.000000 m /zero glyphshow
6.362305 0.000000 m /period glyphshow
9.541016 0.000000 m /seven glyphshow
15.903320 0.000000 m /five glyphshow
grestore
gsave
/o {
gsave
newpath
translate
0.8 setlinewidth
1 setlinejoin
0 setlinecap
0 0 m
-3.5 0 l

gsave
0.000 setgray
fill
grestore
stroke
grestore
} bind def
366.758 443.648 o
grestore
gsave
337.492557 439.851348 translate
0.000000 rotate
0.000000 0.000000 m /one glyphshow
6.362305 0.000000 m /period glyphshow
9.541016 0.000000 m /zero glyphshow
15.903320 0.000000 m /zero glyphshow
grestore
1.500 setlinewidth
2 setlinecap
0.122 0.467 0.706 setrgbcolor
gsave
235.9 176.7 366.8 267.5 clipbox
377.480083 357.718618 m
379.646123 357.364743 l
381.812164 357.276274 l
383.978204 358.957179 l
386.144245 358.780241 l
388.310285 357.38686 l
390.476326 357.784969 l
392.642367 358.40425 l
394.808407 357.873438 l
396.974448 355.882893 l
399.140488 360.04092 l
401.306529 351.127703 l
403.472569 368.755082 l
405.63861 371.364908 l
407.804651 327.705626 l
409.970691 358.492718 l
412.136732 375.124826 l
414.302772 354.157754 l
416.468813 345.996521 l
418.634853 360.881372 l
420.800894 354.511629 l
422.966935 345.598412 l
425.132975 361.67759 l
427.299016 351.348874 l
429.465056 356.9224 l
431.631097 357.453212 l
433.797137 356.457939 l
435.963178 357.873438 l
438.129219 355.949244 l
440.295259 353.649059 l
442.4613 351.017117 l
444.62734 360.394794 l
446.793381 359.266819 l
448.959421 350.619008 l
451.125462 371.984188 l
453.291503 436.123964 l
455.457543 418.209061 l
457.623584 358.780241 l
459.789624 321.557054 l
461.955665 286.191709 l
464.121705 291.588297 l
466.287746 275.531236 l
468.453787 307.977116 l
470.619827 304.836479 l
472.785868 349.66797 l
474.951908 383.838988 l
477.117949 394.698516 l
479.283989 421.305464 l
481.45003 379.725196 l
483.616071 368.22427 l
485.782111 342.524126 l
487.948152 343.806921 l
490.114192 361.898761 l
492.280233 356.281002 l
494.446273 363.292143 l
496.612314 354.7328 l
498.778355 353.892348 l
500.944395 351.857569 l
503.110436 351.171937 l
505.276476 342.148134 l
507.442517 362.451691 l
509.608557 343.652101 l
511.774598 357.54168 l
513.940639 364.729758 l
516.106679 358.160961 l
518.27272 366.034671 l
520.43876 353.715411 l
522.604801 354.135637 l
524.770841 358.890827 l
526.936882 341.329799 l
529.102923 349.800673 l
531.268963 341.816377 l
533.435004 332.549285 l
535.601044 299.152367 l
537.767085 343.099172 l
539.933125 356.878165 l
542.099166 359.952451 l
544.265207 340.821104 l
546.431247 347.522605 l
548.597288 351.061351 l
550.763328 347.655308 l
552.929369 350.950765 l
555.095409 351.105586 l
557.26145 352.432615 l
559.427491 350.818062 l
561.593531 350.110313 l
563.759572 350.84018 l
565.925612 350.950765 l
568.091653 348.274589 l
570.257693 349.314095 l
572.423734 350.419953 l
574.589775 351.017117 l
576.755815 351.547929 l
578.921856 349.557384 l
581.087896 349.269861 l
583.253937 350.795945 l
585.419977 349.690087 l
587.586018 351.238288 l
589.752059 349.867024 l
591.918099 350.818062 l
stroke
grestore
0.800 setlinewidth
0 setlinejoin
[] 0 setdash
0.000 setgray
gsave
366.758182 267.5016 m
366.758182 444.1536 l
stroke
grestore
gsave
602.64 267.5016 m
602.64 444.1536 l
stroke
grestore
gsave
366.758182 267.5016 m
602.64 267.5016 l
stroke
grestore
gsave
366.758182 444.1536 m
602.64 444.1536 l
stroke
grestore
/DejaVuSans findfont
12.000 scalefont
setfont
gsave
477.464716 450.153600 translate
0.000000 rotate
0.000000 0.000000 m /a glyphshow
7.353516 0.000000 m /y glyphshow
grestore
gsave
83.7 55.5192 m
319.581818 55.5192 l
319.581818 232.1712 l
83.7 232.1712 l
cl
1.000 setgray
fill
grestore
1 setlinejoin
0 setlinecap
[] 0 setdash
gsave
/o {
gsave
newpath
translate
0.8 setlinewidth
1 setlinejoin
0 setlinecap
0 0 m
0 -3.5 l

gsave
0.000 setgray
fill
grestore
stroke
grestore
} bind def
92.2559 55.5192 o
grestore
/DejaVuSans findfont
10.000 scalefont
setfont
gsave
89.076173 40.925450 translate
0.000000 rotate
0.000000 0.000000 m /zero glyphshow
grestore
gsave
/o {
gsave
newpath
translate
0.8 setlinewidth
1 setlinejoin
0 setlinecap
0 0 m
0 -3.5 l

gsave
0.000 setgray
fill
grestore
stroke
grestore
} bind def
135.577 55.5192 o
grestore
gsave
129.217297 40.925450 translate
0.000000 rotate
0.000000 0.000000 m /two glyphshow
6.362305 0.000000 m /zero glyphshow
grestore
gsave
/o {
gsave
newpath
translate
0.8 setlinewidth
1 setlinejoin
0 setlinecap
0 0 m
0 -3.5 l

gsave
0.000 setgray
fill
grestore
stroke
grestore
} bind def
178.897 55.5192 o
grestore
gsave
172.538108 40.925450 translate
0.000000 rotate
0.000000 0.000000 m /four glyphshow
6.362305 0.000000 m /zero glyphshow
grestore
gsave
/o {
gsave
newpath
translate
0.8 setlinewidth
1 setlinejoin
0 setlinecap
0 0 m
0 -3.5 l

gsave
0.000 setgray
fill
grestore
stroke
grestore
} bind def
222.218 55.5192 o
grestore
gsave
215.858920 40.925450 translate
0.000000 rotate
0.000000 0.000000 m /six glyphshow
6.362305 0.000000 m /zero glyphshow
grestore
gsave
/o {
gsave
newpath
translate
0.8 setlinewidth
1 setlinejoin
0 setlinecap
0 0 m
0 -3.5 l

gsave
0.000 setgray
fill
grestore
stroke
grestore
} bind def
265.539 55.5192 o
grestore
gsave
259.179731 40.925450 translate
0.000000 rotate
0.000000 0.000000 m /eight glyphshow
6.362305 0.000000 m /zero glyphshow
grestore
gsave
/o {
gsave
newpath
translate
0.8 setlinewidth
1 setlinejoin
0 setlinecap
0 0 m
0 -3.5 l

gsave
0.000 setgray
fill
grestore
stroke
grestore
} bind def
308.86 55.5192 o
grestore
gsave
299.320855 40.925450 translate
0.000000 rotate
0.000000 0.000000 m /one glyphshow
6.362305 0.000000 m /zero glyphshow
12.724609 0.000000 m /zero glyphshow
grestore
gsave
/o {
gsave
newpath
translate
0.8 setlinewidth
1 setlinejoin
0 setlinecap
0 0 m
-3.5 0 l

gsave
0.000 setgray
fill
grestore
stroke
grestore
} bind def
83.7 94.5614 o
grestore
gsave
60.793750 90.764532 translate
0.000000 rotate
0.000000 0.000000 m /zero glyphshow
6.362305 0.000000 m /period glyphshow
9.541016 0.000000 m /five glyphshow
grestore
gsave
/o {
gsave
newpath
translate
0.8 setlinewidth
1 setlinejoin
0 setlinecap
0 0 m
-3.5 0 l

gsave
0.000 setgray
fill
grestore
stroke
grestore
} bind def
83.7 136.906 o
grestore
gsave
60.793750 133.109570 translate
0.000000 rotate
0.000000 0.000000 m /one glyphshow
6.362305 0.000000 m /period glyphshow
9.541016 0.000000 m /zero glyphshow
grestore
gsave
/o {
gsave
newpath
translate
0.8 setlinewidth
1 setlinejoin
0 setlinecap
0 0 m
-3.5 0 l

gsave
0.000 setgray
fill
grestore
stroke
grestore
} bind def
83.7 179.251 o
grestore
gsave
60.793750 175.454607 translate
0.000000 rotate
0.000000 0.000000 m /one glyphshow
6.362305 0.000000 m /period glyphshow
9.541016 0.000000 m /five glyphshow
grestore
gsave
/o {
gsave
newpath
translate
0.8 setlinewidth
1 setlinejoin
0 setlinecap
0 0 m
-3.5 0 l

gsave
0.000 setgray
fill
grestore
stroke
grestore
} bind def
83.7 221.597 o
grestore
gsave
60.793750 217.799644 translate
0.000000 rotate
0.000000 0.000000 m /two glyphshow
6.362305 0.000000 m /period glyphshow
9.541016 0.000000 m /zero glyphshow
grestore
1.500 setlinewidth
2 setlinecap
0.122 0.467 0.706 setrgbcolor
gsave
235.9 176.7 83.7 55.52 clipbox
94.421901 138.66579 m
96.587941 138.893229 l
98.753982 138.851876 l
100.920023 139.740957 l
103.086063 141.022887 l
105.252104 138.396998 l
107.418144 137.466565 l
109.584185 138.086854 l
111.750225 138.148883 l
113.916266 139.079316 l
116.082307 155.082762 l
118.248347 158.887199 l
120.414388 124.729972 l
122.580428 121.215003 l
124.746469 116.10796 l
126.912509 121.607852 l
129.07855 127.149098 l
131.244591 100.931565 l
133.410631 113.668158 l
135.576672 142.408198 l
137.742712 143.607423 l
139.908753 157.233096 l
142.074793 166.351339 l
144.240834 131.429089 l
146.406875 135.088792 l
148.572915 140.154483 l
150.738956 143.152544 l
152.904996 137.507918 l
155.071037 138.521056 l
157.237077 140.919505 l
159.403118 145.116792 l
161.569159 135.605699 l
163.735199 139.22405 l
165.90124 137.900767 l
168.06728 151.009534 l
170.233321 159.404107 l
172.399361 128.906582 l
174.565402 119.684958 l
176.731443 119.085345 l
178.897483 130.891506 l
181.063524 137.301155 l
183.229564 144.517179 l
185.395605 141.95332 l
187.561645 131.553147 l
189.727686 107.796092 l
191.893727 124.647267 l
194.059767 143.917567 l
196.225808 157.543241 l
198.391848 129.671605 l
200.557889 150.699389 l
202.723929 139.182697 l
204.88997 141.498441 l
207.056011 138.893229 l
209.222051 134.137683 l
211.388092 146.708866 l
213.554132 138.769171 l
215.720173 136.763571 l
217.886213 136.8256 l
220.052254 164.449121 l
222.218295 224.141564 l
224.384335 200.239775 l
226.550376 125.432966 l
228.716416 111.765939 l
230.882457 88.112266 l
233.048497 95.845198 l
235.214538 106.555515 l
237.380579 104.715325 l
239.546619 104.446534 l
241.71266 87.347244 l
243.8787 63.548836 l
246.044741 81.309768 l
248.210781 145.40626 l
250.376822 198.585672 l
252.542863 184.091594 l
254.708903 200.818711 l
256.874944 149.127992 l
259.040984 151.299002 l
261.207025 147.41186 l
263.373065 131.92532 l
265.539106 135.419613 l
267.705147 138.562408 l
269.871187 133.972273 l
272.037228 136.722219 l
274.203268 136.019225 l
276.369309 137.342507 l
278.535349 137.135745 l
280.70139 138.293617 l
282.867431 135.419613 l
285.033471 134.406475 l
287.199512 138.024825 l
289.365552 138.603761 l
291.531593 136.350046 l
293.697633 138.045501 l
295.863674 134.385798 l
298.029715 137.135745 l
300.195755 136.474103 l
302.361796 136.308693 l
304.527836 135.895167 l
306.693877 138.769171 l
308.859917 137.466565 l
stroke
grestore
0.800 setlinewidth
0 setlinejoin
[] 0 setdash
0.000 setgray
gsave
83.7 55.5192 m
83.7 232.1712 l
stroke
grestore
gsave
319.581818 55.5192 m
319.581818 232.1712 l
stroke
grestore
gsave
83.7 55.5192 m
319.581818 55.5192 l
stroke
grestore
gsave
83.7 232.1712 m
319.581818 232.1712 l
stroke
grestore
/DejaVuSans findfont
12.000 scalefont
setfont
gsave
194.812784 238.171200 translate
0.000000 rotate
0.000000 0.000000 m /a glyphshow
7.353516 0.000000 m /z glyphshow
grestore
gsave
366.758182 55.5192 m
602.64 55.5192 l
602.64 232.1712 l
366.758182 232.1712 l
cl
1.000 setgray
fill
grestore
1 setlinejoin
0 setlinecap
[] 0 setdash
gsave
/o {
gsave
newpath
translate
0.8 setlinewidth
1 setlinejoin
0 setlinecap
0 0 m
0 -3.5 l

gsave
0.000 setgray
fill
grestore
stroke
grestore
} bind def
375.314 55.5192 o
grestore
/DejaVuSans findfont
10.000 scalefont
setfont
gsave
372.134355 40.925450 translate
0.000000 rotate
0.000000 0.000000 m /zero glyphshow
grestore
gsave
/o {
gsave
newpath
translate
0.8 setlinewidth
1 setlinejoin
0 setlinecap
0 0 m
0 -3.5 l

gsave
0.000 setgray
fill
grestore
stroke
grestore
} bind def
418.635 55.5192 o
grestore
gsave
412.275478 40.925450 translate
0.000000 rotate
0.000000 0.000000 m /two glyphshow
6.362305 0.000000 m /zero glyphshow
grestore
gsave
/o {
gsave
newpath
translate
0.8 setlinewidth
1 setlinejoin
0 setlinecap
0 0 m
0 -3.5 l

gsave
0.000 setgray
fill
grestore
stroke
grestore
} bind def
461.956 55.5192 o
grestore
gsave
455.596290 40.925450 translate
0.000000 rotate
0.000000 0.000000 m /four glyphshow
6.362305 0.000000 m /zero glyphshow
grestore
gsave
/o {
gsave
newpath
translate
0.8 setlinewidth
1 setlinejoin
0 setlinecap
0 0 m
0 -3.5 l

gsave
0.000 setgray
fill
grestore
stroke
grestore
} bind def
505.276 55.5192 o
grestore
gsave
498.917101 40.925450 translate
0.000000 rotate
0.000000 0.000000 m /six glyphshow
6.362305 0.000000 m /zero glyphshow
grestore
gsave
/o {
gsave
newpath
translate
0.8 setlinewidth
1 setlinejoin
0 setlinecap
0 0 m
0 -3.5 l

gsave
0.000 setgray
fill
grestore
stroke
grestore
} bind def
548.597 55.5192 o
grestore
gsave
542.237913 40.925450 translate
0.000000 rotate
0.000000 0.000000 m /eight glyphshow
6.362305 0.000000 m /zero glyphshow
grestore
gsave
/o {
gsave
newpath
translate
0.8 setlinewidth
1 setlinejoin
0 setlinecap
0 0 m
0 -3.5 l

gsave
0.000 setgray
fill
grestore
stroke
grestore
} bind def
591.918 55.5192 o
grestore
gsave
582.379037 40.925450 translate
0.000000 rotate
0.000000 0.000000 m /one glyphshow
6.362305 0.000000 m /zero glyphshow
12.724609 0.000000 m /zero glyphshow
grestore
gsave
/o {
gsave
newpath
translate
0.8 setlinewidth
1 setlinejoin
0 setlinecap
0 0 m
-3.5 0 l

gsave
0.000 setgray
fill
grestore
stroke
grestore
} bind def
366.758 56.7344 o
grestore
gsave
335.476932 52.937566 translate
0.000000 rotate
0.000000 0.000000 m /minus glyphshow
8.378906 0.000000 m /one glyphshow
14.741211 0.000000 m /period glyphshow
17.919922 0.000000 m /zero glyphshow
grestore
gsave
/o {
gsave
newpath
translate
0.8 setlinewidth
1 setlinejoin
0 setlinecap
0 0 m
-3.5 0 l

gsave
0.000 setgray
fill
grestore
stroke
grestore
} bind def
366.758 84.3589 o
grestore
gsave
335.476932 80.562036 translate
0.000000 rotate
0.000000 0.000000 m /minus glyphshow
8.378906 0.000000 m /zero glyphshow
14.741211 0.000000 m /period glyphshow
17.919922 0.000000 m /five glyphshow
grestore
gsave
/o {
gsave
newpath
translate
0.8 setlinewidth
1 setlinejoin
0 setlinecap
0 0 m
-3.5 0 l

gsave
0.000 setgray
fill
grestore
stroke
grestore
} bind def
366.758 111.983 o
grestore
gsave
343.851932 108.186506 translate
0.000000 rotate
0.000000 0.000000 m /zero glyphshow
6.362305 0.000000 m /period glyphshow
9.541016 0.000000 m /zero glyphshow
grestore
gsave
/o {
gsave
newpath
translate
0.8 setlinewidth
1 setlinejoin
0 setlinecap
0 0 m
-3.5 0 l

gsave
0.000 setgray
fill
grestore
stroke
grestore
} bind def
366.758 139.608 o
grestore
gsave
343.851932 135.810977 translate
0.000000 rotate
0.000000 0.000000 m /zero glyphshow
6.362305 0.000000 m /period glyphshow
9.541016 0.000000 m /five glyphshow
grestore
gsave
/o {
gsave
newpath
translate
0.8 setlinewidth
1 setlinejoin
0 setlinecap
0 0 m
-3.5 0 l

gsave
0.000 setgray
fill
grestore
stroke
grestore
} bind def
366.758 167.232 o
grestore
gsave
343.851932 163.435447 translate
0.000000 rotate
0.000000 0.000000 m /one glyphshow
6.362305 0.000000 m /period glyphshow
9.541016 0.000000 m /zero glyphshow
grestore
gsave
/o {
gsave
newpath
translate
0.8 setlinewidth
1 setlinejoin
0 setlinecap
0 0 m
-3.5 0 l

gsave
0.000 setgray
fill
grestore
stroke
grestore
} bind def
366.758 194.857 o
grestore
gsave
343.851932 191.059917 translate
0.000000 rotate
0.000000 0.000000 m /one glyphshow
6.362305 0.000000 m /period glyphshow
9.541016 0.000000 m /five glyphshow
grestore
gsave
/o {
gsave
newpath
translate
0.8 setlinewidth
1 setlinejoin
0 setlinecap
0 0 m
-3.5 0 l

gsave
0.000 setgray
fill
grestore
stroke
grestore
} bind def
366.758 222.481 o
grestore
gsave
343.851932 218.684388 translate
0.000000 rotate
0.000000 0.000000 m /two glyphshow
6.362305 0.000000 m /period glyphshow
9.541016 0.000000 m /zero glyphshow
grestore
1.500 setlinewidth
2 setlinecap
0.122 0.467 0.706 setrgbcolor
gsave
235.9 176.7 366.8 55.52 clipbox
377.480083 112.714459 m
379.646123 112.754924 l
381.812164 111.662355 l
383.978204 111.986079 l
386.144245 112.741436 l
388.310285 112.552597 l
390.476326 112.620039 l
392.642367 112.52562 l
394.808407 111.770263 l
396.974448 111.338631 l
399.140488 100.332006 l
401.306529 71.803805 l
403.472569 63.548836 l
405.63861 134.188168 l
407.804651 167.922934 l
409.970691 156.700493 l
412.136732 159.735408 l
414.302772 139.489153 l
416.468813 131.584885 l
418.634853 100.345494 l
420.800894 92.724485 l
422.966935 84.469517 l
425.132975 88.623978 l
427.299016 93.291003 l
429.465056 104.837168 l
431.631097 113.658654 l
433.797137 114.778201 l
435.963178 110.488854 l
438.129219 105.956715 l
440.295259 103.609714 l
442.4613 108.762325 l
444.62734 118.325679 l
446.793381 110.326992 l
448.959421 107.251612 l
451.125462 106.401836 l
453.291503 108.020457 l
455.457543 117.921024 l
457.623584 113.523769 l
459.789624 101.910161 l
461.955665 120.025232 l
464.121705 102.840869 l
466.287746 113.685631 l
468.453787 105.700433 l
470.619827 121.023381 l
472.785868 117.961489 l
474.951908 111.675843 l
477.117949 112.417711 l
479.283989 104.122277 l
481.45003 108.060922 l
483.616071 109.234423 l
485.782111 116.976828 l
487.948152 114.535408 l
490.114192 109.045584 l
492.280233 114.090287 l
494.446273 111.028395 l
496.612314 111.986079 l
498.778355 111.986079 l
500.944395 111.460027 l
503.110436 102.544121 l
505.276476 117.071248 l
507.442517 117.745673 l
509.608557 105.214847 l
511.774598 115.304253 l
513.940639 111.743286 l
516.106679 96.730573 l
518.27272 99.900373 l
520.43876 103.272501 l
522.604801 109.396285 l
524.770841 114.198195 l
526.936882 109.612101 l
529.102923 97.175694 l
531.268963 72.761489 l
533.435004 104.014369 l
535.601044 97.769189 l
537.767085 101.006431 l
539.933125 141.539407 l
542.099166 121.239198 l
544.265207 118.069398 l
546.431247 114.751224 l
548.597288 115.924724 l
550.763328 114.387034 l
552.929369 117.637765 l
555.095409 114.225172 l
557.26145 114.252149 l
559.427491 116.626127 l
561.593531 114.953551 l
563.759572 117.367995 l
565.925612 115.533557 l
568.091653 116.100075 l
570.257693 117.394972 l
572.423734 118.001955 l
574.589775 116.936363 l
576.755815 117.13869 l
578.921856 115.897747 l
581.087896 118.649403 l
583.253937 117.287064 l
585.419977 115.816816 l
587.586018 116.558684 l
589.752059 117.475903 l
591.918099 118.055909 l
stroke
grestore
1.000 0.498 0.055 setrgbcolor
gsave
235.9 176.7 366.8 55.52 clipbox
377.480083 114.826759 m
379.646123 114.610943 l
381.812164 114.556989 l
383.978204 115.582116 l
386.144245 115.474208 l
388.310285 114.624432 l
390.476326 114.867225 l
392.642367 115.244903 l
394.808407 114.921179 l
396.974448 113.707213 l
399.140488 116.243053 l
401.306529 110.807183 l
403.472569 121.557526 l
405.63861 123.149171 l
407.804651 96.52285 l
409.970691 115.298857 l
412.136732 125.442218 l
414.302772 112.655109 l
416.468813 107.677849 l
418.634853 116.755617 l
420.800894 112.870925 l
422.966935 107.435055 l
425.132975 117.241203 l
427.299016 110.942068 l
429.465056 114.341173 l
431.631097 114.664897 l
433.797137 114.057914 l
435.963178 114.921179 l
438.129219 113.747679 l
440.295259 112.344873 l
442.4613 110.739741 l
444.62734 116.458869 l
446.793381 115.770955 l
448.959421 110.496947 l
451.125462 123.526849 l
453.291503 162.643531 l
455.457543 151.717837 l
457.623584 115.474208 l
459.789624 92.773044 l
461.955665 71.204915 l
464.121705 74.496112 l
466.287746 64.703453 l
468.453787 84.491098 l
470.619827 82.57573 l
472.785868 109.916942 l
474.951908 130.756691 l
477.117949 137.37955 l
479.283989 153.606228 l
481.45003 128.247828 l
483.616071 121.233802 l
485.782111 105.560152 l
487.948152 106.342486 l
490.114192 117.376088 l
492.280233 113.950006 l
494.446273 118.225864 l
496.612314 113.005811 l
498.778355 112.493247 l
500.944395 111.252304 l
503.110436 110.83416 l
505.276476 105.330848 l
507.442517 117.713301 l
509.608557 106.248067 l
511.774598 114.718851 l
513.940639 119.102617 l
516.106679 115.09653 l
518.27272 119.89844 l
520.43876 112.385339 l
522.604801 112.641621 l
524.770841 115.541651 l
526.936882 104.831773 l
529.102923 109.997873 l
531.268963 105.12852 l
533.435004 99.476834 l
535.601044 79.109183 l
537.767085 105.910854 l
539.933125 114.314196 l
542.099166 116.189099 l
544.265207 104.521537 l
546.431247 108.608556 l
548.597288 110.766718 l
550.763328 108.689487 l
552.929369 110.699275 l
555.095409 110.793695 l
557.26145 111.603005 l
559.427491 110.618344 l
561.593531 110.186712 l
563.759572 110.631833 l
565.925612 110.699275 l
568.091653 109.067165 l
570.257693 109.701125 l
572.423734 110.375551 l
574.589775 110.739741 l
576.755815 111.063465 l
578.921856 109.849499 l
581.087896 109.674148 l
583.253937 110.604856 l
585.419977 109.93043 l
587.586018 110.874626 l
589.752059 110.038338 l
591.918099 110.618344 l
stroke
grestore
0.173 0.627 0.173 setrgbcolor
gsave
235.9 176.7 366.8 55.52 clipbox
377.480083 168.380059 m
379.646123 168.528433 l
381.812164 168.501456 l
383.978204 169.081462 l
386.144245 169.91775 l
388.310285 168.204709 l
390.476326 167.597726 l
392.642367 168.002381 l
394.808407 168.042847 l
396.974448 168.64983 l
399.140488 179.089937 l
401.306529 181.571823 l
403.472569 159.288803 l
405.63861 156.995756 l
407.804651 153.664094 l
409.970691 157.252038 l
412.136732 160.866959 l
414.302772 143.763527 l
416.468813 152.07245 l
418.634853 170.82148 l
420.800894 171.603814 l
422.966935 180.492742 l
425.132975 186.441176 l
427.299016 163.659081 l
429.465056 166.046547 l
431.631097 169.351232 l
433.797137 171.307066 l
435.963178 167.624703 l
438.129219 168.28564 l
440.295259 169.850307 l
442.4613 172.588475 l
444.62734 166.38376 l
446.793381 168.744249 l
448.959421 167.880985 l
451.125462 176.432701 l
453.291503 181.909036 l
455.457543 162.013482 l
457.623584 155.997606 l
459.789624 155.60644 l
461.955665 163.308379 l
464.121705 167.489818 l
466.287746 172.197308 l
468.453787 170.524733 l
470.619827 163.740012 l
472.785868 148.241713 l
474.951908 159.234849 l
477.117949 171.806141 l
479.283989 180.69507 l
481.45003 162.512557 l
483.616071 176.230373 l
485.782111 168.717272 l
487.948152 170.227985 l
490.114192 168.528433 l
492.280233 165.426076 l
494.446273 173.62709 l
496.612314 168.447502 l
498.778355 167.139116 l
500.944395 167.179582 l
503.110436 185.200233 l
505.276476 224.141564 l
507.442517 208.548845 l
509.608557 159.747413 l
511.774598 150.831507 l
513.940639 135.40065 l
516.106679 140.445353 l
518.27272 147.432402 l
520.43876 146.231925 l
522.604801 146.056574 l
524.770841 134.901575 l
526.936882 119.376299 l
529.102923 130.96293 l
531.268963 172.777314 l
533.435004 207.469764 l
535.601044 198.014318 l
537.767085 208.926523 l
539.933125 175.205246 l
542.099166 176.62154 l
544.265207 174.0857 l
546.431247 163.982805 l
548.597288 166.262363 l
550.763328 168.312617 l
552.929369 165.318168 l
555.095409 167.112139 l
557.26145 166.65353 l
559.427491 167.516795 l
561.593531 167.38191 l
563.759572 168.137266 l
565.925612 166.262363 l
568.091653 165.601426 l
570.257693 167.961916 l
572.423734 168.339594 l
574.589775 166.869346 l
576.755815 167.975404 l
578.921856 165.587938 l
581.087896 167.38191 l
583.253937 166.950277 l
585.419977 166.842369 l
587.586018 166.572599 l
589.752059 168.447502 l
591.918099 167.597726 l
stroke
grestore
0.800 setlinewidth
0 setlinejoin
[] 0 setdash
0.000 setgray
gsave
366.758182 55.5192 m
366.758182 232.1712 l
stroke
grestore
gsave
602.64 55.5192 m
602.64 232.1712 l
stroke
grestore
gsave
366.758182 55.5192 m
602.64 55.5192 l
stroke
grestore
gsave
366.758182 232.1712 m
602.64 232.1712 l
stroke
grestore
/DejaVuSans findfont
12.000 scalefont
setfont
gsave
452.222528 238.171200 translate
0.000000 rotate
0.000000 0.000000 m /a glyphshow
7.353516 0.000000 m /x glyphshow
14.455078 0.000000 m /comma glyphshow
18.269531 0.000000 m /space glyphshow
22.083984 0.000000 m /a glyphshow
29.437500 0.000000 m /y glyphshow
36.539062 0.000000 m /space glyphshow
40.353516 0.000000 m /y glyphshow
47.455078 0.000000 m /space glyphshow
51.269531 0.000000 m /a glyphshow
58.623047 0.000000 m /z glyphshow
grestore
gsave
234.143750 485.500600 translate
0.000000 rotate
0.000000 0.000000 m /A glyphshow
8.208984 0.000000 m /c glyphshow
14.806641 0.000000 m /e glyphshow
22.189453 0.000000 m /l glyphshow
25.523438 0.000000 m /e glyphshow
32.906250 0.000000 m /r glyphshow
37.839844 0.000000 m /o glyphshow
45.181641 0.000000 m /m glyphshow
56.871094 0.000000 m /e glyphshow
64.253906 0.000000 m /t glyphshow
68.958984 0.000000 m /r glyphshow
73.892578 0.000000 m /o glyphshow
81.234375 0.000000 m /space glyphshow
85.048828 0.000000 m /c glyphshow
91.646484 0.000000 m /a glyphshow
99.000000 0.000000 m /l glyphshow
102.333984 0.000000 m /i glyphshow
105.667969 0.000000 m /b glyphshow
113.285156 0.000000 m /r glyphshow
118.218750 0.000000 m /a glyphshow
125.572266 0.000000 m /d glyphshow
133.189453 0.000000 m /o glyphshow
140.531250 0.000000 m /space glyphshow
144.345703 0.000000 m /M glyphshow
154.699219 0.000000 m /P glyphshow
161.935547 0.000000 m /U glyphshow
170.718750 0.000000 m /six glyphshow
178.353516 0.000000 m /zero glyphshow
185.988281 0.000000 m /five glyphshow
193.623047 0.000000 m /zero glyphshow
grestore

end
showpage
