%!PS-Adobe-3.0 EPSF-3.0
%%Title: /home/pi/Desktop/GYRO-SI.eps
%%Creator: matplotlib version 3.0.2, http://matplotlib.org/
%%CreationDate: Sun Apr 11 20:01:57 2021
%%Orientation: portrait
%%BoundingBox: 7 163 604 628
%%EndComments
%%BeginProlog
/mpldict 8 dict def
mpldict begin
/m { moveto } bind def
/l { lineto } bind def
/r { rlineto } bind def
/c { curveto } bind def
/cl { closepath } bind def
/box {
m
1 index 0 r
0 exch r
neg 0 r
cl
} bind def
/clipbox {
box
clip
newpath
} bind def
%!PS-Adobe-3.0 Resource-Font
%%Title: DejaVu Sans
%%Copyright: Copyright (c) 2003 by Bitstream, Inc. All Rights Reserved. Copyright (c) 2006 by Tavmjong Bah. All Rights Reserved. DejaVu changes are in public domain 
%%Creator: Converted from TrueType to type 3 by PPR
25 dict begin
/_d{bind def}bind def
/_m{moveto}_d
/_l{lineto}_d
/_cl{closepath eofill}_d
/_c{curveto}_d
/_sc{7 -1 roll{setcachedevice}{pop pop pop pop pop pop}ifelse}_d
/_e{exec}_d
/FontName /DejaVuSans def
/PaintType 0 def
/FontMatrix[.001 0 0 .001 0 0]def
/FontBBox[-1021 -463 1793 1232]def
/FontType 3 def
/Encoding [ /space /comma /period /zero /one /two /three /four /five /six /eight /G /M /P /U /a /b /c /d /g /i /l /o /p /r /s /x /y /z /minus ] def
/FontInfo 10 dict dup begin
/FamilyName (DejaVu Sans) def
/FullName (DejaVu Sans) def
/Notice (Copyright (c) 2003 by Bitstream, Inc. All Rights Reserved. Copyright (c) 2006 by Tavmjong Bah. All Rights Reserved. DejaVu changes are in public domain ) def
/Weight (Book) def
/Version (Version 2.35) def
/ItalicAngle 0.0 def
/isFixedPitch false def
/UnderlinePosition -130 def
/UnderlineThickness 90 def
end readonly def
/CharStrings 31 dict dup begin
/.notdef 0 def
/space{318 0 0 0 0 0 _sc
}_d
/comma{318 0 77 -115 220 124 _sc
117 124 _m
220 124 _l
220 40 _l
140 -115 _l
77 -115 _l
117 40 _l
117 124 _l
_cl}_d
/period{318 0 107 0 210 124 _sc
107 124 _m
210 124 _l
210 0 _l
107 0 _l
107 124 _l
_cl}_d
/zero{636 0 66 -13 570 742 _sc
318 664 _m
267 664 229 639 203 589 _c
177 539 165 464 165 364 _c
165 264 177 189 203 139 _c
229 89 267 64 318 64 _c
369 64 407 89 433 139 _c
458 189 471 264 471 364 _c
471 464 458 539 433 589 _c
407 639 369 664 318 664 _c
318 742 _m
399 742 461 709 505 645 _c
548 580 570 486 570 364 _c
570 241 548 147 505 83 _c
461 19 399 -13 318 -13 _c
236 -13 173 19 130 83 _c
87 147 66 241 66 364 _c
66 486 87 580 130 645 _c
173 709 236 742 318 742 _c
_cl}_d
/one{636 0 110 0 544 729 _sc
124 83 _m
285 83 _l
285 639 _l
110 604 _l
110 694 _l
284 729 _l
383 729 _l
383 83 _l
544 83 _l
544 0 _l
124 0 _l
124 83 _l
_cl}_d
/two{{636 0 73 0 536 742 _sc
192 83 _m
536 83 _l
536 0 _l
73 0 _l
73 83 _l
110 121 161 173 226 239 _c
290 304 331 346 348 365 _c
380 400 402 430 414 455 _c
426 479 433 504 433 528 _c
433 566 419 598 392 622 _c
365 646 330 659 286 659 _c
255 659 222 653 188 643 _c
154 632 117 616 78 594 _c
78 694 _l
118 710 155 722 189 730 _c
223 738 255 742 284 742 _c
}_e{359 742 419 723 464 685 _c
509 647 532 597 532 534 _c
532 504 526 475 515 449 _c
504 422 484 390 454 354 _c
446 344 420 317 376 272 _c
332 227 271 164 192 83 _c
_cl}_e}_d
/three{{636 0 76 -13 556 742 _sc
406 393 _m
453 383 490 362 516 330 _c
542 298 556 258 556 212 _c
556 140 531 84 482 45 _c
432 6 362 -13 271 -13 _c
240 -13 208 -10 176 -4 _c
144 1 110 10 76 22 _c
76 117 _l
103 101 133 89 166 81 _c
198 73 232 69 268 69 _c
330 69 377 81 409 105 _c
441 129 458 165 458 212 _c
458 254 443 288 413 312 _c
383 336 341 349 287 349 _c
}_e{202 349 _l
202 430 _l
291 430 _l
339 430 376 439 402 459 _c
428 478 441 506 441 543 _c
441 580 427 609 401 629 _c
374 649 336 659 287 659 _c
260 659 231 656 200 650 _c
169 644 135 635 98 623 _c
98 711 _l
135 721 170 729 203 734 _c
235 739 266 742 296 742 _c
370 742 429 725 473 691 _c
517 657 539 611 539 553 _c
539 513 527 479 504 451 _c
481 423 448 403 406 393 _c
_cl}_e}_d
/four{636 0 49 0 580 729 _sc
378 643 _m
129 254 _l
378 254 _l
378 643 _l
352 729 _m
476 729 _l
476 254 _l
580 254 _l
580 172 _l
476 172 _l
476 0 _l
378 0 _l
378 172 _l
49 172 _l
49 267 _l
352 729 _l
_cl}_d
/five{{636 0 77 -13 549 729 _sc
108 729 _m
495 729 _l
495 646 _l
198 646 _l
198 467 _l
212 472 227 476 241 478 _c
255 480 270 482 284 482 _c
365 482 429 459 477 415 _c
525 370 549 310 549 234 _c
549 155 524 94 475 51 _c
426 8 357 -13 269 -13 _c
238 -13 207 -10 175 -6 _c
143 -1 111 6 77 17 _c
77 116 _l
106 100 136 88 168 80 _c
199 72 232 69 267 69 _c
}_e{323 69 368 83 401 113 _c
433 143 450 183 450 234 _c
450 284 433 324 401 354 _c
368 384 323 399 267 399 _c
241 399 214 396 188 390 _c
162 384 135 375 108 363 _c
108 729 _l
_cl}_e}_d
/six{{636 0 70 -13 573 742 _sc
330 404 _m
286 404 251 388 225 358 _c
199 328 186 286 186 234 _c
186 181 199 139 225 109 _c
251 79 286 64 330 64 _c
374 64 409 79 435 109 _c
461 139 474 181 474 234 _c
474 286 461 328 435 358 _c
409 388 374 404 330 404 _c
526 713 _m
526 623 _l
501 635 476 644 451 650 _c
425 656 400 659 376 659 _c
310 659 260 637 226 593 _c
}_e{192 549 172 482 168 394 _c
187 422 211 444 240 459 _c
269 474 301 482 336 482 _c
409 482 467 459 509 415 _c
551 371 573 310 573 234 _c
573 159 550 99 506 54 _c
462 9 403 -13 330 -13 _c
246 -13 181 19 137 83 _c
92 147 70 241 70 364 _c
70 479 97 571 152 639 _c
206 707 280 742 372 742 _c
396 742 421 739 447 735 _c
472 730 498 723 526 713 _c
_cl}_e}_d
/eight{{636 0 68 -13 568 742 _sc
318 346 _m
271 346 234 333 207 308 _c
180 283 167 249 167 205 _c
167 161 180 126 207 101 _c
234 76 271 64 318 64 _c
364 64 401 76 428 102 _c
455 127 469 161 469 205 _c
469 249 455 283 429 308 _c
402 333 365 346 318 346 _c
219 388 _m
177 398 144 418 120 447 _c
96 476 85 511 85 553 _c
85 611 105 657 147 691 _c
188 725 245 742 318 742 _c
}_e{390 742 447 725 489 691 _c
530 657 551 611 551 553 _c
551 511 539 476 515 447 _c
491 418 459 398 417 388 _c
464 377 501 355 528 323 _c
554 291 568 251 568 205 _c
568 134 546 80 503 43 _c
459 5 398 -13 318 -13 _c
237 -13 175 5 132 43 _c
89 80 68 134 68 205 _c
68 251 81 291 108 323 _c
134 355 171 377 219 388 _c
183 544 _m
183 506 194 476 218 455 _c
}_e{242 434 275 424 318 424 _c
360 424 393 434 417 455 _c
441 476 453 506 453 544 _c
453 582 441 611 417 632 _c
393 653 360 664 318 664 _c
275 664 242 653 218 632 _c
194 611 183 582 183 544 _c
_cl}_e}_d
/G{{775 0 56 -13 693 742 _sc
595 104 _m
595 300 _l
434 300 _l
434 381 _l
693 381 _l
693 68 _l
655 40 613 20 567 7 _c
521 -6 472 -13 420 -13 _c
306 -13 216 20 152 86 _c
88 152 56 245 56 364 _c
56 482 88 575 152 642 _c
216 708 306 742 420 742 _c
467 742 512 736 555 724 _c
598 712 638 695 674 673 _c
674 568 _l
637 598 598 621 557 637 _c
516 653 473 661 428 661 _c
}_e{338 661 271 636 227 586 _c
182 536 160 462 160 364 _c
160 265 182 191 227 141 _c
271 91 338 67 428 67 _c
462 67 493 70 521 76 _c
549 82 573 91 595 104 _c
_cl}_e}_d
/M{863 0 98 0 765 729 _sc
98 729 _m
245 729 _l
431 233 _l
618 729 _l
765 729 _l
765 0 _l
669 0 _l
669 640 _l
481 140 _l
382 140 _l
194 640 _l
194 0 _l
98 0 _l
98 729 _l
_cl}_d
/P{603 0 98 0 569 729 _sc
197 648 _m
197 374 _l
321 374 _l
367 374 402 385 427 409 _c
452 433 465 467 465 511 _c
465 555 452 588 427 612 _c
402 636 367 648 321 648 _c
197 648 _l
98 729 _m
321 729 _l
402 729 464 710 506 673 _c
548 636 569 582 569 511 _c
569 439 548 384 506 348 _c
464 311 402 293 321 293 _c
197 293 _l
197 0 _l
98 0 _l
98 729 _l
_cl}_d
/U{732 0 87 -13 645 729 _sc
87 729 _m
186 729 _l
186 286 _l
186 208 200 151 228 117 _c
256 83 302 66 366 66 _c
429 66 475 83 503 117 _c
531 151 546 208 546 286 _c
546 729 _l
645 729 _l
645 274 _l
645 178 621 107 574 59 _c
527 11 458 -13 366 -13 _c
274 -13 204 11 157 59 _c
110 107 87 178 87 274 _c
87 729 _l
_cl}_d
/a{{613 0 60 -13 522 560 _sc
343 275 _m
270 275 220 266 192 250 _c
164 233 150 205 150 165 _c
150 133 160 107 181 89 _c
202 70 231 61 267 61 _c
317 61 357 78 387 114 _c
417 149 432 196 432 255 _c
432 275 _l
343 275 _l
522 312 _m
522 0 _l
432 0 _l
432 83 _l
411 49 385 25 355 10 _c
325 -5 287 -13 243 -13 _c
187 -13 142 2 109 33 _c
76 64 60 106 60 159 _c
}_e{60 220 80 266 122 298 _c
163 329 224 345 306 345 _c
432 345 _l
432 354 _l
432 395 418 427 391 450 _c
364 472 326 484 277 484 _c
245 484 215 480 185 472 _c
155 464 127 453 100 439 _c
100 522 _l
132 534 164 544 195 550 _c
226 556 256 560 286 560 _c
365 560 424 539 463 498 _c
502 457 522 395 522 312 _c
_cl}_e}_d
/b{{635 0 91 -13 580 760 _sc
487 273 _m
487 339 473 390 446 428 _c
418 466 381 485 334 485 _c
286 485 249 466 222 428 _c
194 390 181 339 181 273 _c
181 207 194 155 222 117 _c
249 79 286 61 334 61 _c
381 61 418 79 446 117 _c
473 155 487 207 487 273 _c
181 464 _m
199 496 223 520 252 536 _c
281 552 316 560 356 560 _c
422 560 476 533 518 481 _c
559 428 580 359 580 273 _c
}_e{580 187 559 117 518 65 _c
476 13 422 -13 356 -13 _c
316 -13 281 -5 252 10 _c
223 25 199 49 181 82 _c
181 0 _l
91 0 _l
91 760 _l
181 760 _l
181 464 _l
_cl}_e}_d
/c{{550 0 55 -13 488 560 _sc
488 526 _m
488 442 _l
462 456 437 466 411 473 _c
385 480 360 484 334 484 _c
276 484 230 465 198 428 _c
166 391 150 339 150 273 _c
150 206 166 154 198 117 _c
230 80 276 62 334 62 _c
360 62 385 65 411 72 _c
437 79 462 90 488 104 _c
488 21 _l
462 9 436 0 410 -5 _c
383 -10 354 -13 324 -13 _c
242 -13 176 12 128 64 _c
}_e{79 115 55 185 55 273 _c
55 362 79 432 128 483 _c
177 534 244 560 330 560 _c
358 560 385 557 411 551 _c
437 545 463 537 488 526 _c
_cl}_e}_d
/d{{635 0 55 -13 544 760 _sc
454 464 _m
454 760 _l
544 760 _l
544 0 _l
454 0 _l
454 82 _l
435 49 411 25 382 10 _c
353 -5 319 -13 279 -13 _c
213 -13 159 13 117 65 _c
75 117 55 187 55 273 _c
55 359 75 428 117 481 _c
159 533 213 560 279 560 _c
319 560 353 552 382 536 _c
411 520 435 496 454 464 _c
148 273 _m
148 207 161 155 188 117 _c
215 79 253 61 301 61 _c
}_e{348 61 385 79 413 117 _c
440 155 454 207 454 273 _c
454 339 440 390 413 428 _c
385 466 348 485 301 485 _c
253 485 215 466 188 428 _c
161 390 148 339 148 273 _c
_cl}_e}_d
/g{{635 0 55 -207 544 560 _sc
454 280 _m
454 344 440 395 414 431 _c
387 467 349 485 301 485 _c
253 485 215 467 188 431 _c
161 395 148 344 148 280 _c
148 215 161 165 188 129 _c
215 93 253 75 301 75 _c
349 75 387 93 414 129 _c
440 165 454 215 454 280 _c
544 68 _m
544 -24 523 -93 482 -139 _c
440 -184 377 -207 292 -207 _c
260 -207 231 -204 203 -200 _c
175 -195 147 -188 121 -178 _c
}_e{121 -91 _l
147 -105 173 -115 199 -122 _c
225 -129 251 -133 278 -133 _c
336 -133 380 -117 410 -87 _c
439 -56 454 -10 454 52 _c
454 96 _l
435 64 411 40 382 24 _c
353 8 319 0 279 0 _c
211 0 157 25 116 76 _c
75 127 55 195 55 280 _c
55 364 75 432 116 483 _c
157 534 211 560 279 560 _c
319 560 353 552 382 536 _c
411 520 435 496 454 464 _c
454 547 _l
544 547 _l
}_e{544 68 _l
_cl}_e}_d
/i{278 0 94 0 184 760 _sc
94 547 _m
184 547 _l
184 0 _l
94 0 _l
94 547 _l
94 760 _m
184 760 _l
184 646 _l
94 646 _l
94 760 _l
_cl}_d
/l{278 0 94 0 184 760 _sc
94 760 _m
184 760 _l
184 0 _l
94 0 _l
94 760 _l
_cl}_d
/o{612 0 55 -13 557 560 _sc
306 484 _m
258 484 220 465 192 427 _c
164 389 150 338 150 273 _c
150 207 163 156 191 118 _c
219 80 257 62 306 62 _c
354 62 392 80 420 118 _c
448 156 462 207 462 273 _c
462 337 448 389 420 427 _c
392 465 354 484 306 484 _c
306 560 _m
384 560 445 534 490 484 _c
534 433 557 363 557 273 _c
557 183 534 113 490 63 _c
445 12 384 -13 306 -13 _c
227 -13 165 12 121 63 _c
77 113 55 183 55 273 _c
55 363 77 433 121 484 _c
165 534 227 560 306 560 _c
_cl}_d
/p{{635 0 91 -207 580 560 _sc
181 82 _m
181 -207 _l
91 -207 _l
91 547 _l
181 547 _l
181 464 _l
199 496 223 520 252 536 _c
281 552 316 560 356 560 _c
422 560 476 533 518 481 _c
559 428 580 359 580 273 _c
580 187 559 117 518 65 _c
476 13 422 -13 356 -13 _c
316 -13 281 -5 252 10 _c
223 25 199 49 181 82 _c
487 273 _m
487 339 473 390 446 428 _c
418 466 381 485 334 485 _c
}_e{286 485 249 466 222 428 _c
194 390 181 339 181 273 _c
181 207 194 155 222 117 _c
249 79 286 61 334 61 _c
381 61 418 79 446 117 _c
473 155 487 207 487 273 _c
_cl}_e}_d
/r{411 0 91 0 411 560 _sc
411 463 _m
401 469 390 473 378 476 _c
366 478 353 480 339 480 _c
288 480 249 463 222 430 _c
194 397 181 350 181 288 _c
181 0 _l
91 0 _l
91 547 _l
181 547 _l
181 462 _l
199 495 224 520 254 536 _c
284 552 321 560 365 560 _c
371 560 378 559 386 559 _c
393 558 401 557 411 555 _c
411 463 _l
_cl}_d
/s{{521 0 54 -13 472 560 _sc
443 531 _m
443 446 _l
417 458 391 468 364 475 _c
336 481 308 485 279 485 _c
234 485 200 478 178 464 _c
156 450 145 430 145 403 _c
145 382 153 366 169 354 _c
185 342 217 330 265 320 _c
296 313 _l
360 299 405 279 432 255 _c
458 230 472 195 472 151 _c
472 100 452 60 412 31 _c
372 1 316 -13 246 -13 _c
216 -13 186 -10 154 -5 _c
}_e{122 0 89 8 54 20 _c
54 113 _l
87 95 120 82 152 74 _c
184 65 216 61 248 61 _c
290 61 323 68 346 82 _c
368 96 380 117 380 144 _c
380 168 371 187 355 200 _c
339 213 303 226 247 238 _c
216 245 _l
160 257 119 275 95 299 _c
70 323 58 356 58 399 _c
58 450 76 490 112 518 _c
148 546 200 560 268 560 _c
301 560 332 557 362 552 _c
391 547 418 540 443 531 _c
}_e{_cl}_e}_d
/x{592 0 29 0 559 547 _sc
549 547 _m
351 281 _l
559 0 _l
453 0 _l
294 215 _l
135 0 _l
29 0 _l
241 286 _l
47 547 _l
153 547 _l
298 352 _l
443 547 _l
549 547 _l
_cl}_d
/y{592 0 30 -207 562 547 _sc
322 -50 _m
296 -114 271 -157 247 -177 _c
223 -197 191 -207 151 -207 _c
79 -207 _l
79 -132 _l
132 -132 _l
156 -132 175 -126 189 -114 _c
203 -102 218 -75 235 -31 _c
251 9 _l
30 547 _l
125 547 _l
296 119 _l
467 547 _l
562 547 _l
322 -50 _l
_cl}_d
/z{525 0 43 0 482 547 _sc
55 547 _m
482 547 _l
482 465 _l
144 72 _l
482 72 _l
482 0 _l
43 0 _l
43 82 _l
381 475 _l
55 475 _l
55 547 _l
_cl}_d
/minus{838 0 106 272 732 355 _sc
106 355 _m
732 355 _l
732 272 _l
106 272 _l
106 355 _l
_cl}_d
end readonly def

/BuildGlyph
 {exch begin
 CharStrings exch
 2 copy known not{pop /.notdef}if
 true 3 1 roll get exec
 end}_d

/BuildChar {
 1 index /Encoding get exch get
 1 index /BuildGlyph get exec
}_d

FontName currentdict end definefont pop
end
%%EndProlog
mpldict begin
7.2 163.08 translate
597.6 465.84 0 0 clipbox
gsave
0 0 m
597.6 0 l
597.6 465.84 l
0 465.84 l
cl
1.000 setgray
fill
grestore
gsave
74.7 246.8952 m
285.218182 246.8952 l
285.218182 409.9392 l
74.7 409.9392 l
cl
1.000 setgray
fill
grestore
0.800 setlinewidth
1 setlinejoin
0 setlinecap
[] 0 setdash
0.000 setgray
gsave
/o {
gsave
newpath
translate
0.8 setlinewidth
1 setlinejoin
0 setlinecap
0 0 m
0 -3.5 l

gsave
0.000 setgray
fill
grestore
stroke
grestore
} bind def
82.3359 246.895 o
grestore
/DejaVuSans findfont
10.000 scalefont
setfont
gsave
79.156188 232.301450 translate
0.000000 rotate
0.000000 0.000000 m /zero glyphshow
grestore
gsave
/o {
gsave
newpath
translate
0.8 setlinewidth
1 setlinejoin
0 setlinecap
0 0 m
0 -3.5 l

gsave
0.000 setgray
fill
grestore
stroke
grestore
} bind def
120.999 246.895 o
grestore
gsave
114.639160 232.301450 translate
0.000000 rotate
0.000000 0.000000 m /two glyphshow
6.362305 0.000000 m /zero glyphshow
grestore
gsave
/o {
gsave
newpath
translate
0.8 setlinewidth
1 setlinejoin
0 setlinecap
0 0 m
0 -3.5 l

gsave
0.000 setgray
fill
grestore
stroke
grestore
} bind def
159.661 246.895 o
grestore
gsave
153.301820 232.301450 translate
0.000000 rotate
0.000000 0.000000 m /four glyphshow
6.362305 0.000000 m /zero glyphshow
grestore
gsave
/o {
gsave
newpath
translate
0.8 setlinewidth
1 setlinejoin
0 setlinecap
0 0 m
0 -3.5 l

gsave
0.000 setgray
fill
grestore
stroke
grestore
} bind def
198.324 246.895 o
grestore
gsave
191.964479 232.301450 translate
0.000000 rotate
0.000000 0.000000 m /six glyphshow
6.362305 0.000000 m /zero glyphshow
grestore
gsave
/o {
gsave
newpath
translate
0.8 setlinewidth
1 setlinejoin
0 setlinecap
0 0 m
0 -3.5 l

gsave
0.000 setgray
fill
grestore
stroke
grestore
} bind def
236.987 246.895 o
grestore
gsave
230.627139 232.301450 translate
0.000000 rotate
0.000000 0.000000 m /eight glyphshow
6.362305 0.000000 m /zero glyphshow
grestore
gsave
/o {
gsave
newpath
translate
0.8 setlinewidth
1 setlinejoin
0 setlinecap
0 0 m
0 -3.5 l

gsave
0.000 setgray
fill
grestore
stroke
grestore
} bind def
275.649 246.895 o
grestore
gsave
266.110111 232.301450 translate
0.000000 rotate
0.000000 0.000000 m /one glyphshow
6.362305 0.000000 m /zero glyphshow
12.724609 0.000000 m /zero glyphshow
grestore
gsave
/o {
gsave
newpath
translate
0.8 setlinewidth
1 setlinejoin
0 setlinecap
0 0 m
-3.5 0 l

gsave
0.000 setgray
fill
grestore
stroke
grestore
} bind def
74.7 265.296 o
grestore
gsave
43.418750 261.499057 translate
0.000000 rotate
0.000000 0.000000 m /minus glyphshow
8.378906 0.000000 m /zero glyphshow
14.741211 0.000000 m /period glyphshow
17.919922 0.000000 m /two glyphshow
grestore
gsave
/o {
gsave
newpath
translate
0.8 setlinewidth
1 setlinejoin
0 setlinecap
0 0 m
-3.5 0 l

gsave
0.000 setgray
fill
grestore
stroke
grestore
} bind def
74.7 289.281 o
grestore
gsave
43.418750 285.483909 translate
0.000000 rotate
0.000000 0.000000 m /minus glyphshow
8.378906 0.000000 m /zero glyphshow
14.741211 0.000000 m /period glyphshow
17.919922 0.000000 m /one glyphshow
grestore
gsave
/o {
gsave
newpath
translate
0.8 setlinewidth
1 setlinejoin
0 setlinecap
0 0 m
-3.5 0 l

gsave
0.000 setgray
fill
grestore
stroke
grestore
} bind def
74.7 313.266 o
grestore
gsave
51.793750 309.468761 translate
0.000000 rotate
0.000000 0.000000 m /zero glyphshow
6.362305 0.000000 m /period glyphshow
9.541016 0.000000 m /zero glyphshow
grestore
gsave
/o {
gsave
newpath
translate
0.8 setlinewidth
1 setlinejoin
0 setlinecap
0 0 m
-3.5 0 l

gsave
0.000 setgray
fill
grestore
stroke
grestore
} bind def
74.7 337.25 o
grestore
gsave
51.793750 333.453613 translate
0.000000 rotate
0.000000 0.000000 m /zero glyphshow
6.362305 0.000000 m /period glyphshow
9.541016 0.000000 m /one glyphshow
grestore
gsave
/o {
gsave
newpath
translate
0.8 setlinewidth
1 setlinejoin
0 setlinecap
0 0 m
-3.5 0 l

gsave
0.000 setgray
fill
grestore
stroke
grestore
} bind def
74.7 361.235 o
grestore
gsave
51.793750 357.438465 translate
0.000000 rotate
0.000000 0.000000 m /zero glyphshow
6.362305 0.000000 m /period glyphshow
9.541016 0.000000 m /two glyphshow
grestore
gsave
/o {
gsave
newpath
translate
0.8 setlinewidth
1 setlinejoin
0 setlinecap
0 0 m
-3.5 0 l

gsave
0.000 setgray
fill
grestore
stroke
grestore
} bind def
74.7 385.22 o
grestore
gsave
51.793750 381.423317 translate
0.000000 rotate
0.000000 0.000000 m /zero glyphshow
6.362305 0.000000 m /period glyphshow
9.541016 0.000000 m /three glyphshow
grestore
gsave
/o {
gsave
newpath
translate
0.8 setlinewidth
1 setlinejoin
0 setlinecap
0 0 m
-3.5 0 l

gsave
0.000 setgray
fill
grestore
stroke
grestore
} bind def
74.7 409.205 o
grestore
gsave
51.793750 405.408170 translate
0.000000 rotate
0.000000 0.000000 m /zero glyphshow
6.362305 0.000000 m /period glyphshow
9.541016 0.000000 m /four glyphshow
grestore
1.500 setlinewidth
2 setlinecap
0.122 0.467 0.706 setrgbcolor
gsave
210.5 163 74.7 246.9 clipbox
84.269008 322.012554 m
86.202141 314.692958 l
88.135274 345.80124 l
90.068407 289.074372 l
92.00154 294.564069 l
93.934673 318.352756 l
95.867806 343.971341 l
97.800939 270.775382 l
99.734072 329.332149 l
101.667205 334.821846 l
103.600338 296.393968 l
105.533471 305.543463 l
107.466604 278.094978 l
109.399737 336.651745 l
111.33287 279.924877 l
113.266003 283.584675 l
115.199136 311.03316 l
117.132269 287.244473 l
119.065402 334.821846 l
120.998535 312.863059 l
122.931668 349.461038 l
124.864801 300.053766 l
126.797934 287.244473 l
128.731067 338.481644 l
130.6642 290.904271 l
132.597333 289.074372 l
134.530466 300.053766 l
136.463599 294.564069 l
138.396732 279.924877 l
140.329865 265.285685 l
142.262998 307.373362 l
144.196131 263.455786 l
146.129264 316.522857 l
148.062397 283.584675 l
149.99553 329.332149 l
151.928663 301.883665 l
153.861796 285.414574 l
155.794929 329.332149 l
157.728062 331.162048 l
159.661195 343.971341 l
161.594328 311.03316 l
163.527461 305.543463 l
165.460594 300.053766 l
167.393727 325.672352 l
169.32686 303.713564 l
171.259992 292.73417 l
173.193125 343.971341 l
175.126258 356.780634 l
177.059391 263.455786 l
178.992524 305.543463 l
180.925657 272.605281 l
182.85879 290.904271 l
184.791923 325.672352 l
186.725056 320.182655 l
188.658189 320.182655 l
190.591322 318.352756 l
192.524455 327.502251 l
194.457588 312.863059 l
196.390721 292.73417 l
198.323854 311.03316 l
200.256987 254.306291 l
202.19012 347.631139 l
204.123253 314.692958 l
206.056386 376.909523 l
207.989519 287.244473 l
209.922652 378.739422 l
211.855785 303.713564 l
213.788918 276.265079 l
215.722051 340.311543 l
217.655184 309.203261 l
219.588317 279.924877 l
221.52145 283.584675 l
223.454583 305.543463 l
225.387716 329.332149 l
227.320849 283.584675 l
229.253982 329.332149 l
231.187115 322.012554 l
233.120248 311.03316 l
235.053381 343.971341 l
236.986514 338.481644 l
238.919647 312.863059 l
240.85278 332.991947 l
242.785913 402.528109 l
244.719046 331.162048 l
246.652179 329.332149 l
248.585312 345.80124 l
250.518445 289.074372 l
252.451578 360.440432 l
254.384711 312.863059 l
256.317844 327.502251 l
258.250977 336.651745 l
260.18411 298.223867 l
262.117243 338.481644 l
264.050376 323.842453 l
265.983509 301.883665 l
267.916642 331.162048 l
269.849775 320.182655 l
271.782908 311.03316 l
273.716041 342.141442 l
275.649174 285.414574 l
stroke
grestore
0.800 setlinewidth
0 setlinejoin
[] 0 setdash
0.000 setgray
gsave
74.7 246.8952 m
74.7 409.9392 l
stroke
grestore
gsave
285.218182 246.8952 m
285.218182 409.9392 l
stroke
grestore
gsave
74.7 246.8952 m
285.218182 246.8952 l
stroke
grestore
gsave
74.7 409.9392 m
285.218182 409.9392 l
stroke
grestore
/DejaVuSans findfont
12.000 scalefont
setfont
gsave
172.591903 415.939200 translate
0.000000 rotate
0.000000 0.000000 m /g glyphshow
7.617188 0.000000 m /x glyphshow
grestore
gsave
327.321818 246.8952 m
537.84 246.8952 l
537.84 409.9392 l
327.321818 409.9392 l
cl
1.000 setgray
fill
grestore
1 setlinejoin
0 setlinecap
[] 0 setdash
gsave
/o {
gsave
newpath
translate
0.8 setlinewidth
1 setlinejoin
0 setlinecap
0 0 m
0 -3.5 l

gsave
0.000 setgray
fill
grestore
stroke
grestore
} bind def
334.958 246.895 o
grestore
/DejaVuSans findfont
10.000 scalefont
setfont
gsave
331.778006 232.301450 translate
0.000000 rotate
0.000000 0.000000 m /zero glyphshow
grestore
gsave
/o {
gsave
newpath
translate
0.8 setlinewidth
1 setlinejoin
0 setlinecap
0 0 m
0 -3.5 l

gsave
0.000 setgray
fill
grestore
stroke
grestore
} bind def
373.62 246.895 o
grestore
gsave
367.260978 232.301450 translate
0.000000 rotate
0.000000 0.000000 m /two glyphshow
6.362305 0.000000 m /zero glyphshow
grestore
gsave
/o {
gsave
newpath
translate
0.8 setlinewidth
1 setlinejoin
0 setlinecap
0 0 m
0 -3.5 l

gsave
0.000 setgray
fill
grestore
stroke
grestore
} bind def
412.283 246.895 o
grestore
gsave
405.923638 232.301450 translate
0.000000 rotate
0.000000 0.000000 m /four glyphshow
6.362305 0.000000 m /zero glyphshow
grestore
gsave
/o {
gsave
newpath
translate
0.8 setlinewidth
1 setlinejoin
0 setlinecap
0 0 m
0 -3.5 l

gsave
0.000 setgray
fill
grestore
stroke
grestore
} bind def
450.946 246.895 o
grestore
gsave
444.586297 232.301450 translate
0.000000 rotate
0.000000 0.000000 m /six glyphshow
6.362305 0.000000 m /zero glyphshow
grestore
gsave
/o {
gsave
newpath
translate
0.8 setlinewidth
1 setlinejoin
0 setlinecap
0 0 m
0 -3.5 l

gsave
0.000 setgray
fill
grestore
stroke
grestore
} bind def
489.608 246.895 o
grestore
gsave
483.248957 232.301450 translate
0.000000 rotate
0.000000 0.000000 m /eight glyphshow
6.362305 0.000000 m /zero glyphshow
grestore
gsave
/o {
gsave
newpath
translate
0.8 setlinewidth
1 setlinejoin
0 setlinecap
0 0 m
0 -3.5 l

gsave
0.000 setgray
fill
grestore
stroke
grestore
} bind def
528.271 246.895 o
grestore
gsave
518.731929 232.301450 translate
0.000000 rotate
0.000000 0.000000 m /one glyphshow
6.362305 0.000000 m /zero glyphshow
12.724609 0.000000 m /zero glyphshow
grestore
gsave
/o {
gsave
newpath
translate
0.8 setlinewidth
1 setlinejoin
0 setlinecap
0 0 m
-3.5 0 l

gsave
0.000 setgray
fill
grestore
stroke
grestore
} bind def
327.322 259.204 o
grestore
gsave
296.040568 255.407618 translate
0.000000 rotate
0.000000 0.000000 m /minus glyphshow
8.378906 0.000000 m /zero glyphshow
14.741211 0.000000 m /period glyphshow
17.919922 0.000000 m /four glyphshow
grestore
gsave
/o {
gsave
newpath
translate
0.8 setlinewidth
1 setlinejoin
0 setlinecap
0 0 m
-3.5 0 l

gsave
0.000 setgray
fill
grestore
stroke
grestore
} bind def
327.322 293.897 o
grestore
gsave
296.040568 290.099993 translate
0.000000 rotate
0.000000 0.000000 m /minus glyphshow
8.378906 0.000000 m /zero glyphshow
14.741211 0.000000 m /period glyphshow
17.919922 0.000000 m /two glyphshow
grestore
gsave
/o {
gsave
newpath
translate
0.8 setlinewidth
1 setlinejoin
0 setlinecap
0 0 m
-3.5 0 l

gsave
0.000 setgray
fill
grestore
stroke
grestore
} bind def
327.322 328.589 o
grestore
gsave
304.415568 324.792368 translate
0.000000 rotate
0.000000 0.000000 m /zero glyphshow
6.362305 0.000000 m /period glyphshow
9.541016 0.000000 m /zero glyphshow
grestore
gsave
/o {
gsave
newpath
translate
0.8 setlinewidth
1 setlinejoin
0 setlinecap
0 0 m
-3.5 0 l

gsave
0.000 setgray
fill
grestore
stroke
grestore
} bind def
327.322 363.282 o
grestore
gsave
304.415568 359.484743 translate
0.000000 rotate
0.000000 0.000000 m /zero glyphshow
6.362305 0.000000 m /period glyphshow
9.541016 0.000000 m /two glyphshow
grestore
gsave
/o {
gsave
newpath
translate
0.8 setlinewidth
1 setlinejoin
0 setlinecap
0 0 m
-3.5 0 l

gsave
0.000 setgray
fill
grestore
stroke
grestore
} bind def
327.322 397.974 o
grestore
gsave
304.415568 394.177119 translate
0.000000 rotate
0.000000 0.000000 m /zero glyphshow
6.362305 0.000000 m /period glyphshow
9.541016 0.000000 m /four glyphshow
grestore
1.500 setlinewidth
2 setlinecap
0.122 0.467 0.706 setrgbcolor
gsave
210.5 163 327.3 246.9 clipbox
336.890826 324.446973 m
338.823959 283.421291 l
340.757092 254.306291 l
342.690225 328.4172 l
344.623358 349.591745 l
346.556491 325.770382 l
348.489624 305.919245 l
350.422757 327.093791 l
352.35589 307.242655 l
354.289023 346.944927 l
356.222156 325.770382 l
358.155289 262.246745 l
360.088422 402.528109 l
362.021555 360.179018 l
363.954688 312.536291 l
365.887821 368.119473 l
367.820954 327.093791 l
369.754087 346.944927 l
371.68722 341.651291 l
373.620353 349.591745 l
375.553486 345.621518 l
377.486619 294.008564 l
379.419752 295.331973 l
381.352885 305.919245 l
383.286018 327.093791 l
385.219151 369.442882 l
387.152284 283.421291 l
389.085417 325.770382 l
391.01855 333.710836 l
392.951683 308.566064 l
394.884816 353.561973 l
396.817949 362.825836 l
398.751082 319.153336 l
400.684215 369.442882 l
402.617348 346.944927 l
404.550481 341.651291 l
406.483614 346.944927 l
408.416747 315.183109 l
410.34988 325.770382 l
412.283013 332.387427 l
414.216146 331.064018 l
416.149279 327.093791 l
418.082412 295.331973 l
420.015545 313.8597 l
421.948678 332.387427 l
423.881811 309.889473 l
425.814944 349.591745 l
427.748077 364.149245 l
429.68121 308.566064 l
431.614343 328.4172 l
433.547476 340.327882 l
435.480609 356.208791 l
437.413742 319.153336 l
439.346875 311.212882 l
441.280008 325.770382 l
443.21314 307.242655 l
445.146273 349.591745 l
447.079406 287.391518 l
449.012539 292.685155 l
450.945672 301.949018 l
452.878805 329.740609 l
454.811938 328.4172 l
456.745071 307.242655 l
458.678204 323.123564 l
460.611337 376.059927 l
462.54447 312.536291 l
464.477603 324.446973 l
466.410736 325.770382 l
468.343869 320.476745 l
470.277002 349.591745 l
472.210135 333.710836 l
474.143268 365.472655 l
476.076401 372.0897 l
478.009534 337.681064 l
479.942667 346.944927 l
481.8758 354.885382 l
483.808933 327.093791 l
485.742066 342.9747 l
487.675199 319.153336 l
489.608332 308.566064 l
491.541465 305.919245 l
493.474598 264.893564 l
495.407731 320.476745 l
497.340864 303.272427 l
499.273997 353.561973 l
501.20713 317.829927 l
503.140263 303.272427 l
505.073396 336.357655 l
507.006529 353.561973 l
508.939662 354.885382 l
510.872795 353.561973 l
512.805928 350.915155 l
514.739061 340.327882 l
516.672194 331.064018 l
518.605327 286.068109 l
520.53846 323.123564 l
522.471593 362.825836 l
524.404726 307.242655 l
526.337859 353.561973 l
528.270992 325.770382 l
stroke
grestore
0.800 setlinewidth
0 setlinejoin
[] 0 setdash
0.000 setgray
gsave
327.321818 246.8952 m
327.321818 409.9392 l
stroke
grestore
gsave
537.84 246.8952 m
537.84 409.9392 l
stroke
grestore
gsave
327.321818 246.8952 m
537.84 246.8952 l
stroke
grestore
gsave
327.321818 409.9392 m
537.84 409.9392 l
stroke
grestore
/DejaVuSans findfont
12.000 scalefont
setfont
gsave
425.213722 415.939200 translate
0.000000 rotate
0.000000 0.000000 m /g glyphshow
7.617188 0.000000 m /y glyphshow
grestore
gsave
74.7 51.2424 m
285.218182 51.2424 l
285.218182 214.2864 l
74.7 214.2864 l
cl
1.000 setgray
fill
grestore
1 setlinejoin
0 setlinecap
[] 0 setdash
gsave
/o {
gsave
newpath
translate
0.8 setlinewidth
1 setlinejoin
0 setlinecap
0 0 m
0 -3.5 l

gsave
0.000 setgray
fill
grestore
stroke
grestore
} bind def
82.3359 51.2424 o
grestore
/DejaVuSans findfont
10.000 scalefont
setfont
gsave
79.156188 36.648650 translate
0.000000 rotate
0.000000 0.000000 m /zero glyphshow
grestore
gsave
/o {
gsave
newpath
translate
0.8 setlinewidth
1 setlinejoin
0 setlinecap
0 0 m
0 -3.5 l

gsave
0.000 setgray
fill
grestore
stroke
grestore
} bind def
120.999 51.2424 o
grestore
gsave
114.639160 36.648650 translate
0.000000 rotate
0.000000 0.000000 m /two glyphshow
6.362305 0.000000 m /zero glyphshow
grestore
gsave
/o {
gsave
newpath
translate
0.8 setlinewidth
1 setlinejoin
0 setlinecap
0 0 m
0 -3.5 l

gsave
0.000 setgray
fill
grestore
stroke
grestore
} bind def
159.661 51.2424 o
grestore
gsave
153.301820 36.648650 translate
0.000000 rotate
0.000000 0.000000 m /four glyphshow
6.362305 0.000000 m /zero glyphshow
grestore
gsave
/o {
gsave
newpath
translate
0.8 setlinewidth
1 setlinejoin
0 setlinecap
0 0 m
0 -3.5 l

gsave
0.000 setgray
fill
grestore
stroke
grestore
} bind def
198.324 51.2424 o
grestore
gsave
191.964479 36.648650 translate
0.000000 rotate
0.000000 0.000000 m /six glyphshow
6.362305 0.000000 m /zero glyphshow
grestore
gsave
/o {
gsave
newpath
translate
0.8 setlinewidth
1 setlinejoin
0 setlinecap
0 0 m
0 -3.5 l

gsave
0.000 setgray
fill
grestore
stroke
grestore
} bind def
236.987 51.2424 o
grestore
gsave
230.627139 36.648650 translate
0.000000 rotate
0.000000 0.000000 m /eight glyphshow
6.362305 0.000000 m /zero glyphshow
grestore
gsave
/o {
gsave
newpath
translate
0.8 setlinewidth
1 setlinejoin
0 setlinecap
0 0 m
0 -3.5 l

gsave
0.000 setgray
fill
grestore
stroke
grestore
} bind def
275.649 51.2424 o
grestore
gsave
266.110111 36.648650 translate
0.000000 rotate
0.000000 0.000000 m /one glyphshow
6.362305 0.000000 m /zero glyphshow
12.724609 0.000000 m /zero glyphshow
grestore
gsave
/o {
gsave
newpath
translate
0.8 setlinewidth
1 setlinejoin
0 setlinecap
0 0 m
-3.5 0 l

gsave
0.000 setgray
fill
grestore
stroke
grestore
} bind def
74.7 56.1303 o
grestore
gsave
43.418750 52.333457 translate
0.000000 rotate
0.000000 0.000000 m /minus glyphshow
8.378906 0.000000 m /zero glyphshow
14.741211 0.000000 m /period glyphshow
17.919922 0.000000 m /three glyphshow
grestore
gsave
/o {
gsave
newpath
translate
0.8 setlinewidth
1 setlinejoin
0 setlinecap
0 0 m
-3.5 0 l

gsave
0.000 setgray
fill
grestore
stroke
grestore
} bind def
74.7 83.8842 o
grestore
gsave
43.418750 80.087357 translate
0.000000 rotate
0.000000 0.000000 m /minus glyphshow
8.378906 0.000000 m /zero glyphshow
14.741211 0.000000 m /period glyphshow
17.919922 0.000000 m /two glyphshow
grestore
gsave
/o {
gsave
newpath
translate
0.8 setlinewidth
1 setlinejoin
0 setlinecap
0 0 m
-3.5 0 l

gsave
0.000 setgray
fill
grestore
stroke
grestore
} bind def
74.7 111.638 o
grestore
gsave
43.418750 107.841258 translate
0.000000 rotate
0.000000 0.000000 m /minus glyphshow
8.378906 0.000000 m /zero glyphshow
14.741211 0.000000 m /period glyphshow
17.919922 0.000000 m /one glyphshow
grestore
gsave
/o {
gsave
newpath
translate
0.8 setlinewidth
1 setlinejoin
0 setlinecap
0 0 m
-3.5 0 l

gsave
0.000 setgray
fill
grestore
stroke
grestore
} bind def
74.7 139.392 o
grestore
gsave
51.793750 135.595158 translate
0.000000 rotate
0.000000 0.000000 m /zero glyphshow
6.362305 0.000000 m /period glyphshow
9.541016 0.000000 m /zero glyphshow
grestore
gsave
/o {
gsave
newpath
translate
0.8 setlinewidth
1 setlinejoin
0 setlinecap
0 0 m
-3.5 0 l

gsave
0.000 setgray
fill
grestore
stroke
grestore
} bind def
74.7 167.146 o
grestore
gsave
51.793750 163.349058 translate
0.000000 rotate
0.000000 0.000000 m /zero glyphshow
6.362305 0.000000 m /period glyphshow
9.541016 0.000000 m /one glyphshow
grestore
gsave
/o {
gsave
newpath
translate
0.8 setlinewidth
1 setlinejoin
0 setlinecap
0 0 m
-3.5 0 l

gsave
0.000 setgray
fill
grestore
stroke
grestore
} bind def
74.7 194.9 o
grestore
gsave
51.793750 191.102958 translate
0.000000 rotate
0.000000 0.000000 m /zero glyphshow
6.362305 0.000000 m /period glyphshow
9.541016 0.000000 m /two glyphshow
grestore
1.500 setlinewidth
2 setlinecap
0.122 0.467 0.706 setrgbcolor
gsave
210.5 163 74.7 51.24 clipbox
84.269008 65.005855 m
86.202141 117.942218 l
88.135274 134.881855 l
90.068407 145.469127 l
92.00154 113.707309 l
93.934673 111.589855 l
95.867806 166.643673 l
97.800939 187.818218 l
99.734072 132.7644 l
101.667205 164.526218 l
103.600338 92.532764 l
105.533471 132.7644 l
107.466604 151.821491 l
109.399737 94.650218 l
111.33287 120.059673 l
113.266003 130.646945 l
115.199136 143.351673 l
117.132269 134.881855 l
119.065402 136.999309 l
120.998535 156.0564 l
122.931668 145.469127 l
124.864801 124.294582 l
126.797934 181.465855 l
128.731067 175.113491 l
130.6642 175.113491 l
132.597333 124.294582 l
134.530466 194.170582 l
136.463599 162.408764 l
138.396732 198.405491 l
140.329865 177.230945 l
142.262998 179.3484 l
144.196131 151.821491 l
146.129264 130.646945 l
148.062397 122.177127 l
149.99553 107.354945 l
151.928663 90.415309 l
153.861796 86.1804 l
155.794929 151.821491 l
157.728062 128.529491 l
159.661195 141.234218 l
161.594328 168.761127 l
163.527461 122.177127 l
165.460594 120.059673 l
167.393727 162.408764 l
169.32686 151.821491 l
171.259992 124.294582 l
173.193125 141.234218 l
175.126258 151.821491 l
177.059391 151.821491 l
178.992524 139.116764 l
180.925657 189.935673 l
182.85879 149.704036 l
184.791923 122.177127 l
186.725056 143.351673 l
188.658189 109.4724 l
190.591322 103.120036 l
192.524455 143.351673 l
194.457588 103.120036 l
196.390721 115.824764 l
198.323854 136.999309 l
200.256987 156.0564 l
202.19012 206.875309 l
204.123253 143.351673 l
206.056386 185.700764 l
207.989519 145.469127 l
209.922652 189.935673 l
211.855785 162.408764 l
213.788918 202.6404 l
215.722051 149.704036 l
217.655184 187.818218 l
219.588317 147.586582 l
221.52145 143.351673 l
223.454583 109.4724 l
225.387716 101.002582 l
227.320849 101.002582 l
229.253982 103.120036 l
231.187115 128.529491 l
233.120248 120.059673 l
235.053381 103.120036 l
236.986514 128.529491 l
238.919647 153.938945 l
240.85278 179.3484 l
242.785913 143.351673 l
244.719046 160.291309 l
246.652179 122.177127 l
248.585312 172.996036 l
250.518445 132.7644 l
252.451578 172.996036 l
254.384711 198.405491 l
256.317844 143.351673 l
258.250977 147.586582 l
260.18411 136.999309 l
262.117243 103.120036 l
264.050376 105.237491 l
265.983509 147.586582 l
267.916642 77.710582 l
269.849775 109.4724 l
271.782908 58.653491 l
273.716041 113.707309 l
275.649174 111.589855 l
stroke
grestore
0.800 setlinewidth
0 setlinejoin
[] 0 setdash
0.000 setgray
gsave
74.7 51.2424 m
74.7 214.2864 l
stroke
grestore
gsave
285.218182 51.2424 m
285.218182 214.2864 l
stroke
grestore
gsave
74.7 51.2424 m
285.218182 51.2424 l
stroke
grestore
gsave
74.7 214.2864 m
285.218182 214.2864 l
stroke
grestore
/DejaVuSans findfont
12.000 scalefont
setfont
gsave
172.998153 220.286400 translate
0.000000 rotate
0.000000 0.000000 m /g glyphshow
7.617188 0.000000 m /z glyphshow
grestore
gsave
327.321818 51.2424 m
537.84 51.2424 l
537.84 214.2864 l
327.321818 214.2864 l
cl
1.000 setgray
fill
grestore
1 setlinejoin
0 setlinecap
[] 0 setdash
gsave
/o {
gsave
newpath
translate
0.8 setlinewidth
1 setlinejoin
0 setlinecap
0 0 m
0 -3.5 l

gsave
0.000 setgray
fill
grestore
stroke
grestore
} bind def
334.958 51.2424 o
grestore
/DejaVuSans findfont
10.000 scalefont
setfont
gsave
331.778006 36.648650 translate
0.000000 rotate
0.000000 0.000000 m /zero glyphshow
grestore
gsave
/o {
gsave
newpath
translate
0.8 setlinewidth
1 setlinejoin
0 setlinecap
0 0 m
0 -3.5 l

gsave
0.000 setgray
fill
grestore
stroke
grestore
} bind def
373.62 51.2424 o
grestore
gsave
367.260978 36.648650 translate
0.000000 rotate
0.000000 0.000000 m /two glyphshow
6.362305 0.000000 m /zero glyphshow
grestore
gsave
/o {
gsave
newpath
translate
0.8 setlinewidth
1 setlinejoin
0 setlinecap
0 0 m
0 -3.5 l

gsave
0.000 setgray
fill
grestore
stroke
grestore
} bind def
412.283 51.2424 o
grestore
gsave
405.923638 36.648650 translate
0.000000 rotate
0.000000 0.000000 m /four glyphshow
6.362305 0.000000 m /zero glyphshow
grestore
gsave
/o {
gsave
newpath
translate
0.8 setlinewidth
1 setlinejoin
0 setlinecap
0 0 m
0 -3.5 l

gsave
0.000 setgray
fill
grestore
stroke
grestore
} bind def
450.946 51.2424 o
grestore
gsave
444.586297 36.648650 translate
0.000000 rotate
0.000000 0.000000 m /six glyphshow
6.362305 0.000000 m /zero glyphshow
grestore
gsave
/o {
gsave
newpath
translate
0.8 setlinewidth
1 setlinejoin
0 setlinecap
0 0 m
0 -3.5 l

gsave
0.000 setgray
fill
grestore
stroke
grestore
} bind def
489.608 51.2424 o
grestore
gsave
483.248957 36.648650 translate
0.000000 rotate
0.000000 0.000000 m /eight glyphshow
6.362305 0.000000 m /zero glyphshow
grestore
gsave
/o {
gsave
newpath
translate
0.8 setlinewidth
1 setlinejoin
0 setlinecap
0 0 m
0 -3.5 l

gsave
0.000 setgray
fill
grestore
stroke
grestore
} bind def
528.271 51.2424 o
grestore
gsave
518.731929 36.648650 translate
0.000000 rotate
0.000000 0.000000 m /one glyphshow
6.362305 0.000000 m /zero glyphshow
12.724609 0.000000 m /zero glyphshow
grestore
gsave
/o {
gsave
newpath
translate
0.8 setlinewidth
1 setlinejoin
0 setlinecap
0 0 m
-3.5 0 l

gsave
0.000 setgray
fill
grestore
stroke
grestore
} bind def
327.322 63.5517 o
grestore
gsave
296.040568 59.754818 translate
0.000000 rotate
0.000000 0.000000 m /minus glyphshow
8.378906 0.000000 m /zero glyphshow
14.741211 0.000000 m /period glyphshow
17.919922 0.000000 m /four glyphshow
grestore
gsave
/o {
gsave
newpath
translate
0.8 setlinewidth
1 setlinejoin
0 setlinecap
0 0 m
-3.5 0 l

gsave
0.000 setgray
fill
grestore
stroke
grestore
} bind def
327.322 98.2441 o
grestore
gsave
296.040568 94.447193 translate
0.000000 rotate
0.000000 0.000000 m /minus glyphshow
8.378906 0.000000 m /zero glyphshow
14.741211 0.000000 m /period glyphshow
17.919922 0.000000 m /two glyphshow
grestore
gsave
/o {
gsave
newpath
translate
0.8 setlinewidth
1 setlinejoin
0 setlinecap
0 0 m
-3.5 0 l

gsave
0.000 setgray
fill
grestore
stroke
grestore
} bind def
327.322 132.936 o
grestore
gsave
304.415568 129.139568 translate
0.000000 rotate
0.000000 0.000000 m /zero glyphshow
6.362305 0.000000 m /period glyphshow
9.541016 0.000000 m /zero glyphshow
grestore
gsave
/o {
gsave
newpath
translate
0.8 setlinewidth
1 setlinejoin
0 setlinecap
0 0 m
-3.5 0 l

gsave
0.000 setgray
fill
grestore
stroke
grestore
} bind def
327.322 167.629 o
grestore
gsave
304.415568 163.831943 translate
0.000000 rotate
0.000000 0.000000 m /zero glyphshow
6.362305 0.000000 m /period glyphshow
9.541016 0.000000 m /two glyphshow
grestore
gsave
/o {
gsave
newpath
translate
0.8 setlinewidth
1 setlinejoin
0 setlinecap
0 0 m
-3.5 0 l

gsave
0.000 setgray
fill
grestore
stroke
grestore
} bind def
327.322 202.321 o
grestore
gsave
304.415568 198.524319 translate
0.000000 rotate
0.000000 0.000000 m /zero glyphshow
6.362305 0.000000 m /period glyphshow
9.541016 0.000000 m /four glyphshow
grestore
1.500 setlinewidth
2 setlinecap
0.122 0.467 0.706 setrgbcolor
gsave
210.5 163 327.3 51.24 clipbox
336.890826 139.262339 m
338.823959 133.968702 l
340.757092 156.466657 l
342.690225 115.440975 l
344.623358 119.411202 l
346.556491 136.61552 l
348.489624 155.143248 l
350.422757 102.206884 l
352.35589 144.555975 l
354.289023 148.526202 l
356.222156 120.734611 l
358.155289 127.351657 l
360.088422 107.50052 l
362.021555 149.849611 l
363.954688 108.82393 l
365.887821 111.470748 l
367.820954 131.321884 l
369.754087 114.117566 l
371.68722 148.526202 l
373.620353 132.645293 l
375.553486 159.113475 l
377.486619 123.38143 l
379.419752 114.117566 l
381.352885 151.17302 l
383.286018 116.764384 l
385.219151 115.440975 l
387.152284 123.38143 l
389.085417 119.411202 l
391.01855 108.82393 l
392.951683 98.236657 l
394.884816 128.675066 l
396.817949 96.913248 l
398.751082 135.292111 l
400.684215 111.470748 l
402.617348 144.555975 l
404.550481 124.704839 l
406.483614 112.794157 l
408.416747 144.555975 l
410.34988 145.879384 l
412.283013 155.143248 l
414.216146 131.321884 l
416.149279 127.351657 l
418.082412 123.38143 l
420.015545 141.909157 l
421.948678 126.028248 l
423.881811 118.087793 l
425.814944 155.143248 l
427.748077 164.407111 l
429.68121 96.913248 l
431.614343 127.351657 l
433.547476 103.530293 l
435.480609 116.764384 l
437.413742 141.909157 l
439.346875 137.93893 l
441.280008 137.93893 l
443.21314 136.61552 l
445.146273 143.232566 l
447.079406 132.645293 l
449.012539 118.087793 l
450.945672 131.321884 l
452.878805 90.296202 l
454.811938 157.790066 l
456.745071 133.968702 l
458.678204 178.964611 l
460.611337 114.117566 l
462.54447 180.28802 l
464.477603 126.028248 l
466.410736 106.177111 l
468.343869 152.49643 l
470.277002 129.998475 l
472.210135 108.82393 l
474.143268 111.470748 l
476.076401 127.351657 l
478.009534 144.555975 l
479.942667 111.470748 l
481.8758 144.555975 l
483.808933 139.262339 l
485.742066 131.321884 l
487.675199 155.143248 l
489.608332 151.17302 l
491.541465 132.645293 l
493.474598 147.202793 l
495.407731 197.492339 l
497.340864 145.879384 l
499.273997 144.555975 l
501.20713 156.466657 l
503.140263 115.440975 l
505.073396 167.05393 l
507.006529 132.645293 l
508.939662 143.232566 l
510.872795 149.849611 l
512.805928 122.05802 l
514.739061 151.17302 l
516.672194 140.585748 l
518.605327 124.704839 l
520.53846 145.879384 l
522.471593 137.93893 l
524.404726 131.321884 l
526.337859 153.819839 l
528.270992 112.794157 l
stroke
grestore
1.000 0.498 0.055 setrgbcolor
gsave
210.5 163 327.3 51.24 clipbox
336.890826 128.794173 m
338.823959 87.768491 l
340.757092 58.653491 l
342.690225 132.7644 l
344.623358 153.938945 l
346.556491 130.117582 l
348.489624 110.266445 l
350.422757 131.440991 l
352.35589 111.589855 l
354.289023 151.292127 l
356.222156 130.117582 l
358.155289 66.593945 l
360.088422 206.875309 l
362.021555 164.526218 l
363.954688 116.883491 l
365.887821 172.466673 l
367.820954 131.440991 l
369.754087 151.292127 l
371.68722 145.998491 l
373.620353 153.938945 l
375.553486 149.968718 l
377.486619 98.355764 l
379.419752 99.679173 l
381.352885 110.266445 l
383.286018 131.440991 l
385.219151 173.790082 l
387.152284 87.768491 l
389.085417 130.117582 l
391.01855 138.058036 l
392.951683 112.913264 l
394.884816 157.909173 l
396.817949 167.173036 l
398.751082 123.500536 l
400.684215 173.790082 l
402.617348 151.292127 l
404.550481 145.998491 l
406.483614 151.292127 l
408.416747 119.530309 l
410.34988 130.117582 l
412.283013 136.734627 l
414.216146 135.411218 l
416.149279 131.440991 l
418.082412 99.679173 l
420.015545 118.2069 l
421.948678 136.734627 l
423.881811 114.236673 l
425.814944 153.938945 l
427.748077 168.496445 l
429.68121 112.913264 l
431.614343 132.7644 l
433.547476 144.675082 l
435.480609 160.555991 l
437.413742 123.500536 l
439.346875 115.560082 l
441.280008 130.117582 l
443.21314 111.589855 l
445.146273 153.938945 l
447.079406 91.738718 l
449.012539 97.032355 l
450.945672 106.296218 l
452.878805 134.087809 l
454.811938 132.7644 l
456.745071 111.589855 l
458.678204 127.470764 l
460.611337 180.407127 l
462.54447 116.883491 l
464.477603 128.794173 l
466.410736 130.117582 l
468.343869 124.823945 l
470.277002 153.938945 l
472.210135 138.058036 l
474.143268 169.819855 l
476.076401 176.4369 l
478.009534 142.028264 l
479.942667 151.292127 l
481.8758 159.232582 l
483.808933 131.440991 l
485.742066 147.3219 l
487.675199 123.500536 l
489.608332 112.913264 l
491.541465 110.266445 l
493.474598 69.240764 l
495.407731 124.823945 l
497.340864 107.619627 l
499.273997 157.909173 l
501.20713 122.177127 l
503.140263 107.619627 l
505.073396 140.704855 l
507.006529 157.909173 l
508.939662 159.232582 l
510.872795 157.909173 l
512.805928 155.262355 l
514.739061 144.675082 l
516.672194 135.411218 l
518.605327 90.415309 l
520.53846 127.470764 l
522.471593 167.173036 l
524.404726 111.589855 l
526.337859 157.909173 l
528.270992 130.117582 l
stroke
grestore
0.173 0.627 0.173 setrgbcolor
gsave
210.5 163 327.3 51.24 clipbox
336.890826 86.445082 m
338.823959 119.530309 l
340.757092 130.117582 l
342.690225 136.734627 l
344.623358 116.883491 l
346.556491 115.560082 l
348.489624 149.968718 l
350.422757 163.202809 l
352.35589 128.794173 l
354.289023 148.645309 l
356.222156 103.6494 l
358.155289 128.794173 l
360.088422 140.704855 l
362.021555 104.972809 l
363.954688 120.853718 l
365.887821 127.470764 l
367.820954 135.411218 l
369.754087 130.117582 l
371.68722 131.440991 l
373.620353 143.351673 l
375.553486 136.734627 l
377.486619 123.500536 l
379.419752 159.232582 l
381.352885 155.262355 l
383.286018 155.262355 l
385.219151 123.500536 l
387.152284 167.173036 l
389.085417 147.3219 l
391.01855 169.819855 l
392.951683 156.585764 l
394.884816 157.909173 l
396.817949 140.704855 l
398.751082 127.470764 l
400.684215 122.177127 l
402.617348 112.913264 l
404.550481 102.325991 l
406.483614 99.679173 l
408.416747 140.704855 l
410.34988 126.147355 l
412.283013 134.087809 l
414.216146 151.292127 l
416.149279 122.177127 l
418.082412 120.853718 l
420.015545 147.3219 l
421.948678 140.704855 l
423.881811 123.500536 l
425.814944 134.087809 l
427.748077 140.704855 l
429.68121 140.704855 l
431.614343 132.7644 l
433.547476 164.526218 l
435.480609 139.381445 l
437.413742 122.177127 l
439.346875 135.411218 l
441.280008 114.236673 l
443.21314 110.266445 l
445.146273 135.411218 l
447.079406 110.266445 l
449.012539 118.2069 l
450.945672 131.440991 l
452.878805 143.351673 l
454.811938 175.113491 l
456.745071 135.411218 l
458.678204 161.8794 l
460.611337 136.734627 l
462.54447 164.526218 l
464.477603 147.3219 l
466.410736 172.466673 l
468.343869 139.381445 l
470.277002 163.202809 l
472.210135 138.058036 l
474.143268 135.411218 l
476.076401 114.236673 l
478.009534 108.943036 l
479.942667 108.943036 l
481.8758 110.266445 l
483.808933 126.147355 l
485.742066 120.853718 l
487.675199 110.266445 l
489.608332 126.147355 l
491.541465 142.028264 l
493.474598 157.909173 l
495.407731 135.411218 l
497.340864 145.998491 l
499.273997 122.177127 l
501.20713 153.938945 l
503.140263 128.794173 l
505.073396 153.938945 l
507.006529 169.819855 l
508.939662 135.411218 l
510.872795 138.058036 l
512.805928 131.440991 l
514.739061 110.266445 l
516.672194 111.589855 l
518.605327 138.058036 l
520.53846 94.385536 l
522.471593 114.236673 l
524.404726 82.474855 l
526.337859 116.883491 l
528.270992 115.560082 l
stroke
grestore
0.800 setlinewidth
0 setlinejoin
[] 0 setdash
0.000 setgray
gsave
327.321818 51.2424 m
327.321818 214.2864 l
stroke
grestore
gsave
537.84 51.2424 m
537.84 214.2864 l
stroke
grestore
gsave
327.321818 51.2424 m
537.84 51.2424 l
stroke
grestore
gsave
327.321818 214.2864 m
537.84 214.2864 l
stroke
grestore
/DejaVuSans findfont
12.000 scalefont
setfont
gsave
399.705909 220.286400 translate
0.000000 rotate
0.000000 0.000000 m /g glyphshow
7.617188 0.000000 m /x glyphshow
14.718750 0.000000 m /comma glyphshow
18.533203 0.000000 m /space glyphshow
22.347656 0.000000 m /g glyphshow
29.964844 0.000000 m /y glyphshow
37.066406 0.000000 m /space glyphshow
40.880859 0.000000 m /y glyphshow
47.982422 0.000000 m /space glyphshow
51.796875 0.000000 m /g glyphshow
59.414062 0.000000 m /z glyphshow
grestore
gsave
207.073438 447.398200 translate
0.000000 rotate
0.000000 0.000000 m /G glyphshow
9.298828 0.000000 m /i glyphshow
12.632812 0.000000 m /r glyphshow
17.566406 0.000000 m /o glyphshow
24.908203 0.000000 m /s glyphshow
31.160156 0.000000 m /c glyphshow
37.757812 0.000000 m /o glyphshow
45.099609 0.000000 m /p glyphshow
52.716797 0.000000 m /i glyphshow
56.050781 0.000000 m /o glyphshow
63.392578 0.000000 m /space glyphshow
67.207031 0.000000 m /c glyphshow
73.804688 0.000000 m /a glyphshow
81.158203 0.000000 m /l glyphshow
84.492188 0.000000 m /i glyphshow
87.826172 0.000000 m /b glyphshow
95.443359 0.000000 m /r glyphshow
100.376953 0.000000 m /a glyphshow
107.730469 0.000000 m /d glyphshow
115.347656 0.000000 m /o glyphshow
122.689453 0.000000 m /space glyphshow
126.503906 0.000000 m /M glyphshow
136.857422 0.000000 m /P glyphshow
144.093750 0.000000 m /U glyphshow
152.876953 0.000000 m /six glyphshow
160.511719 0.000000 m /zero glyphshow
168.146484 0.000000 m /five glyphshow
175.781250 0.000000 m /zero glyphshow
grestore

end
showpage
