%!PS-Adobe-3.0 EPSF-3.0
%%Title: /home/pi/Desktop/ACELE-SI.eps
%%Creator: matplotlib version 3.0.2, http://matplotlib.org/
%%CreationDate: Sun Apr 11 20:02:12 2021
%%Orientation: portrait
%%BoundingBox: 6 162 605 629
%%EndComments
%%BeginProlog
/mpldict 8 dict def
mpldict begin
/m { moveto } bind def
/l { lineto } bind def
/r { rlineto } bind def
/c { curveto } bind def
/cl { closepath } bind def
/box {
m
1 index 0 r
0 exch r
neg 0 r
cl
} bind def
/clipbox {
box
clip
newpath
} bind def
%!PS-Adobe-3.0 Resource-Font
%%Title: DejaVu Sans
%%Copyright: Copyright (c) 2003 by Bitstream, Inc. All Rights Reserved. Copyright (c) 2006 by Tavmjong Bah. All Rights Reserved. DejaVu changes are in public domain 
%%Creator: Converted from TrueType to type 3 by PPR
25 dict begin
/_d{bind def}bind def
/_m{moveto}_d
/_l{lineto}_d
/_cl{closepath eofill}_d
/_c{curveto}_d
/_sc{7 -1 roll{setcachedevice}{pop pop pop pop pop pop}ifelse}_d
/_e{exec}_d
/FontName /DejaVuSans def
/PaintType 0 def
/FontMatrix[.001 0 0 .001 0 0]def
/FontBBox[-1021 -463 1793 1232]def
/FontType 3 def
/Encoding [ /space /comma /period /zero /one /two /four /five /six /eight /nine /A /M /P /U /a /b /c /d /e /i /l /m /o /r /t /x /y /z /minus ] def
/FontInfo 10 dict dup begin
/FamilyName (DejaVu Sans) def
/FullName (DejaVu Sans) def
/Notice (Copyright (c) 2003 by Bitstream, Inc. All Rights Reserved. Copyright (c) 2006 by Tavmjong Bah. All Rights Reserved. DejaVu changes are in public domain ) def
/Weight (Book) def
/Version (Version 2.35) def
/ItalicAngle 0.0 def
/isFixedPitch false def
/UnderlinePosition -130 def
/UnderlineThickness 90 def
end readonly def
/CharStrings 31 dict dup begin
/.notdef 0 def
/space{318 0 0 0 0 0 _sc
}_d
/comma{318 0 77 -115 220 124 _sc
117 124 _m
220 124 _l
220 40 _l
140 -115 _l
77 -115 _l
117 40 _l
117 124 _l
_cl}_d
/period{318 0 107 0 210 124 _sc
107 124 _m
210 124 _l
210 0 _l
107 0 _l
107 124 _l
_cl}_d
/zero{636 0 66 -13 570 742 _sc
318 664 _m
267 664 229 639 203 589 _c
177 539 165 464 165 364 _c
165 264 177 189 203 139 _c
229 89 267 64 318 64 _c
369 64 407 89 433 139 _c
458 189 471 264 471 364 _c
471 464 458 539 433 589 _c
407 639 369 664 318 664 _c
318 742 _m
399 742 461 709 505 645 _c
548 580 570 486 570 364 _c
570 241 548 147 505 83 _c
461 19 399 -13 318 -13 _c
236 -13 173 19 130 83 _c
87 147 66 241 66 364 _c
66 486 87 580 130 645 _c
173 709 236 742 318 742 _c
_cl}_d
/one{636 0 110 0 544 729 _sc
124 83 _m
285 83 _l
285 639 _l
110 604 _l
110 694 _l
284 729 _l
383 729 _l
383 83 _l
544 83 _l
544 0 _l
124 0 _l
124 83 _l
_cl}_d
/two{{636 0 73 0 536 742 _sc
192 83 _m
536 83 _l
536 0 _l
73 0 _l
73 83 _l
110 121 161 173 226 239 _c
290 304 331 346 348 365 _c
380 400 402 430 414 455 _c
426 479 433 504 433 528 _c
433 566 419 598 392 622 _c
365 646 330 659 286 659 _c
255 659 222 653 188 643 _c
154 632 117 616 78 594 _c
78 694 _l
118 710 155 722 189 730 _c
223 738 255 742 284 742 _c
}_e{359 742 419 723 464 685 _c
509 647 532 597 532 534 _c
532 504 526 475 515 449 _c
504 422 484 390 454 354 _c
446 344 420 317 376 272 _c
332 227 271 164 192 83 _c
_cl}_e}_d
/four{636 0 49 0 580 729 _sc
378 643 _m
129 254 _l
378 254 _l
378 643 _l
352 729 _m
476 729 _l
476 254 _l
580 254 _l
580 172 _l
476 172 _l
476 0 _l
378 0 _l
378 172 _l
49 172 _l
49 267 _l
352 729 _l
_cl}_d
/five{{636 0 77 -13 549 729 _sc
108 729 _m
495 729 _l
495 646 _l
198 646 _l
198 467 _l
212 472 227 476 241 478 _c
255 480 270 482 284 482 _c
365 482 429 459 477 415 _c
525 370 549 310 549 234 _c
549 155 524 94 475 51 _c
426 8 357 -13 269 -13 _c
238 -13 207 -10 175 -6 _c
143 -1 111 6 77 17 _c
77 116 _l
106 100 136 88 168 80 _c
199 72 232 69 267 69 _c
}_e{323 69 368 83 401 113 _c
433 143 450 183 450 234 _c
450 284 433 324 401 354 _c
368 384 323 399 267 399 _c
241 399 214 396 188 390 _c
162 384 135 375 108 363 _c
108 729 _l
_cl}_e}_d
/six{{636 0 70 -13 573 742 _sc
330 404 _m
286 404 251 388 225 358 _c
199 328 186 286 186 234 _c
186 181 199 139 225 109 _c
251 79 286 64 330 64 _c
374 64 409 79 435 109 _c
461 139 474 181 474 234 _c
474 286 461 328 435 358 _c
409 388 374 404 330 404 _c
526 713 _m
526 623 _l
501 635 476 644 451 650 _c
425 656 400 659 376 659 _c
310 659 260 637 226 593 _c
}_e{192 549 172 482 168 394 _c
187 422 211 444 240 459 _c
269 474 301 482 336 482 _c
409 482 467 459 509 415 _c
551 371 573 310 573 234 _c
573 159 550 99 506 54 _c
462 9 403 -13 330 -13 _c
246 -13 181 19 137 83 _c
92 147 70 241 70 364 _c
70 479 97 571 152 639 _c
206 707 280 742 372 742 _c
396 742 421 739 447 735 _c
472 730 498 723 526 713 _c
_cl}_e}_d
/eight{{636 0 68 -13 568 742 _sc
318 346 _m
271 346 234 333 207 308 _c
180 283 167 249 167 205 _c
167 161 180 126 207 101 _c
234 76 271 64 318 64 _c
364 64 401 76 428 102 _c
455 127 469 161 469 205 _c
469 249 455 283 429 308 _c
402 333 365 346 318 346 _c
219 388 _m
177 398 144 418 120 447 _c
96 476 85 511 85 553 _c
85 611 105 657 147 691 _c
188 725 245 742 318 742 _c
}_e{390 742 447 725 489 691 _c
530 657 551 611 551 553 _c
551 511 539 476 515 447 _c
491 418 459 398 417 388 _c
464 377 501 355 528 323 _c
554 291 568 251 568 205 _c
568 134 546 80 503 43 _c
459 5 398 -13 318 -13 _c
237 -13 175 5 132 43 _c
89 80 68 134 68 205 _c
68 251 81 291 108 323 _c
134 355 171 377 219 388 _c
183 544 _m
183 506 194 476 218 455 _c
}_e{242 434 275 424 318 424 _c
360 424 393 434 417 455 _c
441 476 453 506 453 544 _c
453 582 441 611 417 632 _c
393 653 360 664 318 664 _c
275 664 242 653 218 632 _c
194 611 183 582 183 544 _c
_cl}_e}_d
/nine{{636 0 63 -13 566 742 _sc
110 15 _m
110 105 _l
134 93 159 84 185 78 _c
210 72 235 69 260 69 _c
324 69 374 90 408 134 _c
442 178 462 244 468 334 _c
448 306 424 284 396 269 _c
367 254 335 247 300 247 _c
226 247 168 269 126 313 _c
84 357 63 417 63 494 _c
63 568 85 628 129 674 _c
173 719 232 742 306 742 _c
390 742 455 709 499 645 _c
543 580 566 486 566 364 _c
}_e{566 248 538 157 484 89 _c
429 21 356 -13 264 -13 _c
239 -13 214 -10 189 -6 _c
163 -2 137 5 110 15 _c
306 324 _m
350 324 385 339 411 369 _c
437 399 450 441 450 494 _c
450 546 437 588 411 618 _c
385 648 350 664 306 664 _c
262 664 227 648 201 618 _c
175 588 162 546 162 494 _c
162 441 175 399 201 369 _c
227 339 262 324 306 324 _c
_cl}_e}_d
/A{684 0 8 0 676 729 _sc
342 632 _m
208 269 _l
476 269 _l
342 632 _l
286 729 _m
398 729 _l
676 0 _l
573 0 _l
507 187 _l
178 187 _l
112 0 _l
8 0 _l
286 729 _l
_cl}_d
/M{863 0 98 0 765 729 _sc
98 729 _m
245 729 _l
431 233 _l
618 729 _l
765 729 _l
765 0 _l
669 0 _l
669 640 _l
481 140 _l
382 140 _l
194 640 _l
194 0 _l
98 0 _l
98 729 _l
_cl}_d
/P{603 0 98 0 569 729 _sc
197 648 _m
197 374 _l
321 374 _l
367 374 402 385 427 409 _c
452 433 465 467 465 511 _c
465 555 452 588 427 612 _c
402 636 367 648 321 648 _c
197 648 _l
98 729 _m
321 729 _l
402 729 464 710 506 673 _c
548 636 569 582 569 511 _c
569 439 548 384 506 348 _c
464 311 402 293 321 293 _c
197 293 _l
197 0 _l
98 0 _l
98 729 _l
_cl}_d
/U{732 0 87 -13 645 729 _sc
87 729 _m
186 729 _l
186 286 _l
186 208 200 151 228 117 _c
256 83 302 66 366 66 _c
429 66 475 83 503 117 _c
531 151 546 208 546 286 _c
546 729 _l
645 729 _l
645 274 _l
645 178 621 107 574 59 _c
527 11 458 -13 366 -13 _c
274 -13 204 11 157 59 _c
110 107 87 178 87 274 _c
87 729 _l
_cl}_d
/a{{613 0 60 -13 522 560 _sc
343 275 _m
270 275 220 266 192 250 _c
164 233 150 205 150 165 _c
150 133 160 107 181 89 _c
202 70 231 61 267 61 _c
317 61 357 78 387 114 _c
417 149 432 196 432 255 _c
432 275 _l
343 275 _l
522 312 _m
522 0 _l
432 0 _l
432 83 _l
411 49 385 25 355 10 _c
325 -5 287 -13 243 -13 _c
187 -13 142 2 109 33 _c
76 64 60 106 60 159 _c
}_e{60 220 80 266 122 298 _c
163 329 224 345 306 345 _c
432 345 _l
432 354 _l
432 395 418 427 391 450 _c
364 472 326 484 277 484 _c
245 484 215 480 185 472 _c
155 464 127 453 100 439 _c
100 522 _l
132 534 164 544 195 550 _c
226 556 256 560 286 560 _c
365 560 424 539 463 498 _c
502 457 522 395 522 312 _c
_cl}_e}_d
/b{{635 0 91 -13 580 760 _sc
487 273 _m
487 339 473 390 446 428 _c
418 466 381 485 334 485 _c
286 485 249 466 222 428 _c
194 390 181 339 181 273 _c
181 207 194 155 222 117 _c
249 79 286 61 334 61 _c
381 61 418 79 446 117 _c
473 155 487 207 487 273 _c
181 464 _m
199 496 223 520 252 536 _c
281 552 316 560 356 560 _c
422 560 476 533 518 481 _c
559 428 580 359 580 273 _c
}_e{580 187 559 117 518 65 _c
476 13 422 -13 356 -13 _c
316 -13 281 -5 252 10 _c
223 25 199 49 181 82 _c
181 0 _l
91 0 _l
91 760 _l
181 760 _l
181 464 _l
_cl}_e}_d
/c{{550 0 55 -13 488 560 _sc
488 526 _m
488 442 _l
462 456 437 466 411 473 _c
385 480 360 484 334 484 _c
276 484 230 465 198 428 _c
166 391 150 339 150 273 _c
150 206 166 154 198 117 _c
230 80 276 62 334 62 _c
360 62 385 65 411 72 _c
437 79 462 90 488 104 _c
488 21 _l
462 9 436 0 410 -5 _c
383 -10 354 -13 324 -13 _c
242 -13 176 12 128 64 _c
}_e{79 115 55 185 55 273 _c
55 362 79 432 128 483 _c
177 534 244 560 330 560 _c
358 560 385 557 411 551 _c
437 545 463 537 488 526 _c
_cl}_e}_d
/d{{635 0 55 -13 544 760 _sc
454 464 _m
454 760 _l
544 760 _l
544 0 _l
454 0 _l
454 82 _l
435 49 411 25 382 10 _c
353 -5 319 -13 279 -13 _c
213 -13 159 13 117 65 _c
75 117 55 187 55 273 _c
55 359 75 428 117 481 _c
159 533 213 560 279 560 _c
319 560 353 552 382 536 _c
411 520 435 496 454 464 _c
148 273 _m
148 207 161 155 188 117 _c
215 79 253 61 301 61 _c
}_e{348 61 385 79 413 117 _c
440 155 454 207 454 273 _c
454 339 440 390 413 428 _c
385 466 348 485 301 485 _c
253 485 215 466 188 428 _c
161 390 148 339 148 273 _c
_cl}_e}_d
/e{{615 0 55 -13 562 560 _sc
562 296 _m
562 252 _l
149 252 _l
153 190 171 142 205 110 _c
238 78 284 62 344 62 _c
378 62 412 66 444 74 _c
476 82 509 95 541 113 _c
541 28 _l
509 14 476 3 442 -3 _c
408 -9 373 -13 339 -13 _c
251 -13 182 12 131 62 _c
80 112 55 181 55 268 _c
55 357 79 428 127 481 _c
175 533 241 560 323 560 _c
397 560 455 536 498 489 _c
}_e{540 441 562 377 562 296 _c
472 322 _m
471 371 457 410 431 440 _c
404 469 368 484 324 484 _c
274 484 234 469 204 441 _c
174 413 156 373 152 322 _c
472 322 _l
_cl}_e}_d
/i{278 0 94 0 184 760 _sc
94 547 _m
184 547 _l
184 0 _l
94 0 _l
94 547 _l
94 760 _m
184 760 _l
184 646 _l
94 646 _l
94 760 _l
_cl}_d
/l{278 0 94 0 184 760 _sc
94 760 _m
184 760 _l
184 0 _l
94 0 _l
94 760 _l
_cl}_d
/m{{974 0 91 0 889 560 _sc
520 442 _m
542 482 569 511 600 531 _c
631 550 668 560 711 560 _c
767 560 811 540 842 500 _c
873 460 889 403 889 330 _c
889 0 _l
799 0 _l
799 327 _l
799 379 789 418 771 444 _c
752 469 724 482 686 482 _c
639 482 602 466 575 435 _c
548 404 535 362 535 309 _c
535 0 _l
445 0 _l
445 327 _l
445 379 435 418 417 444 _c
398 469 369 482 331 482 _c
}_e{285 482 248 466 221 435 _c
194 404 181 362 181 309 _c
181 0 _l
91 0 _l
91 547 _l
181 547 _l
181 462 _l
201 495 226 520 255 536 _c
283 552 317 560 357 560 _c
397 560 430 550 458 530 _c
486 510 506 480 520 442 _c
_cl}_e}_d
/o{612 0 55 -13 557 560 _sc
306 484 _m
258 484 220 465 192 427 _c
164 389 150 338 150 273 _c
150 207 163 156 191 118 _c
219 80 257 62 306 62 _c
354 62 392 80 420 118 _c
448 156 462 207 462 273 _c
462 337 448 389 420 427 _c
392 465 354 484 306 484 _c
306 560 _m
384 560 445 534 490 484 _c
534 433 557 363 557 273 _c
557 183 534 113 490 63 _c
445 12 384 -13 306 -13 _c
227 -13 165 12 121 63 _c
77 113 55 183 55 273 _c
55 363 77 433 121 484 _c
165 534 227 560 306 560 _c
_cl}_d
/r{411 0 91 0 411 560 _sc
411 463 _m
401 469 390 473 378 476 _c
366 478 353 480 339 480 _c
288 480 249 463 222 430 _c
194 397 181 350 181 288 _c
181 0 _l
91 0 _l
91 547 _l
181 547 _l
181 462 _l
199 495 224 520 254 536 _c
284 552 321 560 365 560 _c
371 560 378 559 386 559 _c
393 558 401 557 411 555 _c
411 463 _l
_cl}_d
/t{392 0 27 0 368 702 _sc
183 702 _m
183 547 _l
368 547 _l
368 477 _l
183 477 _l
183 180 _l
183 135 189 106 201 94 _c
213 81 238 75 276 75 _c
368 75 _l
368 0 _l
276 0 _l
206 0 158 13 132 39 _c
106 65 93 112 93 180 _c
93 477 _l
27 477 _l
27 547 _l
93 547 _l
93 702 _l
183 702 _l
_cl}_d
/x{592 0 29 0 559 547 _sc
549 547 _m
351 281 _l
559 0 _l
453 0 _l
294 215 _l
135 0 _l
29 0 _l
241 286 _l
47 547 _l
153 547 _l
298 352 _l
443 547 _l
549 547 _l
_cl}_d
/y{592 0 30 -207 562 547 _sc
322 -50 _m
296 -114 271 -157 247 -177 _c
223 -197 191 -207 151 -207 _c
79 -207 _l
79 -132 _l
132 -132 _l
156 -132 175 -126 189 -114 _c
203 -102 218 -75 235 -31 _c
251 9 _l
30 547 _l
125 547 _l
296 119 _l
467 547 _l
562 547 _l
322 -50 _l
_cl}_d
/z{525 0 43 0 482 547 _sc
55 547 _m
482 547 _l
482 465 _l
144 72 _l
482 72 _l
482 0 _l
43 0 _l
43 82 _l
381 475 _l
55 475 _l
55 547 _l
_cl}_d
/minus{838 0 106 272 732 355 _sc
106 355 _m
732 355 _l
732 272 _l
106 272 _l
106 355 _l
_cl}_d
end readonly def

/BuildGlyph
 {exch begin
 CharStrings exch
 2 copy known not{pop /.notdef}if
 true 3 1 roll get exec
 end}_d

/BuildChar {
 1 index /Encoding get exch get
 1 index /BuildGlyph get exec
}_d

FontName currentdict end definefont pop
end
%%EndProlog
mpldict begin
6.84 162.36 translate
598.32 467.28 0 0 clipbox
gsave
0 0 m
598.32 0 l
598.32 467.28 l
0 467.28 l
cl
1.000 setgray
fill
grestore
gsave
74.79 247.6584 m
285.561818 247.6584 l
285.561818 411.2064 l
74.79 411.2064 l
cl
1.000 setgray
fill
grestore
0.800 setlinewidth
1 setlinejoin
0 setlinecap
[] 0 setdash
0.000 setgray
gsave
/o {
gsave
newpath
translate
0.8 setlinewidth
1 setlinejoin
0 setlinecap
0 0 m
0 -3.5 l

gsave
0.000 setgray
fill
grestore
stroke
grestore
} bind def
82.4351 247.658 o
grestore
/DejaVuSans findfont
10.000 scalefont
setfont
gsave
79.255388 233.064650 translate
0.000000 rotate
0.000000 0.000000 m /zero glyphshow
grestore
gsave
/o {
gsave
newpath
translate
0.8 setlinewidth
1 setlinejoin
0 setlinecap
0 0 m
0 -3.5 l

gsave
0.000 setgray
fill
grestore
stroke
grestore
} bind def
121.144 247.658 o
grestore
gsave
114.784941 233.064650 translate
0.000000 rotate
0.000000 0.000000 m /two glyphshow
6.362305 0.000000 m /zero glyphshow
grestore
gsave
/o {
gsave
newpath
translate
0.8 setlinewidth
1 setlinejoin
0 setlinecap
0 0 m
0 -3.5 l

gsave
0.000 setgray
fill
grestore
stroke
grestore
} bind def
159.854 247.658 o
grestore
gsave
153.494182 233.064650 translate
0.000000 rotate
0.000000 0.000000 m /four glyphshow
6.362305 0.000000 m /zero glyphshow
grestore
gsave
/o {
gsave
newpath
translate
0.8 setlinewidth
1 setlinejoin
0 setlinecap
0 0 m
0 -3.5 l

gsave
0.000 setgray
fill
grestore
stroke
grestore
} bind def
198.563 247.658 o
grestore
gsave
192.203424 233.064650 translate
0.000000 rotate
0.000000 0.000000 m /six glyphshow
6.362305 0.000000 m /zero glyphshow
grestore
gsave
/o {
gsave
newpath
translate
0.8 setlinewidth
1 setlinejoin
0 setlinecap
0 0 m
0 -3.5 l

gsave
0.000 setgray
fill
grestore
stroke
grestore
} bind def
237.272 247.658 o
grestore
gsave
230.912665 233.064650 translate
0.000000 rotate
0.000000 0.000000 m /eight glyphshow
6.362305 0.000000 m /zero glyphshow
grestore
gsave
/o {
gsave
newpath
translate
0.8 setlinewidth
1 setlinejoin
0 setlinecap
0 0 m
0 -3.5 l

gsave
0.000 setgray
fill
grestore
stroke
grestore
} bind def
275.981 247.658 o
grestore
gsave
266.442218 233.064650 translate
0.000000 rotate
0.000000 0.000000 m /one glyphshow
6.362305 0.000000 m /zero glyphshow
12.724609 0.000000 m /zero glyphshow
grestore
gsave
/o {
gsave
newpath
translate
0.8 setlinewidth
1 setlinejoin
0 setlinecap
0 0 m
-3.5 0 l

gsave
0.000 setgray
fill
grestore
stroke
grestore
} bind def
74.79 265.682 o
grestore
gsave
30.790000 261.884845 translate
0.000000 rotate
0.000000 0.000000 m /minus glyphshow
8.378906 0.000000 m /zero glyphshow
14.741211 0.000000 m /period glyphshow
17.919922 0.000000 m /zero glyphshow
24.282227 0.000000 m /one glyphshow
30.644531 0.000000 m /zero glyphshow
grestore
gsave
/o {
gsave
newpath
translate
0.8 setlinewidth
1 setlinejoin
0 setlinecap
0 0 m
-3.5 0 l

gsave
0.000 setgray
fill
grestore
stroke
grestore
} bind def
74.79 299.515 o
grestore
gsave
30.790000 295.717805 translate
0.000000 rotate
0.000000 0.000000 m /minus glyphshow
8.378906 0.000000 m /zero glyphshow
14.741211 0.000000 m /period glyphshow
17.919922 0.000000 m /zero glyphshow
24.282227 0.000000 m /zero glyphshow
30.644531 0.000000 m /five glyphshow
grestore
gsave
/o {
gsave
newpath
translate
0.8 setlinewidth
1 setlinejoin
0 setlinecap
0 0 m
-3.5 0 l

gsave
0.000 setgray
fill
grestore
stroke
grestore
} bind def
74.79 333.348 o
grestore
gsave
39.165000 329.550765 translate
0.000000 rotate
0.000000 0.000000 m /zero glyphshow
6.362305 0.000000 m /period glyphshow
9.541016 0.000000 m /zero glyphshow
15.903320 0.000000 m /zero glyphshow
22.265625 0.000000 m /zero glyphshow
grestore
gsave
/o {
gsave
newpath
translate
0.8 setlinewidth
1 setlinejoin
0 setlinecap
0 0 m
-3.5 0 l

gsave
0.000 setgray
fill
grestore
stroke
grestore
} bind def
74.79 367.181 o
grestore
gsave
39.165000 363.383725 translate
0.000000 rotate
0.000000 0.000000 m /zero glyphshow
6.362305 0.000000 m /period glyphshow
9.541016 0.000000 m /zero glyphshow
15.903320 0.000000 m /zero glyphshow
22.265625 0.000000 m /five glyphshow
grestore
gsave
/o {
gsave
newpath
translate
0.8 setlinewidth
1 setlinejoin
0 setlinecap
0 0 m
-3.5 0 l

gsave
0.000 setgray
fill
grestore
stroke
grestore
} bind def
74.79 401.014 o
grestore
gsave
39.165000 397.216685 translate
0.000000 rotate
0.000000 0.000000 m /zero glyphshow
6.362305 0.000000 m /period glyphshow
9.541016 0.000000 m /zero glyphshow
15.903320 0.000000 m /one glyphshow
22.265625 0.000000 m /zero glyphshow
grestore
1.500 setlinewidth
2 setlinecap
0.122 0.467 0.706 setrgbcolor
gsave
210.8 163.5 74.79 247.7 clipbox
84.370537 370.7324 m
86.305999 326.1284 l
88.241461 316.2164 l
90.176923 298.0444 l
92.112385 296.3924 l
94.047847 349.2564 l
95.98331 370.7324 l
97.918772 367.4284 l
99.854234 337.6924 l
101.789696 314.5644 l
103.725158 336.0404 l
105.66062 312.9124 l
107.596082 332.7364 l
109.531544 307.9564 l
111.467006 324.4764 l
113.402468 357.5164 l
115.33793 374.0364 l
117.273392 337.6924 l
119.208854 397.1644 l
121.144316 369.0804 l
123.079778 350.9084 l
125.01524 327.7804 l
126.950702 359.1684 l
128.886165 355.8644 l
130.821627 344.3004 l
132.757089 342.6484 l
134.692551 317.8684 l
136.628013 276.5684 l
138.563475 344.3004 l
140.498937 321.1724 l
142.434399 263.3524 l
144.369861 263.3524 l
146.305323 322.8244 l
148.240785 317.8684 l
150.176247 339.3444 l
152.111709 340.9964 l
154.047171 303.0004 l
155.982633 352.5604 l
157.918095 350.9084 l
159.853557 372.3844 l
161.78902 403.7724 l
163.724482 314.5644 l
165.659944 360.8204 l
167.595406 377.3404 l
169.530868 367.4284 l
171.46633 336.0404 l
173.401792 331.0844 l
175.337254 344.3004 l
177.272716 327.7804 l
179.208178 314.5644 l
181.14364 319.5204 l
183.079102 296.3924 l
185.014564 311.2604 l
186.950026 329.4324 l
188.885488 339.3444 l
190.82095 276.5684 l
192.756412 362.4724 l
194.691875 355.8644 l
196.627337 344.3004 l
198.562799 352.5604 l
200.498261 377.3404 l
202.433723 326.1284 l
204.369185 344.3004 l
206.304647 374.0364 l
208.240109 362.4724 l
210.175571 276.5684 l
212.111033 306.3044 l
214.046495 326.1284 l
215.981957 289.7844 l
217.917419 301.3484 l
219.852881 324.4764 l
221.788343 266.6564 l
223.723805 312.9124 l
225.659267 322.8244 l
227.59473 347.6044 l
229.530192 314.5644 l
231.465654 357.5164 l
233.401116 354.2124 l
235.336578 370.7324 l
237.27204 336.0404 l
239.207502 367.4284 l
241.142964 365.7764 l
243.078426 364.1244 l
245.013888 312.9124 l
246.94935 324.4764 l
248.884812 342.6484 l
250.820274 332.7364 l
252.755736 298.0444 l
254.691198 255.0924 l
256.62666 307.9564 l
258.562122 344.3004 l
260.497585 283.1764 l
262.433047 303.0004 l
264.368509 317.8684 l
266.303971 334.3884 l
268.239433 344.3004 l
270.174895 392.2084 l
272.110357 329.4324 l
274.045819 369.0804 l
275.981281 324.4764 l
stroke
grestore
0.800 setlinewidth
0 setlinejoin
[] 0 setdash
0.000 setgray
gsave
74.79 247.6584 m
74.79 411.2064 l
stroke
grestore
gsave
285.561818 247.6584 m
285.561818 411.2064 l
stroke
grestore
gsave
74.79 247.6584 m
285.561818 247.6584 l
stroke
grestore
gsave
74.79 411.2064 m
285.561818 411.2064 l
stroke
grestore
/DejaVuSans findfont
12.000 scalefont
setfont
gsave
172.941534 417.206400 translate
0.000000 rotate
0.000000 0.000000 m /a glyphshow
7.353516 0.000000 m /x glyphshow
grestore
gsave
327.716182 247.6584 m
538.488 247.6584 l
538.488 411.2064 l
327.716182 411.2064 l
cl
1.000 setgray
fill
grestore
1 setlinejoin
0 setlinecap
[] 0 setdash
gsave
/o {
gsave
newpath
translate
0.8 setlinewidth
1 setlinejoin
0 setlinecap
0 0 m
0 -3.5 l

gsave
0.000 setgray
fill
grestore
stroke
grestore
} bind def
335.361 247.658 o
grestore
/DejaVuSans findfont
10.000 scalefont
setfont
gsave
332.181569 233.064650 translate
0.000000 rotate
0.000000 0.000000 m /zero glyphshow
grestore
gsave
/o {
gsave
newpath
translate
0.8 setlinewidth
1 setlinejoin
0 setlinecap
0 0 m
0 -3.5 l

gsave
0.000 setgray
fill
grestore
stroke
grestore
} bind def
374.07 247.658 o
grestore
gsave
367.711123 233.064650 translate
0.000000 rotate
0.000000 0.000000 m /two glyphshow
6.362305 0.000000 m /zero glyphshow
grestore
gsave
/o {
gsave
newpath
translate
0.8 setlinewidth
1 setlinejoin
0 setlinecap
0 0 m
0 -3.5 l

gsave
0.000 setgray
fill
grestore
stroke
grestore
} bind def
412.78 247.658 o
grestore
gsave
406.420364 233.064650 translate
0.000000 rotate
0.000000 0.000000 m /four glyphshow
6.362305 0.000000 m /zero glyphshow
grestore
gsave
/o {
gsave
newpath
translate
0.8 setlinewidth
1 setlinejoin
0 setlinecap
0 0 m
0 -3.5 l

gsave
0.000 setgray
fill
grestore
stroke
grestore
} bind def
451.489 247.658 o
grestore
gsave
445.129605 233.064650 translate
0.000000 rotate
0.000000 0.000000 m /six glyphshow
6.362305 0.000000 m /zero glyphshow
grestore
gsave
/o {
gsave
newpath
translate
0.8 setlinewidth
1 setlinejoin
0 setlinecap
0 0 m
0 -3.5 l

gsave
0.000 setgray
fill
grestore
stroke
grestore
} bind def
490.198 247.658 o
grestore
gsave
483.838847 233.064650 translate
0.000000 rotate
0.000000 0.000000 m /eight glyphshow
6.362305 0.000000 m /zero glyphshow
grestore
gsave
/o {
gsave
newpath
translate
0.8 setlinewidth
1 setlinejoin
0 setlinecap
0 0 m
0 -3.5 l

gsave
0.000 setgray
fill
grestore
stroke
grestore
} bind def
528.907 247.658 o
grestore
gsave
519.368400 233.064650 translate
0.000000 rotate
0.000000 0.000000 m /one glyphshow
6.362305 0.000000 m /zero glyphshow
12.724609 0.000000 m /zero glyphshow
grestore
gsave
/o {
gsave
newpath
translate
0.8 setlinewidth
1 setlinejoin
0 setlinecap
0 0 m
-3.5 0 l

gsave
0.000 setgray
fill
grestore
stroke
grestore
} bind def
327.716 282.016 o
grestore
gsave
283.716182 278.219144 translate
0.000000 rotate
0.000000 0.000000 m /minus glyphshow
8.378906 0.000000 m /zero glyphshow
14.741211 0.000000 m /period glyphshow
17.919922 0.000000 m /zero glyphshow
24.282227 0.000000 m /zero glyphshow
30.644531 0.000000 m /five glyphshow
grestore
gsave
/o {
gsave
newpath
translate
0.8 setlinewidth
1 setlinejoin
0 setlinecap
0 0 m
-3.5 0 l

gsave
0.000 setgray
fill
grestore
stroke
grestore
} bind def
327.716 318.702 o
grestore
gsave
292.091182 314.905486 translate
0.000000 rotate
0.000000 0.000000 m /zero glyphshow
6.362305 0.000000 m /period glyphshow
9.541016 0.000000 m /zero glyphshow
15.903320 0.000000 m /zero glyphshow
22.265625 0.000000 m /zero glyphshow
grestore
gsave
/o {
gsave
newpath
translate
0.8 setlinewidth
1 setlinejoin
0 setlinecap
0 0 m
-3.5 0 l

gsave
0.000 setgray
fill
grestore
stroke
grestore
} bind def
327.716 355.389 o
grestore
gsave
292.091182 351.591829 translate
0.000000 rotate
0.000000 0.000000 m /zero glyphshow
6.362305 0.000000 m /period glyphshow
9.541016 0.000000 m /zero glyphshow
15.903320 0.000000 m /zero glyphshow
22.265625 0.000000 m /five glyphshow
grestore
gsave
/o {
gsave
newpath
translate
0.8 setlinewidth
1 setlinejoin
0 setlinecap
0 0 m
-3.5 0 l

gsave
0.000 setgray
fill
grestore
stroke
grestore
} bind def
327.716 392.075 o
grestore
gsave
292.091182 388.278171 translate
0.000000 rotate
0.000000 0.000000 m /zero glyphshow
6.362305 0.000000 m /period glyphshow
9.541016 0.000000 m /zero glyphshow
15.903320 0.000000 m /one glyphshow
22.265625 0.000000 m /zero glyphshow
grestore
1.500 setlinewidth
2 setlinecap
0.122 0.467 0.706 setrgbcolor
gsave
210.8 163.5 327.7 247.7 clipbox
337.296719 281.96228 m
339.232181 274.796978 l
341.167643 312.41481 l
343.103105 319.580111 l
345.038567 362.571918 l
346.974029 328.536737 l
348.909491 323.162761 l
350.844953 290.918906 l
352.780415 260.466376 l
354.715878 335.702039 l
356.65134 357.197942 l
358.586802 324.954087 l
360.522264 315.99746 l
362.457726 315.99746 l
364.393188 317.788786 l
366.32865 319.580111 l
368.264112 335.702039 l
370.199574 335.702039 l
372.135036 353.615292 l
374.070498 287.336255 l
376.00596 319.580111 l
377.941422 296.292882 l
379.876884 274.796978 l
381.812346 353.615292 l
383.747808 332.119388 l
385.68327 301.666858 l
387.618733 308.832159 l
389.554195 308.832159 l
391.489657 357.197942 l
393.425119 317.788786 l
395.360581 344.658665 l
397.296043 287.336255 l
399.231505 350.032641 l
401.166967 321.371436 l
403.102429 285.54493 l
405.037891 332.119388 l
406.973353 341.076014 l
408.908815 280.170954 l
410.844277 292.710231 l
412.779739 299.875533 l
414.715201 310.623484 l
416.650663 283.753605 l
418.586125 296.292882 l
420.521588 310.623484 l
422.45705 317.788786 l
424.392512 321.371436 l
426.327974 326.745412 l
428.263436 255.0924 l
430.198898 335.702039 l
432.13436 312.41481 l
434.069822 342.86734 l
436.005284 296.292882 l
437.940746 369.737219 l
439.876208 339.284689 l
441.81167 296.292882 l
443.747132 308.832159 l
445.682594 290.918906 l
447.618056 280.170954 l
449.553518 294.501557 l
451.48898 308.832159 l
453.424443 298.084207 l
455.359905 285.54493 l
457.295367 351.823966 l
459.230829 346.44999 l
461.166291 319.580111 l
463.101753 315.99746 l
465.037215 299.875533 l
466.972677 326.745412 l
468.908139 326.745412 l
470.843601 375.111195 l
472.779063 296.292882 l
474.714525 358.989267 l
476.649987 332.119388 l
478.585449 330.328063 l
480.520911 339.284689 l
482.456373 342.86734 l
484.391835 326.745412 l
486.327298 342.86734 l
488.26276 314.206135 l
490.198222 280.170954 l
492.133684 271.214328 l
494.069146 298.084207 l
496.004608 289.127581 l
497.94007 323.162761 l
499.875532 350.032641 l
501.810994 301.666858 l
503.746456 335.702039 l
505.681918 403.7724 l
507.61738 341.076014 l
509.552842 285.54493 l
511.488304 281.96228 l
513.423766 358.989267 l
515.359228 315.99746 l
517.29469 366.154569 l
519.230153 351.823966 l
521.165615 303.458183 l
523.101077 335.702039 l
525.036539 341.076014 l
526.972001 308.832159 l
528.907463 339.284689 l
stroke
grestore
0.800 setlinewidth
0 setlinejoin
[] 0 setdash
0.000 setgray
gsave
327.716182 247.6584 m
327.716182 411.2064 l
stroke
grestore
gsave
538.488 247.6584 m
538.488 411.2064 l
stroke
grestore
gsave
327.716182 247.6584 m
538.488 247.6584 l
stroke
grestore
gsave
327.716182 411.2064 m
538.488 411.2064 l
stroke
grestore
/DejaVuSans findfont
12.000 scalefont
setfont
gsave
425.867716 417.206400 translate
0.000000 rotate
0.000000 0.000000 m /a glyphshow
7.353516 0.000000 m /y glyphshow
grestore
gsave
74.79 51.4008 m
285.561818 51.4008 l
285.561818 214.9488 l
74.79 214.9488 l
cl
1.000 setgray
fill
grestore
1 setlinejoin
0 setlinecap
[] 0 setdash
gsave
/o {
gsave
newpath
translate
0.8 setlinewidth
1 setlinejoin
0 setlinecap
0 0 m
0 -3.5 l

gsave
0.000 setgray
fill
grestore
stroke
grestore
} bind def
82.4351 51.4008 o
grestore
/DejaVuSans findfont
10.000 scalefont
setfont
gsave
79.255388 36.807050 translate
0.000000 rotate
0.000000 0.000000 m /zero glyphshow
grestore
gsave
/o {
gsave
newpath
translate
0.8 setlinewidth
1 setlinejoin
0 setlinecap
0 0 m
0 -3.5 l

gsave
0.000 setgray
fill
grestore
stroke
grestore
} bind def
121.144 51.4008 o
grestore
gsave
114.784941 36.807050 translate
0.000000 rotate
0.000000 0.000000 m /two glyphshow
6.362305 0.000000 m /zero glyphshow
grestore
gsave
/o {
gsave
newpath
translate
0.8 setlinewidth
1 setlinejoin
0 setlinecap
0 0 m
0 -3.5 l

gsave
0.000 setgray
fill
grestore
stroke
grestore
} bind def
159.854 51.4008 o
grestore
gsave
153.494182 36.807050 translate
0.000000 rotate
0.000000 0.000000 m /four glyphshow
6.362305 0.000000 m /zero glyphshow
grestore
gsave
/o {
gsave
newpath
translate
0.8 setlinewidth
1 setlinejoin
0 setlinecap
0 0 m
0 -3.5 l

gsave
0.000 setgray
fill
grestore
stroke
grestore
} bind def
198.563 51.4008 o
grestore
gsave
192.203424 36.807050 translate
0.000000 rotate
0.000000 0.000000 m /six glyphshow
6.362305 0.000000 m /zero glyphshow
grestore
gsave
/o {
gsave
newpath
translate
0.8 setlinewidth
1 setlinejoin
0 setlinecap
0 0 m
0 -3.5 l

gsave
0.000 setgray
fill
grestore
stroke
grestore
} bind def
237.272 51.4008 o
grestore
gsave
230.912665 36.807050 translate
0.000000 rotate
0.000000 0.000000 m /eight glyphshow
6.362305 0.000000 m /zero glyphshow
grestore
gsave
/o {
gsave
newpath
translate
0.8 setlinewidth
1 setlinejoin
0 setlinecap
0 0 m
0 -3.5 l

gsave
0.000 setgray
fill
grestore
stroke
grestore
} bind def
275.981 51.4008 o
grestore
gsave
266.442218 36.807050 translate
0.000000 rotate
0.000000 0.000000 m /one glyphshow
6.362305 0.000000 m /zero glyphshow
12.724609 0.000000 m /zero glyphshow
grestore
gsave
/o {
gsave
newpath
translate
0.8 setlinewidth
1 setlinejoin
0 setlinecap
0 0 m
-3.5 0 l

gsave
0.000 setgray
fill
grestore
stroke
grestore
} bind def
74.79 52.3191 o
grestore
gsave
39.165000 48.522243 translate
0.000000 rotate
0.000000 0.000000 m /zero glyphshow
6.362305 0.000000 m /period glyphshow
9.541016 0.000000 m /nine glyphshow
15.903320 0.000000 m /eight glyphshow
22.265625 0.000000 m /zero glyphshow
grestore
gsave
/o {
gsave
newpath
translate
0.8 setlinewidth
1 setlinejoin
0 setlinecap
0 0 m
-3.5 0 l

gsave
0.000 setgray
fill
grestore
stroke
grestore
} bind def
74.79 74.7086 o
grestore
gsave
39.165000 70.911701 translate
0.000000 rotate
0.000000 0.000000 m /zero glyphshow
6.362305 0.000000 m /period glyphshow
9.541016 0.000000 m /nine glyphshow
15.903320 0.000000 m /eight glyphshow
22.265625 0.000000 m /five glyphshow
grestore
gsave
/o {
gsave
newpath
translate
0.8 setlinewidth
1 setlinejoin
0 setlinecap
0 0 m
-3.5 0 l

gsave
0.000 setgray
fill
grestore
stroke
grestore
} bind def
74.79 97.098 o
grestore
gsave
39.165000 93.301160 translate
0.000000 rotate
0.000000 0.000000 m /zero glyphshow
6.362305 0.000000 m /period glyphshow
9.541016 0.000000 m /nine glyphshow
15.903320 0.000000 m /nine glyphshow
22.265625 0.000000 m /zero glyphshow
grestore
gsave
/o {
gsave
newpath
translate
0.8 setlinewidth
1 setlinejoin
0 setlinecap
0 0 m
-3.5 0 l

gsave
0.000 setgray
fill
grestore
stroke
grestore
} bind def
74.79 119.487 o
grestore
gsave
39.165000 115.690619 translate
0.000000 rotate
0.000000 0.000000 m /zero glyphshow
6.362305 0.000000 m /period glyphshow
9.541016 0.000000 m /nine glyphshow
15.903320 0.000000 m /nine glyphshow
22.265625 0.000000 m /five glyphshow
grestore
gsave
/o {
gsave
newpath
translate
0.8 setlinewidth
1 setlinejoin
0 setlinecap
0 0 m
-3.5 0 l

gsave
0.000 setgray
fill
grestore
stroke
grestore
} bind def
74.79 141.877 o
grestore
gsave
39.165000 138.080078 translate
0.000000 rotate
0.000000 0.000000 m /one glyphshow
6.362305 0.000000 m /period glyphshow
9.541016 0.000000 m /zero glyphshow
15.903320 0.000000 m /zero glyphshow
22.265625 0.000000 m /zero glyphshow
grestore
gsave
/o {
gsave
newpath
translate
0.8 setlinewidth
1 setlinejoin
0 setlinecap
0 0 m
-3.5 0 l

gsave
0.000 setgray
fill
grestore
stroke
grestore
} bind def
74.79 164.266 o
grestore
gsave
39.165000 160.469537 translate
0.000000 rotate
0.000000 0.000000 m /one glyphshow
6.362305 0.000000 m /period glyphshow
9.541016 0.000000 m /zero glyphshow
15.903320 0.000000 m /zero glyphshow
22.265625 0.000000 m /five glyphshow
grestore
gsave
/o {
gsave
newpath
translate
0.8 setlinewidth
1 setlinejoin
0 setlinecap
0 0 m
-3.5 0 l

gsave
0.000 setgray
fill
grestore
stroke
grestore
} bind def
74.79 186.656 o
grestore
gsave
39.165000 182.858996 translate
0.000000 rotate
0.000000 0.000000 m /one glyphshow
6.362305 0.000000 m /period glyphshow
9.541016 0.000000 m /zero glyphshow
15.903320 0.000000 m /one glyphshow
22.265625 0.000000 m /zero glyphshow
grestore
gsave
/o {
gsave
newpath
translate
0.8 setlinewidth
1 setlinejoin
0 setlinecap
0 0 m
-3.5 0 l

gsave
0.000 setgray
fill
grestore
stroke
grestore
} bind def
74.79 209.045 o
grestore
gsave
39.165000 205.248454 translate
0.000000 rotate
0.000000 0.000000 m /one glyphshow
6.362305 0.000000 m /period glyphshow
9.541016 0.000000 m /zero glyphshow
15.903320 0.000000 m /one glyphshow
22.265625 0.000000 m /five glyphshow
grestore
1.500 setlinewidth
2 setlinecap
0.122 0.467 0.706 setrgbcolor
gsave
210.8 163.5 74.79 51.4 clipbox
84.370537 174.717741 m
86.305999 141.920682 l
88.241461 184.556859 l
90.176923 162.692153 l
92.112385 127.708624 l
94.047847 157.225976 l
95.98331 100.377741 l
97.918772 192.209506 l
99.854234 159.412447 l
101.789696 150.666565 l
103.725158 94.911565 l
105.66062 123.335682 l
107.596082 121.149212 l
109.531544 118.962741 l
111.467006 130.988329 l
113.402468 125.522153 l
115.33793 117.869506 l
117.273392 115.683035 l
119.208854 143.013918 l
121.144316 134.268035 l
123.079778 171.438035 l
125.01524 179.090682 l
126.950702 141.920682 l
128.886165 151.7598 l
130.821627 196.582447 l
132.757089 122.242447 l
134.692551 191.116271 l
136.628013 160.505682 l
138.563475 159.412447 l
140.498937 137.547741 l
142.434399 169.251565 l
144.369861 127.708624 l
146.305323 129.895094 l
148.240785 150.666565 l
150.176247 77.4198 l
152.111709 103.657447 l
154.047171 134.268035 l
155.982633 93.818329 l
157.918095 101.470976 l
159.853557 117.869506 l
161.78902 169.251565 l
163.724482 165.971859 l
165.659944 135.361271 l
167.595406 145.200388 l
169.530868 134.268035 l
171.46633 159.412447 l
173.401792 153.946271 l
175.337254 176.904212 l
177.272716 183.463624 l
179.208178 130.988329 l
181.14364 125.522153 l
183.079102 149.573329 l
185.014564 124.428918 l
186.950026 89.445388 l
188.885488 127.708624 l
190.82095 146.293624 l
192.756412 109.123624 l
194.691875 96.0048 l
196.627337 97.098035 l
198.562799 153.946271 l
200.498261 133.1748 l
202.433723 148.480094 l
204.369185 109.123624 l
206.304647 110.216859 l
208.240109 175.810976 l
210.175571 174.717741 l
212.111033 194.395976 l
214.046495 176.904212 l
215.981957 171.438035 l
217.917419 169.251565 l
219.852881 188.9298 l
221.788343 118.962741 l
223.723805 104.750682 l
225.659267 127.708624 l
227.59473 125.522153 l
229.530192 89.445388 l
231.465654 101.470976 l
233.401116 92.725094 l
235.336578 160.505682 l
237.27204 133.1748 l
239.207502 159.412447 l
241.142964 139.734212 l
243.078426 157.225976 l
245.013888 169.251565 l
246.94935 207.5148 l
248.884812 171.438035 l
250.820274 159.412447 l
252.755736 173.624506 l
254.691198 182.370388 l
256.62666 164.878624 l
258.562122 150.666565 l
260.497585 172.531271 l
262.433047 169.251565 l
264.368509 58.8348 l
266.303971 163.785388 l
268.239433 164.878624 l
270.174895 67.580682 l
272.110357 156.132741 l
274.045819 112.403329 l
275.981281 111.310094 l
stroke
grestore
0.800 setlinewidth
0 setlinejoin
[] 0 setdash
0.000 setgray
gsave
74.79 51.4008 m
74.79 214.9488 l
stroke
grestore
gsave
285.561818 51.4008 m
285.561818 214.9488 l
stroke
grestore
gsave
74.79 51.4008 m
285.561818 51.4008 l
stroke
grestore
gsave
74.79 214.9488 m
285.561818 214.9488 l
stroke
grestore
/DejaVuSans findfont
12.000 scalefont
setfont
gsave
173.347784 220.948800 translate
0.000000 rotate
0.000000 0.000000 m /a glyphshow
7.353516 0.000000 m /z glyphshow
grestore
gsave
327.716182 51.4008 m
538.488 51.4008 l
538.488 214.9488 l
327.716182 214.9488 l
cl
1.000 setgray
fill
grestore
1 setlinejoin
0 setlinecap
[] 0 setdash
gsave
/o {
gsave
newpath
translate
0.8 setlinewidth
1 setlinejoin
0 setlinecap
0 0 m
0 -3.5 l

gsave
0.000 setgray
fill
grestore
stroke
grestore
} bind def
335.361 51.4008 o
grestore
/DejaVuSans findfont
10.000 scalefont
setfont
gsave
332.181569 36.807050 translate
0.000000 rotate
0.000000 0.000000 m /zero glyphshow
grestore
gsave
/o {
gsave
newpath
translate
0.8 setlinewidth
1 setlinejoin
0 setlinecap
0 0 m
0 -3.5 l

gsave
0.000 setgray
fill
grestore
stroke
grestore
} bind def
374.07 51.4008 o
grestore
gsave
367.711123 36.807050 translate
0.000000 rotate
0.000000 0.000000 m /two glyphshow
6.362305 0.000000 m /zero glyphshow
grestore
gsave
/o {
gsave
newpath
translate
0.8 setlinewidth
1 setlinejoin
0 setlinecap
0 0 m
0 -3.5 l

gsave
0.000 setgray
fill
grestore
stroke
grestore
} bind def
412.78 51.4008 o
grestore
gsave
406.420364 36.807050 translate
0.000000 rotate
0.000000 0.000000 m /four glyphshow
6.362305 0.000000 m /zero glyphshow
grestore
gsave
/o {
gsave
newpath
translate
0.8 setlinewidth
1 setlinejoin
0 setlinecap
0 0 m
0 -3.5 l

gsave
0.000 setgray
fill
grestore
stroke
grestore
} bind def
451.489 51.4008 o
grestore
gsave
445.129605 36.807050 translate
0.000000 rotate
0.000000 0.000000 m /six glyphshow
6.362305 0.000000 m /zero glyphshow
grestore
gsave
/o {
gsave
newpath
translate
0.8 setlinewidth
1 setlinejoin
0 setlinecap
0 0 m
0 -3.5 l

gsave
0.000 setgray
fill
grestore
stroke
grestore
} bind def
490.198 51.4008 o
grestore
gsave
483.838847 36.807050 translate
0.000000 rotate
0.000000 0.000000 m /eight glyphshow
6.362305 0.000000 m /zero glyphshow
grestore
gsave
/o {
gsave
newpath
translate
0.8 setlinewidth
1 setlinejoin
0 setlinecap
0 0 m
0 -3.5 l

gsave
0.000 setgray
fill
grestore
stroke
grestore
} bind def
528.907 51.4008 o
grestore
gsave
519.368400 36.807050 translate
0.000000 rotate
0.000000 0.000000 m /one glyphshow
6.362305 0.000000 m /zero glyphshow
12.724609 0.000000 m /zero glyphshow
grestore
gsave
/o {
gsave
newpath
translate
0.8 setlinewidth
1 setlinejoin
0 setlinecap
0 0 m
-3.5 0 l

gsave
0.000 setgray
fill
grestore
stroke
grestore
} bind def
327.716 60.5103 o
grestore
gsave
304.809932 56.713463 translate
0.000000 rotate
0.000000 0.000000 m /zero glyphshow
6.362305 0.000000 m /period glyphshow
9.541016 0.000000 m /zero glyphshow
grestore
gsave
/o {
gsave
newpath
translate
0.8 setlinewidth
1 setlinejoin
0 setlinecap
0 0 m
-3.5 0 l

gsave
0.000 setgray
fill
grestore
stroke
grestore
} bind def
327.716 89.4865 o
grestore
gsave
304.809932 85.689617 translate
0.000000 rotate
0.000000 0.000000 m /zero glyphshow
6.362305 0.000000 m /period glyphshow
9.541016 0.000000 m /two glyphshow
grestore
gsave
/o {
gsave
newpath
translate
0.8 setlinewidth
1 setlinejoin
0 setlinecap
0 0 m
-3.5 0 l

gsave
0.000 setgray
fill
grestore
stroke
grestore
} bind def
327.716 118.463 o
grestore
gsave
304.809932 114.665771 translate
0.000000 rotate
0.000000 0.000000 m /zero glyphshow
6.362305 0.000000 m /period glyphshow
9.541016 0.000000 m /four glyphshow
grestore
gsave
/o {
gsave
newpath
translate
0.8 setlinewidth
1 setlinejoin
0 setlinecap
0 0 m
-3.5 0 l

gsave
0.000 setgray
fill
grestore
stroke
grestore
} bind def
327.716 147.439 o
grestore
gsave
304.809932 143.641925 translate
0.000000 rotate
0.000000 0.000000 m /zero glyphshow
6.362305 0.000000 m /period glyphshow
9.541016 0.000000 m /six glyphshow
grestore
gsave
/o {
gsave
newpath
translate
0.8 setlinewidth
1 setlinejoin
0 setlinecap
0 0 m
-3.5 0 l

gsave
0.000 setgray
fill
grestore
stroke
grestore
} bind def
327.716 176.415 o
grestore
gsave
304.809932 172.618079 translate
0.000000 rotate
0.000000 0.000000 m /zero glyphshow
6.362305 0.000000 m /period glyphshow
9.541016 0.000000 m /eight glyphshow
grestore
gsave
/o {
gsave
newpath
translate
0.8 setlinewidth
1 setlinejoin
0 setlinecap
0 0 m
-3.5 0 l

gsave
0.000 setgray
fill
grestore
stroke
grestore
} bind def
327.716 205.391 o
grestore
gsave
304.809932 201.594233 translate
0.000000 rotate
0.000000 0.000000 m /one glyphshow
6.362305 0.000000 m /period glyphshow
9.541016 0.000000 m /zero glyphshow
grestore
1.500 setlinewidth
2 setlinecap
0.122 0.467 0.706 setrgbcolor
gsave
210.8 163.5 327.7 51.4 clipbox
337.296719 61.31079 m
339.232181 60.355765 l
341.167643 60.143537 l
343.103105 59.754453 l
345.038567 59.719082 l
346.974029 60.850963 l
348.909491 61.31079 l
350.844953 61.240047 l
352.780415 60.603364 l
354.715878 60.108166 l
356.65134 60.567993 l
358.586802 60.072795 l
360.522264 60.49725 l
362.457726 59.966681 l
364.393188 60.320394 l
366.32865 61.027819 l
368.264112 61.381532 l
370.199574 60.603364 l
372.135036 61.87673 l
374.070498 61.275418 l
376.00596 60.886334 l
377.941422 60.391136 l
379.876884 61.063191 l
381.812346 60.992448 l
383.747808 60.744849 l
385.68327 60.709478 l
387.618733 60.178909 l
389.554195 59.294627 l
391.489657 60.744849 l
393.425119 60.249651 l
395.360581 59.011656 l
397.296043 59.011656 l
399.231505 60.285023 l
401.166967 60.178909 l
403.102429 60.638735 l
405.037891 60.674107 l
406.973353 59.860567 l
408.908815 60.921706 l
410.844277 60.886334 l
412.779739 61.346161 l
414.715201 62.018215 l
416.650663 60.108166 l
418.586125 61.098562 l
420.521588 61.452275 l
422.45705 61.240047 l
424.392512 60.567993 l
426.327974 60.461879 l
428.263436 60.744849 l
430.198898 60.391136 l
432.13436 60.108166 l
434.069822 60.21428 l
436.005284 59.719082 l
437.940746 60.037424 l
439.876208 60.426508 l
441.81167 60.638735 l
443.747132 59.294627 l
445.682594 61.133933 l
447.618056 60.992448 l
449.553518 60.744849 l
451.48898 60.921706 l
453.424443 61.452275 l
455.359905 60.355765 l
457.295367 60.744849 l
459.230829 61.381532 l
461.166291 61.133933 l
463.101753 59.294627 l
465.037215 59.93131 l
466.972677 60.355765 l
468.908139 59.577597 l
470.843601 59.825196 l
472.779063 60.320394 l
474.714525 59.082399 l
476.649987 60.072795 l
478.585449 60.285023 l
480.520911 60.815592 l
482.456373 60.108166 l
484.391835 61.027819 l
486.327298 60.957077 l
488.26276 61.31079 l
490.198222 60.567993 l
492.133684 61.240047 l
494.069146 61.204676 l
496.004608 61.169305 l
497.94007 60.072795 l
499.875532 60.320394 l
501.810994 60.709478 l
503.746456 60.49725 l
505.681918 59.754453 l
507.61738 58.8348 l
509.552842 59.966681 l
511.488304 60.744849 l
513.423766 59.436112 l
515.359228 59.860567 l
517.29469 60.178909 l
519.230153 60.532622 l
521.165615 60.744849 l
523.101077 61.770616 l
525.036539 60.426508 l
526.972001 61.275418 l
528.907463 60.320394 l
stroke
grestore
1.000 0.498 0.055 setrgbcolor
gsave
210.8 163.5 327.7 51.4 clipbox
337.296719 59.784873 m
339.232181 59.643388 l
341.167643 60.386184 l
343.103105 60.52767 l
345.038567 61.37658 l
346.974029 60.704526 l
348.909491 60.598412 l
350.844953 59.961729 l
352.780415 59.360417 l
354.715878 60.846011 l
356.65134 61.270466 l
358.586802 60.633783 l
360.522264 60.456927 l
362.457726 60.456927 l
364.393188 60.492298 l
366.32865 60.52767 l
368.264112 60.846011 l
370.199574 60.846011 l
372.135036 61.199724 l
374.070498 59.890986 l
376.00596 60.52767 l
377.941422 60.067843 l
379.876884 59.643388 l
381.812346 61.199724 l
383.747808 60.775269 l
385.68327 60.173957 l
387.618733 60.315442 l
389.554195 60.315442 l
391.489657 61.270466 l
393.425119 60.492298 l
395.360581 61.022867 l
397.296043 59.890986 l
399.231505 61.128981 l
401.166967 60.563041 l
403.102429 59.855615 l
405.037891 60.775269 l
406.973353 60.952125 l
408.908815 59.749501 l
410.844277 59.9971 l
412.779739 60.138585 l
414.715201 60.350813 l
416.650663 59.820244 l
418.586125 60.067843 l
420.521588 60.350813 l
422.45705 60.492298 l
424.392512 60.563041 l
426.327974 60.669155 l
428.263436 59.254303 l
430.198898 60.846011 l
432.13436 60.386184 l
434.069822 60.987496 l
436.005284 60.067843 l
437.940746 61.518065 l
439.876208 60.916754 l
441.81167 60.067843 l
443.747132 60.315442 l
445.682594 59.961729 l
447.618056 59.749501 l
449.553518 60.032472 l
451.48898 60.315442 l
453.424443 60.103214 l
455.359905 59.855615 l
457.295367 61.164353 l
459.230829 61.058239 l
461.166291 60.52767 l
463.101753 60.456927 l
465.037215 60.138585 l
466.972677 60.669155 l
468.908139 60.669155 l
470.843601 61.624179 l
472.779063 60.067843 l
474.714525 61.305838 l
476.649987 60.775269 l
478.585449 60.739897 l
480.520911 60.916754 l
482.456373 60.987496 l
484.391835 60.669155 l
486.327298 60.987496 l
488.26276 60.421556 l
490.198222 59.749501 l
492.133684 59.572645 l
494.069146 60.103214 l
496.004608 59.926358 l
497.94007 60.598412 l
499.875532 61.128981 l
501.810994 60.173957 l
503.746456 60.846011 l
505.681918 62.19012 l
507.61738 60.952125 l
509.552842 59.855615 l
511.488304 59.784873 l
513.423766 61.305838 l
515.359228 60.456927 l
517.29469 61.447323 l
519.230153 61.164353 l
521.165615 60.209328 l
523.101077 60.846011 l
525.036539 60.952125 l
526.972001 60.315442 l
528.907463 60.916754 l
stroke
grestore
0.173 0.627 0.173 setrgbcolor
gsave
210.8 163.5 327.7 51.4 clipbox
337.296719 206.453662 m
339.232181 205.392523 l
341.167643 206.772003 l
343.103105 206.064577 l
345.038567 204.932696 l
346.974029 205.887721 l
348.909491 204.048414 l
350.844953 207.019602 l
352.780415 205.958464 l
354.715878 205.675493 l
356.65134 203.871558 l
358.586802 204.791211 l
360.522264 204.720469 l
362.457726 204.649726 l
364.393188 205.03881 l
366.32865 204.861954 l
368.264112 204.614355 l
370.199574 204.543612 l
372.135036 205.427894 l
374.070498 205.144924 l
376.00596 206.347548 l
377.941422 206.595147 l
379.876884 205.392523 l
381.812346 205.710865 l
383.747808 207.161087 l
385.68327 204.75584 l
387.618733 206.984231 l
389.554195 205.993835 l
391.489657 205.958464 l
393.425119 205.251038 l
395.360581 206.276805 l
397.296043 204.932696 l
399.231505 205.003439 l
401.166967 205.675493 l
403.102429 203.305617 l
405.037891 204.154528 l
406.973353 205.144924 l
408.908815 203.836187 l
410.844277 204.083786 l
412.779739 204.614355 l
414.715201 206.276805 l
416.650663 206.170691 l
418.586125 205.180295 l
420.521588 205.498637 l
422.45705 205.144924 l
424.392512 205.958464 l
426.327974 205.781607 l
428.263436 206.524404 l
430.198898 206.736632 l
432.13436 205.03881 l
434.069822 204.861954 l
436.005284 205.640122 l
437.940746 204.826583 l
439.876208 203.694702 l
441.81167 204.932696 l
443.747132 205.534008 l
445.682594 204.331385 l
447.618056 203.906929 l
449.553518 203.942301 l
451.48898 205.781607 l
453.424443 205.109553 l
455.359905 205.604751 l
457.295367 204.331385 l
459.230829 204.366756 l
461.166291 206.489033 l
463.101753 206.453662 l
465.037215 207.090345 l
466.972677 206.524404 l
468.908139 206.347548 l
470.843601 206.276805 l
472.779063 206.913488 l
474.714525 204.649726 l
476.649987 204.1899 l
478.585449 204.932696 l
480.520911 204.861954 l
482.456373 203.694702 l
484.391835 204.083786 l
486.327298 203.800815 l
488.26276 205.993835 l
490.198222 205.109553 l
492.133684 205.958464 l
494.069146 205.321781 l
496.004608 205.887721 l
497.94007 206.276805 l
499.875532 207.5148 l
501.810994 206.347548 l
503.746456 205.958464 l
505.681918 206.41829 l
507.61738 206.701261 l
509.552842 206.13532 l
511.488304 205.675493 l
513.423766 206.382919 l
515.359228 206.276805 l
517.29469 202.704306 l
519.230153 206.099949 l
521.165615 206.13532 l
523.101077 202.987276 l
525.036539 205.85235 l
526.972001 204.437498 l
528.907463 204.402127 l
stroke
grestore
0.800 setlinewidth
0 setlinejoin
[] 0 setdash
0.000 setgray
gsave
327.716182 51.4008 m
327.716182 214.9488 l
stroke
grestore
gsave
538.488 51.4008 m
538.488 214.9488 l
stroke
grestore
gsave
327.716182 51.4008 m
538.488 51.4008 l
stroke
grestore
gsave
327.716182 214.9488 m
538.488 214.9488 l
stroke
grestore
/DejaVuSans findfont
12.000 scalefont
setfont
gsave
400.625528 220.948800 translate
0.000000 rotate
0.000000 0.000000 m /a glyphshow
7.353516 0.000000 m /x glyphshow
14.455078 0.000000 m /comma glyphshow
18.269531 0.000000 m /space glyphshow
22.083984 0.000000 m /a glyphshow
29.437500 0.000000 m /y glyphshow
36.539062 0.000000 m /space glyphshow
40.353516 0.000000 m /y glyphshow
47.455078 0.000000 m /space glyphshow
51.269531 0.000000 m /a glyphshow
58.623047 0.000000 m /z glyphshow
grestore
gsave
198.503750 448.809400 translate
0.000000 rotate
0.000000 0.000000 m /A glyphshow
8.208984 0.000000 m /c glyphshow
14.806641 0.000000 m /e glyphshow
22.189453 0.000000 m /l glyphshow
25.523438 0.000000 m /e glyphshow
32.906250 0.000000 m /r glyphshow
37.839844 0.000000 m /o glyphshow
45.181641 0.000000 m /m glyphshow
56.871094 0.000000 m /e glyphshow
64.253906 0.000000 m /t glyphshow
68.958984 0.000000 m /r glyphshow
73.892578 0.000000 m /o glyphshow
81.234375 0.000000 m /space glyphshow
85.048828 0.000000 m /c glyphshow
91.646484 0.000000 m /a glyphshow
99.000000 0.000000 m /l glyphshow
102.333984 0.000000 m /i glyphshow
105.667969 0.000000 m /b glyphshow
113.285156 0.000000 m /r glyphshow
118.218750 0.000000 m /a glyphshow
125.572266 0.000000 m /d glyphshow
133.189453 0.000000 m /o glyphshow
140.531250 0.000000 m /space glyphshow
144.345703 0.000000 m /M glyphshow
154.699219 0.000000 m /P glyphshow
161.935547 0.000000 m /U glyphshow
170.718750 0.000000 m /six glyphshow
178.353516 0.000000 m /zero glyphshow
185.988281 0.000000 m /five glyphshow
193.623047 0.000000 m /zero glyphshow
grestore

end
showpage
