%!PS-Adobe-3.0 EPSF-3.0
%%Title: /home/pi/Desktop/prue-gyr.eps
%%Creator: matplotlib version 3.0.2, http://matplotlib.org/
%%CreationDate: Sun Apr 11 20:18:26 2021
%%Orientation: portrait
%%BoundingBox: -21 147 633 644
%%EndComments
%%BeginProlog
/mpldict 8 dict def
mpldict begin
/m { moveto } bind def
/l { lineto } bind def
/r { rlineto } bind def
/c { curveto } bind def
/cl { closepath } bind def
/box {
m
1 index 0 r
0 exch r
neg 0 r
cl
} bind def
/clipbox {
box
clip
newpath
} bind def
%!PS-Adobe-3.0 Resource-Font
%%Title: DejaVu Sans
%%Copyright: Copyright (c) 2003 by Bitstream, Inc. All Rights Reserved. Copyright (c) 2006 by Tavmjong Bah. All Rights Reserved. DejaVu changes are in public domain 
%%Creator: Converted from TrueType to type 3 by PPR
25 dict begin
/_d{bind def}bind def
/_m{moveto}_d
/_l{lineto}_d
/_cl{closepath eofill}_d
/_c{curveto}_d
/_sc{7 -1 roll{setcachedevice}{pop pop pop pop pop pop}ifelse}_d
/_e{exec}_d
/FontName /DejaVuSans def
/PaintType 0 def
/FontMatrix[.001 0 0 .001 0 0]def
/FontBBox[-1021 -463 1793 1232]def
/FontType 3 def
/Encoding [ /space /comma /zero /one /two /four /five /six /eight /G /M /P /U /a /b /c /d /g /i /l /o /p /r /s /x /y /z /minus ] def
/FontInfo 10 dict dup begin
/FamilyName (DejaVu Sans) def
/FullName (DejaVu Sans) def
/Notice (Copyright (c) 2003 by Bitstream, Inc. All Rights Reserved. Copyright (c) 2006 by Tavmjong Bah. All Rights Reserved. DejaVu changes are in public domain ) def
/Weight (Book) def
/Version (Version 2.35) def
/ItalicAngle 0.0 def
/isFixedPitch false def
/UnderlinePosition -130 def
/UnderlineThickness 90 def
end readonly def
/CharStrings 29 dict dup begin
/.notdef 0 def
/space{318 0 0 0 0 0 _sc
}_d
/comma{318 0 77 -115 220 124 _sc
117 124 _m
220 124 _l
220 40 _l
140 -115 _l
77 -115 _l
117 40 _l
117 124 _l
_cl}_d
/zero{636 0 66 -13 570 742 _sc
318 664 _m
267 664 229 639 203 589 _c
177 539 165 464 165 364 _c
165 264 177 189 203 139 _c
229 89 267 64 318 64 _c
369 64 407 89 433 139 _c
458 189 471 264 471 364 _c
471 464 458 539 433 589 _c
407 639 369 664 318 664 _c
318 742 _m
399 742 461 709 505 645 _c
548 580 570 486 570 364 _c
570 241 548 147 505 83 _c
461 19 399 -13 318 -13 _c
236 -13 173 19 130 83 _c
87 147 66 241 66 364 _c
66 486 87 580 130 645 _c
173 709 236 742 318 742 _c
_cl}_d
/one{636 0 110 0 544 729 _sc
124 83 _m
285 83 _l
285 639 _l
110 604 _l
110 694 _l
284 729 _l
383 729 _l
383 83 _l
544 83 _l
544 0 _l
124 0 _l
124 83 _l
_cl}_d
/two{{636 0 73 0 536 742 _sc
192 83 _m
536 83 _l
536 0 _l
73 0 _l
73 83 _l
110 121 161 173 226 239 _c
290 304 331 346 348 365 _c
380 400 402 430 414 455 _c
426 479 433 504 433 528 _c
433 566 419 598 392 622 _c
365 646 330 659 286 659 _c
255 659 222 653 188 643 _c
154 632 117 616 78 594 _c
78 694 _l
118 710 155 722 189 730 _c
223 738 255 742 284 742 _c
}_e{359 742 419 723 464 685 _c
509 647 532 597 532 534 _c
532 504 526 475 515 449 _c
504 422 484 390 454 354 _c
446 344 420 317 376 272 _c
332 227 271 164 192 83 _c
_cl}_e}_d
/four{636 0 49 0 580 729 _sc
378 643 _m
129 254 _l
378 254 _l
378 643 _l
352 729 _m
476 729 _l
476 254 _l
580 254 _l
580 172 _l
476 172 _l
476 0 _l
378 0 _l
378 172 _l
49 172 _l
49 267 _l
352 729 _l
_cl}_d
/five{{636 0 77 -13 549 729 _sc
108 729 _m
495 729 _l
495 646 _l
198 646 _l
198 467 _l
212 472 227 476 241 478 _c
255 480 270 482 284 482 _c
365 482 429 459 477 415 _c
525 370 549 310 549 234 _c
549 155 524 94 475 51 _c
426 8 357 -13 269 -13 _c
238 -13 207 -10 175 -6 _c
143 -1 111 6 77 17 _c
77 116 _l
106 100 136 88 168 80 _c
199 72 232 69 267 69 _c
}_e{323 69 368 83 401 113 _c
433 143 450 183 450 234 _c
450 284 433 324 401 354 _c
368 384 323 399 267 399 _c
241 399 214 396 188 390 _c
162 384 135 375 108 363 _c
108 729 _l
_cl}_e}_d
/six{{636 0 70 -13 573 742 _sc
330 404 _m
286 404 251 388 225 358 _c
199 328 186 286 186 234 _c
186 181 199 139 225 109 _c
251 79 286 64 330 64 _c
374 64 409 79 435 109 _c
461 139 474 181 474 234 _c
474 286 461 328 435 358 _c
409 388 374 404 330 404 _c
526 713 _m
526 623 _l
501 635 476 644 451 650 _c
425 656 400 659 376 659 _c
310 659 260 637 226 593 _c
}_e{192 549 172 482 168 394 _c
187 422 211 444 240 459 _c
269 474 301 482 336 482 _c
409 482 467 459 509 415 _c
551 371 573 310 573 234 _c
573 159 550 99 506 54 _c
462 9 403 -13 330 -13 _c
246 -13 181 19 137 83 _c
92 147 70 241 70 364 _c
70 479 97 571 152 639 _c
206 707 280 742 372 742 _c
396 742 421 739 447 735 _c
472 730 498 723 526 713 _c
_cl}_e}_d
/eight{{636 0 68 -13 568 742 _sc
318 346 _m
271 346 234 333 207 308 _c
180 283 167 249 167 205 _c
167 161 180 126 207 101 _c
234 76 271 64 318 64 _c
364 64 401 76 428 102 _c
455 127 469 161 469 205 _c
469 249 455 283 429 308 _c
402 333 365 346 318 346 _c
219 388 _m
177 398 144 418 120 447 _c
96 476 85 511 85 553 _c
85 611 105 657 147 691 _c
188 725 245 742 318 742 _c
}_e{390 742 447 725 489 691 _c
530 657 551 611 551 553 _c
551 511 539 476 515 447 _c
491 418 459 398 417 388 _c
464 377 501 355 528 323 _c
554 291 568 251 568 205 _c
568 134 546 80 503 43 _c
459 5 398 -13 318 -13 _c
237 -13 175 5 132 43 _c
89 80 68 134 68 205 _c
68 251 81 291 108 323 _c
134 355 171 377 219 388 _c
183 544 _m
183 506 194 476 218 455 _c
}_e{242 434 275 424 318 424 _c
360 424 393 434 417 455 _c
441 476 453 506 453 544 _c
453 582 441 611 417 632 _c
393 653 360 664 318 664 _c
275 664 242 653 218 632 _c
194 611 183 582 183 544 _c
_cl}_e}_d
/G{{775 0 56 -13 693 742 _sc
595 104 _m
595 300 _l
434 300 _l
434 381 _l
693 381 _l
693 68 _l
655 40 613 20 567 7 _c
521 -6 472 -13 420 -13 _c
306 -13 216 20 152 86 _c
88 152 56 245 56 364 _c
56 482 88 575 152 642 _c
216 708 306 742 420 742 _c
467 742 512 736 555 724 _c
598 712 638 695 674 673 _c
674 568 _l
637 598 598 621 557 637 _c
516 653 473 661 428 661 _c
}_e{338 661 271 636 227 586 _c
182 536 160 462 160 364 _c
160 265 182 191 227 141 _c
271 91 338 67 428 67 _c
462 67 493 70 521 76 _c
549 82 573 91 595 104 _c
_cl}_e}_d
/M{863 0 98 0 765 729 _sc
98 729 _m
245 729 _l
431 233 _l
618 729 _l
765 729 _l
765 0 _l
669 0 _l
669 640 _l
481 140 _l
382 140 _l
194 640 _l
194 0 _l
98 0 _l
98 729 _l
_cl}_d
/P{603 0 98 0 569 729 _sc
197 648 _m
197 374 _l
321 374 _l
367 374 402 385 427 409 _c
452 433 465 467 465 511 _c
465 555 452 588 427 612 _c
402 636 367 648 321 648 _c
197 648 _l
98 729 _m
321 729 _l
402 729 464 710 506 673 _c
548 636 569 582 569 511 _c
569 439 548 384 506 348 _c
464 311 402 293 321 293 _c
197 293 _l
197 0 _l
98 0 _l
98 729 _l
_cl}_d
/U{732 0 87 -13 645 729 _sc
87 729 _m
186 729 _l
186 286 _l
186 208 200 151 228 117 _c
256 83 302 66 366 66 _c
429 66 475 83 503 117 _c
531 151 546 208 546 286 _c
546 729 _l
645 729 _l
645 274 _l
645 178 621 107 574 59 _c
527 11 458 -13 366 -13 _c
274 -13 204 11 157 59 _c
110 107 87 178 87 274 _c
87 729 _l
_cl}_d
/a{{613 0 60 -13 522 560 _sc
343 275 _m
270 275 220 266 192 250 _c
164 233 150 205 150 165 _c
150 133 160 107 181 89 _c
202 70 231 61 267 61 _c
317 61 357 78 387 114 _c
417 149 432 196 432 255 _c
432 275 _l
343 275 _l
522 312 _m
522 0 _l
432 0 _l
432 83 _l
411 49 385 25 355 10 _c
325 -5 287 -13 243 -13 _c
187 -13 142 2 109 33 _c
76 64 60 106 60 159 _c
}_e{60 220 80 266 122 298 _c
163 329 224 345 306 345 _c
432 345 _l
432 354 _l
432 395 418 427 391 450 _c
364 472 326 484 277 484 _c
245 484 215 480 185 472 _c
155 464 127 453 100 439 _c
100 522 _l
132 534 164 544 195 550 _c
226 556 256 560 286 560 _c
365 560 424 539 463 498 _c
502 457 522 395 522 312 _c
_cl}_e}_d
/b{{635 0 91 -13 580 760 _sc
487 273 _m
487 339 473 390 446 428 _c
418 466 381 485 334 485 _c
286 485 249 466 222 428 _c
194 390 181 339 181 273 _c
181 207 194 155 222 117 _c
249 79 286 61 334 61 _c
381 61 418 79 446 117 _c
473 155 487 207 487 273 _c
181 464 _m
199 496 223 520 252 536 _c
281 552 316 560 356 560 _c
422 560 476 533 518 481 _c
559 428 580 359 580 273 _c
}_e{580 187 559 117 518 65 _c
476 13 422 -13 356 -13 _c
316 -13 281 -5 252 10 _c
223 25 199 49 181 82 _c
181 0 _l
91 0 _l
91 760 _l
181 760 _l
181 464 _l
_cl}_e}_d
/c{{550 0 55 -13 488 560 _sc
488 526 _m
488 442 _l
462 456 437 466 411 473 _c
385 480 360 484 334 484 _c
276 484 230 465 198 428 _c
166 391 150 339 150 273 _c
150 206 166 154 198 117 _c
230 80 276 62 334 62 _c
360 62 385 65 411 72 _c
437 79 462 90 488 104 _c
488 21 _l
462 9 436 0 410 -5 _c
383 -10 354 -13 324 -13 _c
242 -13 176 12 128 64 _c
}_e{79 115 55 185 55 273 _c
55 362 79 432 128 483 _c
177 534 244 560 330 560 _c
358 560 385 557 411 551 _c
437 545 463 537 488 526 _c
_cl}_e}_d
/d{{635 0 55 -13 544 760 _sc
454 464 _m
454 760 _l
544 760 _l
544 0 _l
454 0 _l
454 82 _l
435 49 411 25 382 10 _c
353 -5 319 -13 279 -13 _c
213 -13 159 13 117 65 _c
75 117 55 187 55 273 _c
55 359 75 428 117 481 _c
159 533 213 560 279 560 _c
319 560 353 552 382 536 _c
411 520 435 496 454 464 _c
148 273 _m
148 207 161 155 188 117 _c
215 79 253 61 301 61 _c
}_e{348 61 385 79 413 117 _c
440 155 454 207 454 273 _c
454 339 440 390 413 428 _c
385 466 348 485 301 485 _c
253 485 215 466 188 428 _c
161 390 148 339 148 273 _c
_cl}_e}_d
/g{{635 0 55 -207 544 560 _sc
454 280 _m
454 344 440 395 414 431 _c
387 467 349 485 301 485 _c
253 485 215 467 188 431 _c
161 395 148 344 148 280 _c
148 215 161 165 188 129 _c
215 93 253 75 301 75 _c
349 75 387 93 414 129 _c
440 165 454 215 454 280 _c
544 68 _m
544 -24 523 -93 482 -139 _c
440 -184 377 -207 292 -207 _c
260 -207 231 -204 203 -200 _c
175 -195 147 -188 121 -178 _c
}_e{121 -91 _l
147 -105 173 -115 199 -122 _c
225 -129 251 -133 278 -133 _c
336 -133 380 -117 410 -87 _c
439 -56 454 -10 454 52 _c
454 96 _l
435 64 411 40 382 24 _c
353 8 319 0 279 0 _c
211 0 157 25 116 76 _c
75 127 55 195 55 280 _c
55 364 75 432 116 483 _c
157 534 211 560 279 560 _c
319 560 353 552 382 536 _c
411 520 435 496 454 464 _c
454 547 _l
544 547 _l
}_e{544 68 _l
_cl}_e}_d
/i{278 0 94 0 184 760 _sc
94 547 _m
184 547 _l
184 0 _l
94 0 _l
94 547 _l
94 760 _m
184 760 _l
184 646 _l
94 646 _l
94 760 _l
_cl}_d
/l{278 0 94 0 184 760 _sc
94 760 _m
184 760 _l
184 0 _l
94 0 _l
94 760 _l
_cl}_d
/o{612 0 55 -13 557 560 _sc
306 484 _m
258 484 220 465 192 427 _c
164 389 150 338 150 273 _c
150 207 163 156 191 118 _c
219 80 257 62 306 62 _c
354 62 392 80 420 118 _c
448 156 462 207 462 273 _c
462 337 448 389 420 427 _c
392 465 354 484 306 484 _c
306 560 _m
384 560 445 534 490 484 _c
534 433 557 363 557 273 _c
557 183 534 113 490 63 _c
445 12 384 -13 306 -13 _c
227 -13 165 12 121 63 _c
77 113 55 183 55 273 _c
55 363 77 433 121 484 _c
165 534 227 560 306 560 _c
_cl}_d
/p{{635 0 91 -207 580 560 _sc
181 82 _m
181 -207 _l
91 -207 _l
91 547 _l
181 547 _l
181 464 _l
199 496 223 520 252 536 _c
281 552 316 560 356 560 _c
422 560 476 533 518 481 _c
559 428 580 359 580 273 _c
580 187 559 117 518 65 _c
476 13 422 -13 356 -13 _c
316 -13 281 -5 252 10 _c
223 25 199 49 181 82 _c
487 273 _m
487 339 473 390 446 428 _c
418 466 381 485 334 485 _c
}_e{286 485 249 466 222 428 _c
194 390 181 339 181 273 _c
181 207 194 155 222 117 _c
249 79 286 61 334 61 _c
381 61 418 79 446 117 _c
473 155 487 207 487 273 _c
_cl}_e}_d
/r{411 0 91 0 411 560 _sc
411 463 _m
401 469 390 473 378 476 _c
366 478 353 480 339 480 _c
288 480 249 463 222 430 _c
194 397 181 350 181 288 _c
181 0 _l
91 0 _l
91 547 _l
181 547 _l
181 462 _l
199 495 224 520 254 536 _c
284 552 321 560 365 560 _c
371 560 378 559 386 559 _c
393 558 401 557 411 555 _c
411 463 _l
_cl}_d
/s{{521 0 54 -13 472 560 _sc
443 531 _m
443 446 _l
417 458 391 468 364 475 _c
336 481 308 485 279 485 _c
234 485 200 478 178 464 _c
156 450 145 430 145 403 _c
145 382 153 366 169 354 _c
185 342 217 330 265 320 _c
296 313 _l
360 299 405 279 432 255 _c
458 230 472 195 472 151 _c
472 100 452 60 412 31 _c
372 1 316 -13 246 -13 _c
216 -13 186 -10 154 -5 _c
}_e{122 0 89 8 54 20 _c
54 113 _l
87 95 120 82 152 74 _c
184 65 216 61 248 61 _c
290 61 323 68 346 82 _c
368 96 380 117 380 144 _c
380 168 371 187 355 200 _c
339 213 303 226 247 238 _c
216 245 _l
160 257 119 275 95 299 _c
70 323 58 356 58 399 _c
58 450 76 490 112 518 _c
148 546 200 560 268 560 _c
301 560 332 557 362 552 _c
391 547 418 540 443 531 _c
}_e{_cl}_e}_d
/x{592 0 29 0 559 547 _sc
549 547 _m
351 281 _l
559 0 _l
453 0 _l
294 215 _l
135 0 _l
29 0 _l
241 286 _l
47 547 _l
153 547 _l
298 352 _l
443 547 _l
549 547 _l
_cl}_d
/y{592 0 30 -207 562 547 _sc
322 -50 _m
296 -114 271 -157 247 -177 _c
223 -197 191 -207 151 -207 _c
79 -207 _l
79 -132 _l
132 -132 _l
156 -132 175 -126 189 -114 _c
203 -102 218 -75 235 -31 _c
251 9 _l
30 547 _l
125 547 _l
296 119 _l
467 547 _l
562 547 _l
322 -50 _l
_cl}_d
/z{525 0 43 0 482 547 _sc
55 547 _m
482 547 _l
482 465 _l
144 72 _l
482 72 _l
482 0 _l
43 0 _l
43 82 _l
381 475 _l
55 475 _l
55 547 _l
_cl}_d
/minus{838 0 106 272 732 355 _sc
106 355 _m
732 355 _l
732 272 _l
106 272 _l
106 355 _l
_cl}_d
end readonly def

/BuildGlyph
 {exch begin
 CharStrings exch
 2 copy known not{pop /.notdef}if
 true 3 1 roll get exec
 end}_d

/BuildChar {
 1 index /Encoding get exch get
 1 index /BuildGlyph get exec
}_d

FontName currentdict end definefont pop
end
%%EndProlog
mpldict begin
-21.96 147.6 translate
655.92 496.8 0 0 clipbox
gsave
0 0 m
655.92 0 l
655.92 496.8 l
0 496.8 l
cl
1.000 setgray
fill
grestore
gsave
81.99 263.304 m
313.052727 263.304 l
313.052727 437.184 l
81.99 437.184 l
cl
1.000 setgray
fill
grestore
0.800 setlinewidth
1 setlinejoin
0 setlinecap
[] 0 setdash
0.000 setgray
gsave
/o {
gsave
newpath
translate
0.8 setlinewidth
1 setlinejoin
0 setlinecap
0 0 m
0 -3.5 l

gsave
0.000 setgray
fill
grestore
stroke
grestore
} bind def
90.3711 263.304 o
grestore
/DejaVuSans findfont
10.000 scalefont
setfont
gsave
87.191376 248.710250 translate
0.000000 rotate
0.000000 0.000000 m /zero glyphshow
grestore
gsave
/o {
gsave
newpath
translate
0.8 setlinewidth
1 setlinejoin
0 setlinecap
0 0 m
0 -3.5 l

gsave
0.000 setgray
fill
grestore
stroke
grestore
} bind def
132.807 263.304 o
grestore
gsave
126.447451 248.710250 translate
0.000000 rotate
0.000000 0.000000 m /two glyphshow
6.362305 0.000000 m /zero glyphshow
grestore
gsave
/o {
gsave
newpath
translate
0.8 setlinewidth
1 setlinejoin
0 setlinecap
0 0 m
0 -3.5 l

gsave
0.000 setgray
fill
grestore
stroke
grestore
} bind def
175.243 263.304 o
grestore
gsave
168.883213 248.710250 translate
0.000000 rotate
0.000000 0.000000 m /four glyphshow
6.362305 0.000000 m /zero glyphshow
grestore
gsave
/o {
gsave
newpath
translate
0.8 setlinewidth
1 setlinejoin
0 setlinecap
0 0 m
0 -3.5 l

gsave
0.000 setgray
fill
grestore
stroke
grestore
} bind def
217.678 263.304 o
grestore
gsave
211.318976 248.710250 translate
0.000000 rotate
0.000000 0.000000 m /six glyphshow
6.362305 0.000000 m /zero glyphshow
grestore
gsave
/o {
gsave
newpath
translate
0.8 setlinewidth
1 setlinejoin
0 setlinecap
0 0 m
0 -3.5 l

gsave
0.000 setgray
fill
grestore
stroke
grestore
} bind def
260.114 263.304 o
grestore
gsave
253.754738 248.710250 translate
0.000000 rotate
0.000000 0.000000 m /eight glyphshow
6.362305 0.000000 m /zero glyphshow
grestore
gsave
/o {
gsave
newpath
translate
0.8 setlinewidth
1 setlinejoin
0 setlinecap
0 0 m
0 -3.5 l

gsave
0.000 setgray
fill
grestore
stroke
grestore
} bind def
302.55 263.304 o
grestore
gsave
293.010814 248.710250 translate
0.000000 rotate
0.000000 0.000000 m /one glyphshow
6.362305 0.000000 m /zero glyphshow
12.724609 0.000000 m /zero glyphshow
grestore
gsave
/o {
gsave
newpath
translate
0.8 setlinewidth
1 setlinejoin
0 setlinecap
0 0 m
-3.5 0 l

gsave
0.000 setgray
fill
grestore
stroke
grestore
} bind def
81.99 286.004 o
grestore
gsave
47.536875 282.206812 translate
0.000000 rotate
0.000000 0.000000 m /minus glyphshow
8.378906 0.000000 m /two glyphshow
14.741211 0.000000 m /zero glyphshow
21.103516 0.000000 m /zero glyphshow
grestore
gsave
/o {
gsave
newpath
translate
0.8 setlinewidth
1 setlinejoin
0 setlinecap
0 0 m
-3.5 0 l

gsave
0.000 setgray
fill
grestore
stroke
grestore
} bind def
81.99 317.619 o
grestore
gsave
47.536875 313.821840 translate
0.000000 rotate
0.000000 0.000000 m /minus glyphshow
8.378906 0.000000 m /one glyphshow
14.741211 0.000000 m /zero glyphshow
21.103516 0.000000 m /zero glyphshow
grestore
gsave
/o {
gsave
newpath
translate
0.8 setlinewidth
1 setlinejoin
0 setlinecap
0 0 m
-3.5 0 l

gsave
0.000 setgray
fill
grestore
stroke
grestore
} bind def
81.99 349.234 o
grestore
gsave
68.630625 345.436868 translate
0.000000 rotate
0.000000 0.000000 m /zero glyphshow
grestore
gsave
/o {
gsave
newpath
translate
0.8 setlinewidth
1 setlinejoin
0 setlinecap
0 0 m
-3.5 0 l

gsave
0.000 setgray
fill
grestore
stroke
grestore
} bind def
81.99 380.849 o
grestore
gsave
55.911875 377.051896 translate
0.000000 rotate
0.000000 0.000000 m /one glyphshow
6.362305 0.000000 m /zero glyphshow
12.724609 0.000000 m /zero glyphshow
grestore
gsave
/o {
gsave
newpath
translate
0.8 setlinewidth
1 setlinejoin
0 setlinecap
0 0 m
-3.5 0 l

gsave
0.000 setgray
fill
grestore
stroke
grestore
} bind def
81.99 412.464 o
grestore
gsave
55.911875 408.666924 translate
0.000000 rotate
0.000000 0.000000 m /two glyphshow
6.362305 0.000000 m /zero glyphshow
12.724609 0.000000 m /zero glyphshow
grestore
1.500 setlinewidth
2 setlinecap
0.122 0.467 0.706 setrgbcolor
gsave
231.1 173.9 81.99 263.3 clipbox
92.492851 347.92724 m
94.614639 348.366231 l
96.736427 348.378291 l
98.858216 348.281809 l
100.980004 348.004425 l
103.101792 348.120203 l
105.22358 348.800397 l
107.345368 349.856868 l
109.467156 352.681362 l
111.588944 366.526444 l
113.710733 407.395968 l
115.832521 429.280364 l
117.954309 429.280364 l
120.076097 429.280364 l
122.197885 423.501127 l
124.319673 393.131192 l
126.441461 360.39505 l
128.563249 334.943255 l
130.685038 305.856522 l
132.806826 271.207636 l
134.928614 271.207636 l
137.050402 271.207636 l
139.17219 271.207636 l
141.293978 309.66995 l
143.415766 345.717816 l
145.537554 358.709038 l
147.659343 352.801963 l
149.781131 347.078204 l
151.902919 346.762227 l
154.024707 346.803232 l
156.146495 348.110555 l
158.268283 348.747332 l
160.390071 346.663334 l
162.51186 346.135098 l
164.633648 349.685614 l
166.755436 359.560486 l
168.877224 350.467113 l
170.999012 356.147456 l
173.1208 340.78038 l
175.242588 346.451075 l
177.364376 345.56827 l
179.486165 348.380703 l
181.607953 353.626879 l
183.729741 362.84809 l
185.851529 348.31799 l
187.973317 341.402685 l
190.095105 345.833594 l
192.216893 348.284221 l
194.338681 347.623324 l
196.46047 347.485838 l
198.582258 348.269749 l
200.704046 349.215267 l
202.825834 347.9393 l
204.947622 346.002436 l
207.06941 342.432624 l
209.191198 329.644013 l
211.312986 313.210817 l
213.434775 330.288027 l
215.556563 335.833296 l
217.678351 349.249035 l
219.800139 345.286062 l
221.921927 356.451373 l
224.043715 363.180951 l
226.165503 376.249358 l
228.287292 377.61457 l
230.40908 368.272757 l
232.530868 353.014222 l
234.652656 348.561605 l
236.774444 346.458311 l
238.896232 345.932487 l
241.01802 348.310754 l
243.139808 350.310331 l
245.261597 350.804798 l
247.383385 350.201789 l
249.505173 348.60261 l
251.626961 348.918587 l
253.748749 347.999601 l
255.870537 347.307347 l
257.992325 348.532661 l
260.114113 349.367225 l
262.235902 348.561605 l
264.35769 348.291458 l
266.479478 348.404823 l
268.601266 348.322814 l
270.723054 348.238393 l
272.844842 347.423125 l
274.96663 347.755986 l
277.088418 348.520601 l
279.210207 348.231157 l
281.331995 348.426531 l
283.453783 348.084022 l
285.575571 347.649856 l
287.697359 348.412059 l
289.819147 348.761804 l
291.940935 348.166032 l
294.062724 348.110555 l
296.184512 348.257689 l
298.3063 348.29387 l
300.428088 348.752156 l
302.549876 348.747332 l
stroke
grestore
0.800 setlinewidth
0 setlinejoin
[] 0 setdash
0.000 setgray
gsave
81.99 263.304 m
81.99 437.184 l
stroke
grestore
gsave
313.052727 263.304 m
313.052727 437.184 l
stroke
grestore
gsave
81.99 263.304 m
313.052727 263.304 l
stroke
grestore
gsave
81.99 437.184 m
313.052727 437.184 l
stroke
grestore
/DejaVuSans findfont
12.000 scalefont
setfont
gsave
190.154176 443.184000 translate
0.000000 rotate
0.000000 0.000000 m /g glyphshow
7.617188 0.000000 m /x glyphshow
grestore
gsave
359.265273 263.304 m
590.328 263.304 l
590.328 437.184 l
359.265273 437.184 l
cl
1.000 setgray
fill
grestore
1 setlinejoin
0 setlinecap
[] 0 setdash
gsave
/o {
gsave
newpath
translate
0.8 setlinewidth
1 setlinejoin
0 setlinecap
0 0 m
0 -3.5 l

gsave
0.000 setgray
fill
grestore
stroke
grestore
} bind def
367.646 263.304 o
grestore
/DejaVuSans findfont
10.000 scalefont
setfont
gsave
364.466648 248.710250 translate
0.000000 rotate
0.000000 0.000000 m /zero glyphshow
grestore
gsave
/o {
gsave
newpath
translate
0.8 setlinewidth
1 setlinejoin
0 setlinecap
0 0 m
0 -3.5 l

gsave
0.000 setgray
fill
grestore
stroke
grestore
} bind def
410.082 263.304 o
grestore
gsave
403.722723 248.710250 translate
0.000000 rotate
0.000000 0.000000 m /two glyphshow
6.362305 0.000000 m /zero glyphshow
grestore
gsave
/o {
gsave
newpath
translate
0.8 setlinewidth
1 setlinejoin
0 setlinecap
0 0 m
0 -3.5 l

gsave
0.000 setgray
fill
grestore
stroke
grestore
} bind def
452.518 263.304 o
grestore
gsave
446.158486 248.710250 translate
0.000000 rotate
0.000000 0.000000 m /four glyphshow
6.362305 0.000000 m /zero glyphshow
grestore
gsave
/o {
gsave
newpath
translate
0.8 setlinewidth
1 setlinejoin
0 setlinecap
0 0 m
0 -3.5 l

gsave
0.000 setgray
fill
grestore
stroke
grestore
} bind def
494.954 263.304 o
grestore
gsave
488.594249 248.710250 translate
0.000000 rotate
0.000000 0.000000 m /six glyphshow
6.362305 0.000000 m /zero glyphshow
grestore
gsave
/o {
gsave
newpath
translate
0.8 setlinewidth
1 setlinejoin
0 setlinecap
0 0 m
0 -3.5 l

gsave
0.000 setgray
fill
grestore
stroke
grestore
} bind def
537.389 263.304 o
grestore
gsave
531.030011 248.710250 translate
0.000000 rotate
0.000000 0.000000 m /eight glyphshow
6.362305 0.000000 m /zero glyphshow
grestore
gsave
/o {
gsave
newpath
translate
0.8 setlinewidth
1 setlinejoin
0 setlinecap
0 0 m
0 -3.5 l

gsave
0.000 setgray
fill
grestore
stroke
grestore
} bind def
579.825 263.304 o
grestore
gsave
570.286086 248.710250 translate
0.000000 rotate
0.000000 0.000000 m /one glyphshow
6.362305 0.000000 m /zero glyphshow
12.724609 0.000000 m /zero glyphshow
grestore
gsave
/o {
gsave
newpath
translate
0.8 setlinewidth
1 setlinejoin
0 setlinecap
0 0 m
-3.5 0 l

gsave
0.000 setgray
fill
grestore
stroke
grestore
} bind def
359.265 287.8 o
grestore
gsave
324.812148 284.002959 translate
0.000000 rotate
0.000000 0.000000 m /minus glyphshow
8.378906 0.000000 m /two glyphshow
14.741211 0.000000 m /zero glyphshow
21.103516 0.000000 m /zero glyphshow
grestore
gsave
/o {
gsave
newpath
translate
0.8 setlinewidth
1 setlinejoin
0 setlinecap
0 0 m
-3.5 0 l

gsave
0.000 setgray
fill
grestore
stroke
grestore
} bind def
359.265 319.415 o
grestore
gsave
324.812148 315.617986 translate
0.000000 rotate
0.000000 0.000000 m /minus glyphshow
8.378906 0.000000 m /one glyphshow
14.741211 0.000000 m /zero glyphshow
21.103516 0.000000 m /zero glyphshow
grestore
gsave
/o {
gsave
newpath
translate
0.8 setlinewidth
1 setlinejoin
0 setlinecap
0 0 m
-3.5 0 l

gsave
0.000 setgray
fill
grestore
stroke
grestore
} bind def
359.265 351.03 o
grestore
gsave
345.905898 347.233014 translate
0.000000 rotate
0.000000 0.000000 m /zero glyphshow
grestore
gsave
/o {
gsave
newpath
translate
0.8 setlinewidth
1 setlinejoin
0 setlinecap
0 0 m
-3.5 0 l

gsave
0.000 setgray
fill
grestore
stroke
grestore
} bind def
359.265 382.645 o
grestore
gsave
333.187148 378.848042 translate
0.000000 rotate
0.000000 0.000000 m /one glyphshow
6.362305 0.000000 m /zero glyphshow
12.724609 0.000000 m /zero glyphshow
grestore
gsave
/o {
gsave
newpath
translate
0.8 setlinewidth
1 setlinejoin
0 setlinecap
0 0 m
-3.5 0 l

gsave
0.000 setgray
fill
grestore
stroke
grestore
} bind def
359.265 414.26 o
grestore
gsave
333.187148 410.463070 translate
0.000000 rotate
0.000000 0.000000 m /two glyphshow
6.362305 0.000000 m /zero glyphshow
12.724609 0.000000 m /zero glyphshow
grestore
1.500 setlinewidth
2 setlinecap
0.122 0.467 0.706 setrgbcolor
gsave
231.1 173.9 359.3 263.3 clipbox
369.768124 350.906104 m
371.889912 351.09183 l
374.0117 351.181076 l
376.133488 350.725201 l
378.255276 351.22208 l
380.377065 351.014645 l
382.498853 350.768618 l
384.620641 350.840979 l
386.742429 351.410219 l
388.864217 350.674548 l
390.986005 355.450378 l
393.107793 356.335595 l
395.229582 343.052517 l
397.35137 338.578192 l
399.473158 343.776128 l
401.594946 337.475892 l
403.716734 344.598632 l
405.838522 348.093671 l
407.96031 348.219096 l
410.082098 337.360114 l
412.203887 343.549396 l
414.325675 335.937013 l
416.447463 364.770482 l
418.569251 350.339275 l
420.691039 353.904263 l
422.812827 358.108441 l
424.934615 355.940021 l
427.056403 350.696257 l
429.178192 349.048837 l
431.29998 343.764067 l
433.421768 349.306924 l
435.543556 348.279397 l
437.665344 349.222503 l
439.787132 357.891358 l
441.90892 393.186669 l
444.030708 429.280364 l
446.152497 429.280364 l
448.274285 422.927063 l
450.396073 392.523359 l
452.517861 358.803107 l
454.639649 345.614098 l
456.761437 285.701556 l
458.883225 285.342163 l
461.005014 271.207636 l
463.126802 271.207636 l
465.24859 288.796197 l
467.370378 358.856172 l
469.492166 372.788087 l
471.613954 359.461593 l
473.735742 358.009547 l
475.85753 352.842968 l
477.979319 351.258261 l
480.101107 353.542458 l
482.222895 351.147307 l
484.344683 354.970383 l
486.466471 339.721496 l
488.588259 366.733879 l
490.710047 356.359715 l
492.831835 371.912518 l
494.953624 351.907098 l
497.075412 339.668432 l
499.1972 351.415043 l
501.318988 346.853885 l
503.440776 351.347506 l
505.562564 357.594677 l
507.684352 362.992812 l
509.80614 330.637772 l
511.927929 351.622478 l
514.049717 346.414894 l
516.171505 358.257987 l
518.293293 356.641923 l
520.415081 357.141215 l
522.536869 356.914483 l
524.658657 350.715553 l
526.780446 353.178241 l
528.902234 352.013228 l
531.024022 347.758398 l
533.14581 350.988113 l
535.267598 350.500882 l
537.389386 352.852616 l
539.511174 350.479173 l
541.632962 351.501876 l
543.754751 352.432922 l
545.876539 351.784084 l
547.998327 352.587292 l
550.120115 352.59694 l
552.241903 352.042172 l
554.363691 352.177246 l
556.485479 352.338853 l
558.607267 352.534227 l
560.729056 351.128011 l
562.850844 350.278975 l
564.972632 350.857863 l
567.09442 350.708317 l
569.216208 350.177669 l
571.337996 349.801392 l
573.459784 350.744497 l
575.581573 353.13 l
577.703361 352.136242 l
579.825149 351.125599 l
stroke
grestore
0.800 setlinewidth
0 setlinejoin
[] 0 setdash
0.000 setgray
gsave
359.265273 263.304 m
359.265273 437.184 l
stroke
grestore
gsave
590.328 263.304 m
590.328 437.184 l
stroke
grestore
gsave
359.265273 263.304 m
590.328 263.304 l
stroke
grestore
gsave
359.265273 437.184 m
590.328 437.184 l
stroke
grestore
/DejaVuSans findfont
12.000 scalefont
setfont
gsave
467.429449 443.184000 translate
0.000000 rotate
0.000000 0.000000 m /g glyphshow
7.617188 0.000000 m /y glyphshow
grestore
gsave
81.99 54.648 m
313.052727 54.648 l
313.052727 228.528 l
81.99 228.528 l
cl
1.000 setgray
fill
grestore
1 setlinejoin
0 setlinecap
[] 0 setdash
gsave
/o {
gsave
newpath
translate
0.8 setlinewidth
1 setlinejoin
0 setlinecap
0 0 m
0 -3.5 l

gsave
0.000 setgray
fill
grestore
stroke
grestore
} bind def
90.3711 54.648 o
grestore
/DejaVuSans findfont
10.000 scalefont
setfont
gsave
87.191376 40.054250 translate
0.000000 rotate
0.000000 0.000000 m /zero glyphshow
grestore
gsave
/o {
gsave
newpath
translate
0.8 setlinewidth
1 setlinejoin
0 setlinecap
0 0 m
0 -3.5 l

gsave
0.000 setgray
fill
grestore
stroke
grestore
} bind def
132.807 54.648 o
grestore
gsave
126.447451 40.054250 translate
0.000000 rotate
0.000000 0.000000 m /two glyphshow
6.362305 0.000000 m /zero glyphshow
grestore
gsave
/o {
gsave
newpath
translate
0.8 setlinewidth
1 setlinejoin
0 setlinecap
0 0 m
0 -3.5 l

gsave
0.000 setgray
fill
grestore
stroke
grestore
} bind def
175.243 54.648 o
grestore
gsave
168.883213 40.054250 translate
0.000000 rotate
0.000000 0.000000 m /four glyphshow
6.362305 0.000000 m /zero glyphshow
grestore
gsave
/o {
gsave
newpath
translate
0.8 setlinewidth
1 setlinejoin
0 setlinecap
0 0 m
0 -3.5 l

gsave
0.000 setgray
fill
grestore
stroke
grestore
} bind def
217.678 54.648 o
grestore
gsave
211.318976 40.054250 translate
0.000000 rotate
0.000000 0.000000 m /six glyphshow
6.362305 0.000000 m /zero glyphshow
grestore
gsave
/o {
gsave
newpath
translate
0.8 setlinewidth
1 setlinejoin
0 setlinecap
0 0 m
0 -3.5 l

gsave
0.000 setgray
fill
grestore
stroke
grestore
} bind def
260.114 54.648 o
grestore
gsave
253.754738 40.054250 translate
0.000000 rotate
0.000000 0.000000 m /eight glyphshow
6.362305 0.000000 m /zero glyphshow
grestore
gsave
/o {
gsave
newpath
translate
0.8 setlinewidth
1 setlinejoin
0 setlinecap
0 0 m
0 -3.5 l

gsave
0.000 setgray
fill
grestore
stroke
grestore
} bind def
302.55 54.648 o
grestore
gsave
293.010814 40.054250 translate
0.000000 rotate
0.000000 0.000000 m /one glyphshow
6.362305 0.000000 m /zero glyphshow
12.724609 0.000000 m /zero glyphshow
grestore
gsave
/o {
gsave
newpath
translate
0.8 setlinewidth
1 setlinejoin
0 setlinecap
0 0 m
-3.5 0 l

gsave
0.000 setgray
fill
grestore
stroke
grestore
} bind def
81.99 79.0028 o
grestore
gsave
47.536875 75.205927 translate
0.000000 rotate
0.000000 0.000000 m /minus glyphshow
8.378906 0.000000 m /two glyphshow
14.741211 0.000000 m /zero glyphshow
21.103516 0.000000 m /zero glyphshow
grestore
gsave
/o {
gsave
newpath
translate
0.8 setlinewidth
1 setlinejoin
0 setlinecap
0 0 m
-3.5 0 l

gsave
0.000 setgray
fill
grestore
stroke
grestore
} bind def
81.99 110.618 o
grestore
gsave
47.536875 106.820955 translate
0.000000 rotate
0.000000 0.000000 m /minus glyphshow
8.378906 0.000000 m /one glyphshow
14.741211 0.000000 m /zero glyphshow
21.103516 0.000000 m /zero glyphshow
grestore
gsave
/o {
gsave
newpath
translate
0.8 setlinewidth
1 setlinejoin
0 setlinecap
0 0 m
-3.5 0 l

gsave
0.000 setgray
fill
grestore
stroke
grestore
} bind def
81.99 142.233 o
grestore
gsave
68.630625 138.435983 translate
0.000000 rotate
0.000000 0.000000 m /zero glyphshow
grestore
gsave
/o {
gsave
newpath
translate
0.8 setlinewidth
1 setlinejoin
0 setlinecap
0 0 m
-3.5 0 l

gsave
0.000 setgray
fill
grestore
stroke
grestore
} bind def
81.99 173.848 o
grestore
gsave
55.911875 170.051010 translate
0.000000 rotate
0.000000 0.000000 m /one glyphshow
6.362305 0.000000 m /zero glyphshow
12.724609 0.000000 m /zero glyphshow
grestore
gsave
/o {
gsave
newpath
translate
0.8 setlinewidth
1 setlinejoin
0 setlinecap
0 0 m
-3.5 0 l

gsave
0.000 setgray
fill
grestore
stroke
grestore
} bind def
81.99 205.463 o
grestore
gsave
55.911875 201.666038 translate
0.000000 rotate
0.000000 0.000000 m /two glyphshow
6.362305 0.000000 m /zero glyphshow
12.724609 0.000000 m /zero glyphshow
grestore
1.500 setlinewidth
2 setlinecap
0.122 0.467 0.706 setrgbcolor
gsave
231.1 173.9 81.99 54.65 clipbox
92.492851 141.765285 m
94.614639 141.442072 l
96.736427 140.964489 l
98.858216 140.527911 l
100.980004 141.118859 l
103.101792 141.396243 l
105.22358 140.742582 l
107.345368 140.824591 l
109.467156 140.660572 l
111.588944 140.072036 l
113.710733 136.210368 l
115.832521 142.889293 l
117.954309 150.945491 l
120.076097 154.604548 l
122.197885 141.401067 l
124.319673 141.922067 l
126.441461 136.885737 l
128.563249 135.920923 l
130.685038 141.540965 l
132.806826 151.97543 l
134.928614 159.201887 l
137.050402 178.088123 l
139.17219 156.857389 l
141.293978 133.325573 l
143.415766 142.312817 l
145.537554 134.726966 l
147.659343 136.043937 l
149.781131 144.811685 l
151.902919 140.518262 l
154.024707 142.324877 l
156.146495 143.931292 l
158.268283 141.350415 l
160.390071 139.411138 l
162.51186 141.777345 l
164.633648 139.845305 l
166.755436 146.586943 l
168.877224 152.448189 l
170.999012 138.27507 l
173.1208 140.351832 l
175.242588 136.873677 l
177.364376 142.093321 l
179.486165 138.945615 l
181.607953 137.61176 l
183.729741 136.989455 l
185.851529 155.617603 l
187.973317 148.299488 l
190.095105 140.937957 l
192.216893 145.851272 l
194.338681 144.862338 l
196.46047 142.15121 l
198.582258 141.864178 l
200.704046 138.885315 l
202.825834 139.483499 l
204.947622 135.747257 l
207.06941 108.484023 l
209.191198 62.551636 l
211.312986 62.551636 l
213.434775 62.551636 l
215.556563 73.736244 l
217.678351 114.586472 l
219.800139 114.518935 l
221.921927 149.36802 l
224.043715 174.486954 l
226.165503 212.96374 l
228.287292 220.624364 l
230.40908 220.624364 l
232.530868 220.624364 l
234.652656 212.908263 l
236.774444 145.829564 l
238.896232 139.001092 l
241.01802 136.68795 l
243.139808 135.368567 l
245.261597 132.307695 l
247.383385 136.147655 l
249.505173 140.964489 l
251.626961 139.765707 l
253.748749 141.171924 l
255.870537 142.445479 l
257.992325 138.902199 l
260.114113 138.740592 l
262.235902 140.016559 l
264.35769 141.065794 l
266.479478 140.641276 l
268.601266 140.031031 l
270.723054 141.801465 l
272.844842 142.016136 l
274.96663 141.663979 l
277.088418 141.389007 l
279.210207 140.723285 l
281.331995 140.375952 l
283.453783 142.638441 l
285.575571 142.129502 l
287.697359 140.067212 l
289.819147 140.937957 l
291.940935 141.72428 l
294.062724 140.518262 l
296.184512 141.314234 l
298.3063 142.266988 l
300.428088 140.89454 l
302.549876 140.942781 l
stroke
grestore
0.800 setlinewidth
0 setlinejoin
[] 0 setdash
0.000 setgray
gsave
81.99 54.648 m
81.99 228.528 l
stroke
grestore
gsave
313.052727 54.648 m
313.052727 228.528 l
stroke
grestore
gsave
81.99 54.648 m
313.052727 54.648 l
stroke
grestore
gsave
81.99 228.528 m
313.052727 228.528 l
stroke
grestore
/DejaVuSans findfont
12.000 scalefont
setfont
gsave
190.560426 234.528000 translate
0.000000 rotate
0.000000 0.000000 m /g glyphshow
7.617188 0.000000 m /z glyphshow
grestore
gsave
359.265273 54.648 m
590.328 54.648 l
590.328 228.528 l
359.265273 228.528 l
cl
1.000 setgray
fill
grestore
1 setlinejoin
0 setlinecap
[] 0 setdash
gsave
/o {
gsave
newpath
translate
0.8 setlinewidth
1 setlinejoin
0 setlinecap
0 0 m
0 -3.5 l

gsave
0.000 setgray
fill
grestore
stroke
grestore
} bind def
367.646 54.648 o
grestore
/DejaVuSans findfont
10.000 scalefont
setfont
gsave
364.466648 40.054250 translate
0.000000 rotate
0.000000 0.000000 m /zero glyphshow
grestore
gsave
/o {
gsave
newpath
translate
0.8 setlinewidth
1 setlinejoin
0 setlinecap
0 0 m
0 -3.5 l

gsave
0.000 setgray
fill
grestore
stroke
grestore
} bind def
410.082 54.648 o
grestore
gsave
403.722723 40.054250 translate
0.000000 rotate
0.000000 0.000000 m /two glyphshow
6.362305 0.000000 m /zero glyphshow
grestore
gsave
/o {
gsave
newpath
translate
0.8 setlinewidth
1 setlinejoin
0 setlinecap
0 0 m
0 -3.5 l

gsave
0.000 setgray
fill
grestore
stroke
grestore
} bind def
452.518 54.648 o
grestore
gsave
446.158486 40.054250 translate
0.000000 rotate
0.000000 0.000000 m /four glyphshow
6.362305 0.000000 m /zero glyphshow
grestore
gsave
/o {
gsave
newpath
translate
0.8 setlinewidth
1 setlinejoin
0 setlinecap
0 0 m
0 -3.5 l

gsave
0.000 setgray
fill
grestore
stroke
grestore
} bind def
494.954 54.648 o
grestore
gsave
488.594249 40.054250 translate
0.000000 rotate
0.000000 0.000000 m /six glyphshow
6.362305 0.000000 m /zero glyphshow
grestore
gsave
/o {
gsave
newpath
translate
0.8 setlinewidth
1 setlinejoin
0 setlinecap
0 0 m
0 -3.5 l

gsave
0.000 setgray
fill
grestore
stroke
grestore
} bind def
537.389 54.648 o
grestore
gsave
531.030011 40.054250 translate
0.000000 rotate
0.000000 0.000000 m /eight glyphshow
6.362305 0.000000 m /zero glyphshow
grestore
gsave
/o {
gsave
newpath
translate
0.8 setlinewidth
1 setlinejoin
0 setlinecap
0 0 m
0 -3.5 l

gsave
0.000 setgray
fill
grestore
stroke
grestore
} bind def
579.825 54.648 o
grestore
gsave
570.286086 40.054250 translate
0.000000 rotate
0.000000 0.000000 m /one glyphshow
6.362305 0.000000 m /zero glyphshow
12.724609 0.000000 m /zero glyphshow
grestore
gsave
/o {
gsave
newpath
translate
0.8 setlinewidth
1 setlinejoin
0 setlinecap
0 0 m
-3.5 0 l

gsave
0.000 setgray
fill
grestore
stroke
grestore
} bind def
359.265 78.9574 o
grestore
gsave
324.812148 75.160543 translate
0.000000 rotate
0.000000 0.000000 m /minus glyphshow
8.378906 0.000000 m /two glyphshow
14.741211 0.000000 m /zero glyphshow
21.103516 0.000000 m /zero glyphshow
grestore
gsave
/o {
gsave
newpath
translate
0.8 setlinewidth
1 setlinejoin
0 setlinecap
0 0 m
-3.5 0 l

gsave
0.000 setgray
fill
grestore
stroke
grestore
} bind def
359.265 110.217 o
grestore
gsave
324.812148 106.420372 translate
0.000000 rotate
0.000000 0.000000 m /minus glyphshow
8.378906 0.000000 m /one glyphshow
14.741211 0.000000 m /zero glyphshow
21.103516 0.000000 m /zero glyphshow
grestore
gsave
/o {
gsave
newpath
translate
0.8 setlinewidth
1 setlinejoin
0 setlinecap
0 0 m
-3.5 0 l

gsave
0.000 setgray
fill
grestore
stroke
grestore
} bind def
359.265 141.477 o
grestore
gsave
345.905898 137.680202 translate
0.000000 rotate
0.000000 0.000000 m /zero glyphshow
grestore
gsave
/o {
gsave
newpath
translate
0.8 setlinewidth
1 setlinejoin
0 setlinecap
0 0 m
-3.5 0 l

gsave
0.000 setgray
fill
grestore
stroke
grestore
} bind def
359.265 172.737 o
grestore
gsave
333.187148 168.940031 translate
0.000000 rotate
0.000000 0.000000 m /one glyphshow
6.362305 0.000000 m /zero glyphshow
12.724609 0.000000 m /zero glyphshow
grestore
gsave
/o {
gsave
newpath
translate
0.8 setlinewidth
1 setlinejoin
0 setlinecap
0 0 m
-3.5 0 l

gsave
0.000 setgray
fill
grestore
stroke
grestore
} bind def
359.265 203.997 o
grestore
gsave
333.187148 200.199860 translate
0.000000 rotate
0.000000 0.000000 m /two glyphshow
6.362305 0.000000 m /zero glyphshow
12.724609 0.000000 m /zero glyphshow
grestore
1.500 setlinewidth
2 setlinecap
0.122 0.467 0.706 setrgbcolor
gsave
231.1 173.9 359.3 54.65 clipbox
369.768124 140.185252 m
371.889912 140.619311 l
374.0117 140.631235 l
376.133488 140.535838 l
378.255276 140.26157 l
380.377065 140.376047 l
382.498853 141.048599 l
384.620641 142.093201 l
386.742429 144.885961 l
388.864217 158.575492 l
390.986005 198.985842 l
393.107793 220.624364 l
395.229582 220.624364 l
397.35137 220.624364 l
399.473158 214.910058 l
401.594946 184.881332 l
403.716734 152.512985 l
405.838522 127.347144 l
407.96031 98.587204 l
410.082098 64.327603 l
412.203887 64.327603 l
414.325675 64.327603 l
416.447463 64.327603 l
418.569251 102.357787 l
420.691039 138.000651 l
422.812827 150.845915 l
424.934615 145.005207 l
427.056403 139.345755 l
429.178192 139.033328 l
431.29998 139.073872 l
433.421768 140.366507 l
435.543556 140.996131 l
437.665344 138.935546 l
439.787132 138.413245 l
441.90892 141.92387 l
444.030708 151.687797 l
446.152497 142.69659 l
448.274285 148.313113 l
450.396073 133.118688 l
452.517861 138.725672 l
454.639649 137.852785 l
456.761437 140.63362 l
458.883225 145.820855 l
461.005014 154.938465 l
463.126802 140.571612 l
465.24859 133.734001 l
467.370378 138.115128 l
469.492166 140.538223 l
471.613954 139.88475 l
473.735742 139.748809 l
475.85753 140.523913 l
477.979319 141.458808 l
480.101107 140.197177 l
482.222895 138.282074 l
484.344683 134.752369 l
486.466471 122.10744 l
488.588259 105.858873 l
490.710047 122.744218 l
492.831835 128.227185 l
494.953624 141.492197 l
497.075412 137.573748 l
499.1972 148.613615 l
501.318988 155.267586 l
503.440776 168.189167 l
505.562564 169.539041 l
507.684352 160.302185 l
509.80614 145.215082 l
511.927929 140.81249 l
514.049717 138.732827 l
516.171505 138.212911 l
518.293293 140.564457 l
520.415081 142.541569 l
522.536869 143.030481 l
524.658657 142.434247 l
526.780446 140.853034 l
528.902234 141.165461 l
531.024022 140.2568 l
533.14581 139.572324 l
535.267598 140.783871 l
537.389386 141.609059 l
539.511174 140.81249 l
541.632962 140.545378 l
543.754751 140.65747 l
545.876539 140.576382 l
547.998327 140.492909 l
550.120115 139.686801 l
552.241903 140.015922 l
554.363691 140.771947 l
556.485479 140.485754 l
558.607267 140.678934 l
560.729056 140.340273 l
562.850844 139.910985 l
564.972632 140.664624 l
567.09442 141.01044 l
569.216208 140.421361 l
571.337996 140.366507 l
573.459784 140.511989 l
575.581573 140.547763 l
577.703361 141.0009 l
579.825149 140.996131 l
stroke
grestore
1.000 0.498 0.055 setrgbcolor
gsave
231.1 173.9 359.3 54.65 clipbox
369.768124 141.354682 m
371.889912 141.538322 l
374.0117 141.626564 l
376.133488 141.175812 l
378.255276 141.667108 l
380.377065 141.462004 l
382.498853 141.21874 l
384.620641 141.290288 l
386.742429 141.853133 l
388.864217 141.125728 l
390.986005 145.847901 l
393.107793 146.723172 l
395.229582 133.589331 l
397.35137 129.165275 l
399.473158 134.304812 l
401.594946 128.07536 l
403.716734 135.118075 l
405.838522 138.573847 l
407.96031 138.697863 l
410.082098 127.960883 l
412.203887 134.080628 l
414.325675 126.553771 l
416.447463 155.063292 l
418.569251 140.794222 l
420.691039 144.319157 l
422.812827 148.4761 l
424.934615 146.332043 l
427.056403 141.147192 l
429.178192 139.518281 l
431.29998 134.292887 l
433.421768 139.773469 l
435.543556 138.757487 l
437.665344 139.689997 l
439.787132 148.261456 l
441.90892 183.16022 l
444.030708 218.848397 l
446.152497 218.848397 l
448.274285 212.566477 l
450.396073 182.504362 l
452.517861 149.162961 l
454.639649 136.122133 l
456.761437 76.882715 l
458.883225 76.52736 l
461.005014 62.551636 l
463.126802 62.551636 l
465.24859 79.942587 l
467.370378 149.21543 l
469.492166 162.990818 l
471.613954 149.814049 l
473.735742 148.378317 l
475.85753 143.269785 l
477.979319 141.702882 l
480.101107 143.961416 l
482.222895 141.593175 l
484.344683 145.373298 l
486.466471 130.295735 l
488.588259 157.00463 l
490.710047 146.747021 l
492.831835 162.125087 l
494.953624 142.34443 l
497.075412 130.243266 l
499.1972 141.857903 l
501.318988 137.34799 l
503.440776 141.791125 l
505.562564 147.968108 l
507.684352 153.305595 l
509.80614 121.314067 l
511.927929 142.063008 l
514.049717 136.913931 l
516.171505 148.623966 l
518.293293 147.026059 l
520.415081 147.519741 l
522.536869 147.295557 l
524.658657 141.166272 l
526.780446 143.601291 l
528.902234 142.449367 l
531.024022 138.242341 l
533.14581 141.43577 l
535.267598 140.954013 l
537.389386 143.279325 l
539.511174 140.932548 l
541.632962 141.943761 l
543.754751 142.864346 l
545.876539 142.222798 l
547.998327 143.016982 l
550.120115 143.026522 l
552.241903 142.477986 l
554.363691 142.611543 l
556.485479 142.771334 l
558.607267 142.964513 l
560.729056 141.574096 l
562.850844 140.734598 l
564.972632 141.306983 l
567.09442 141.159117 l
569.216208 140.634431 l
571.337996 140.262381 l
573.459784 141.194891 l
575.581573 143.553592 l
577.703361 142.570999 l
579.825149 141.571711 l
stroke
grestore
0.173 0.627 0.173 setrgbcolor
gsave
231.1 173.9 359.3 54.65 clipbox
369.768124 141.014757 m
371.889912 140.695175 l
374.0117 140.222958 l
376.133488 139.791285 l
378.255276 140.375594 l
380.377065 140.649862 l
382.498853 140.003544 l
384.620641 140.084632 l
386.742429 139.922456 l
388.864217 139.340532 l
390.986005 135.52225 l
393.107793 142.126137 l
395.229582 150.091822 l
397.35137 153.70977 l
399.473158 140.654632 l
401.594946 141.169778 l
403.716734 136.190032 l
405.838522 135.236058 l
407.96031 140.792958 l
410.082098 151.11019 l
412.203887 158.255457 l
414.325675 176.929504 l
416.447463 155.9373 l
418.569251 132.669867 l
420.691039 141.556137 l
422.812827 134.055514 l
424.934615 135.357689 l
427.056403 144.026931 l
429.178192 139.781745 l
431.29998 141.568062 l
433.421768 143.156429 l
435.543556 140.604548 l
437.665344 138.68706 l
439.787132 141.026682 l
441.90892 139.116348 l
444.030708 145.782243 l
446.152497 151.577637 l
448.274285 137.563755 l
450.396073 139.617185 l
452.517861 136.178107 l
454.639649 141.339108 l
456.761437 138.226767 l
458.883225 136.907898 l
461.005014 136.292584 l
463.126802 154.711443 l
465.24859 147.475548 l
467.370378 140.196724 l
469.492166 145.054838 l
471.613954 144.077014 l
473.735742 141.396347 l
475.85753 141.112539 l
477.979319 138.167144 l
480.101107 138.758608 l
482.222895 135.064342 l
484.344683 108.107414 l
486.466471 62.691084 l
488.588259 62.691084 l
490.710047 62.691084 l
492.831835 73.75003 l
494.953624 114.141301 l
497.075412 114.074523 l
499.1972 148.532074 l
501.318988 173.368795 l
503.440776 211.413289 l
505.562564 218.987845 l
507.684352 218.987845 l
509.80614 218.987845 l
511.927929 211.358435 l
514.049717 145.033374 l
516.171505 138.281621 l
518.293293 135.994467 l
520.415081 134.689907 l
522.536869 131.663424 l
524.658657 135.460242 l
526.780446 140.222958 l
528.902234 139.037645 l
531.024022 140.428063 l
533.14581 141.687309 l
535.267598 138.183838 l
537.389386 138.024047 l
539.511174 139.285678 l
541.632962 140.323126 l
543.754751 139.903377 l
545.876539 139.299988 l
547.998327 141.050531 l
550.120115 141.26279 l
552.241903 140.91459 l
554.363691 140.642707 l
556.485479 139.984465 l
558.607267 139.641034 l
560.729056 141.878104 l
562.850844 141.374882 l
564.972632 139.335762 l
567.09442 140.196724 l
569.216208 140.974213 l
571.337996 139.781745 l
573.459784 140.568774 l
575.581573 141.510823 l
577.703361 140.153795 l
579.825149 140.201494 l
stroke
grestore
0.800 setlinewidth
0 setlinejoin
[] 0 setdash
0.000 setgray
gsave
359.265273 54.648 m
359.265273 228.528 l
stroke
grestore
gsave
590.328 54.648 m
590.328 228.528 l
stroke
grestore
gsave
359.265273 54.648 m
590.328 54.648 l
stroke
grestore
gsave
359.265273 228.528 m
590.328 228.528 l
stroke
grestore
/DejaVuSans findfont
12.000 scalefont
setfont
gsave
441.921636 234.528000 translate
0.000000 rotate
0.000000 0.000000 m /g glyphshow
7.617188 0.000000 m /x glyphshow
14.718750 0.000000 m /comma glyphshow
18.533203 0.000000 m /space glyphshow
22.347656 0.000000 m /g glyphshow
29.964844 0.000000 m /y glyphshow
37.066406 0.000000 m /space glyphshow
40.880859 0.000000 m /y glyphshow
47.982422 0.000000 m /space glyphshow
51.796875 0.000000 m /g glyphshow
59.414062 0.000000 m /z glyphshow
grestore
gsave
236.233437 477.739000 translate
0.000000 rotate
0.000000 0.000000 m /G glyphshow
9.298828 0.000000 m /i glyphshow
12.632812 0.000000 m /r glyphshow
17.566406 0.000000 m /o glyphshow
24.908203 0.000000 m /s glyphshow
31.160156 0.000000 m /c glyphshow
37.757812 0.000000 m /o glyphshow
45.099609 0.000000 m /p glyphshow
52.716797 0.000000 m /i glyphshow
56.050781 0.000000 m /o glyphshow
63.392578 0.000000 m /space glyphshow
67.207031 0.000000 m /c glyphshow
73.804688 0.000000 m /a glyphshow
81.158203 0.000000 m /l glyphshow
84.492188 0.000000 m /i glyphshow
87.826172 0.000000 m /b glyphshow
95.443359 0.000000 m /r glyphshow
100.376953 0.000000 m /a glyphshow
107.730469 0.000000 m /d glyphshow
115.347656 0.000000 m /o glyphshow
122.689453 0.000000 m /space glyphshow
126.503906 0.000000 m /M glyphshow
136.857422 0.000000 m /P glyphshow
144.093750 0.000000 m /U glyphshow
152.876953 0.000000 m /six glyphshow
160.511719 0.000000 m /zero glyphshow
168.146484 0.000000 m /five glyphshow
175.781250 0.000000 m /zero glyphshow
grestore

end
showpage
