%!PS-Adobe-3.0 EPSF-3.0
%%Title: /home/pi/Desktop/ACELE_NO.eps
%%Creator: matplotlib version 3.0.2, http://matplotlib.org/
%%CreationDate: Sun Apr 11 20:02:48 2021
%%Orientation: portrait
%%BoundingBox: 7 161 604 630
%%EndComments
%%BeginProlog
/mpldict 8 dict def
mpldict begin
/m { moveto } bind def
/l { lineto } bind def
/r { rlineto } bind def
/c { curveto } bind def
/cl { closepath } bind def
/box {
m
1 index 0 r
0 exch r
neg 0 r
cl
} bind def
/clipbox {
box
clip
newpath
} bind def
%!PS-Adobe-3.0 Resource-Font
%%Title: DejaVu Sans
%%Copyright: Copyright (c) 2003 by Bitstream, Inc. All Rights Reserved. Copyright (c) 2006 by Tavmjong Bah. All Rights Reserved. DejaVu changes are in public domain 
%%Creator: Converted from TrueType to type 3 by PPR
25 dict begin
/_d{bind def}bind def
/_m{moveto}_d
/_l{lineto}_d
/_cl{closepath eofill}_d
/_c{curveto}_d
/_sc{7 -1 roll{setcachedevice}{pop pop pop pop pop pop}ifelse}_d
/_e{exec}_d
/FontName /DejaVuSans def
/PaintType 0 def
/FontMatrix[.001 0 0 .001 0 0]def
/FontBBox[-1021 -463 1793 1232]def
/FontType 3 def
/Encoding [ /space /comma /zero /one /two /three /four /five /six /seven /eight /nine /A /M /P /U /a /b /c /d /e /i /l /m /n /o /r /t /x /y /z /minus ] def
/FontInfo 10 dict dup begin
/FamilyName (DejaVu Sans) def
/FullName (DejaVu Sans) def
/Notice (Copyright (c) 2003 by Bitstream, Inc. All Rights Reserved. Copyright (c) 2006 by Tavmjong Bah. All Rights Reserved. DejaVu changes are in public domain ) def
/Weight (Book) def
/Version (Version 2.35) def
/ItalicAngle 0.0 def
/isFixedPitch false def
/UnderlinePosition -130 def
/UnderlineThickness 90 def
end readonly def
/CharStrings 33 dict dup begin
/.notdef 0 def
/space{318 0 0 0 0 0 _sc
}_d
/comma{318 0 77 -115 220 124 _sc
117 124 _m
220 124 _l
220 40 _l
140 -115 _l
77 -115 _l
117 40 _l
117 124 _l
_cl}_d
/zero{636 0 66 -13 570 742 _sc
318 664 _m
267 664 229 639 203 589 _c
177 539 165 464 165 364 _c
165 264 177 189 203 139 _c
229 89 267 64 318 64 _c
369 64 407 89 433 139 _c
458 189 471 264 471 364 _c
471 464 458 539 433 589 _c
407 639 369 664 318 664 _c
318 742 _m
399 742 461 709 505 645 _c
548 580 570 486 570 364 _c
570 241 548 147 505 83 _c
461 19 399 -13 318 -13 _c
236 -13 173 19 130 83 _c
87 147 66 241 66 364 _c
66 486 87 580 130 645 _c
173 709 236 742 318 742 _c
_cl}_d
/one{636 0 110 0 544 729 _sc
124 83 _m
285 83 _l
285 639 _l
110 604 _l
110 694 _l
284 729 _l
383 729 _l
383 83 _l
544 83 _l
544 0 _l
124 0 _l
124 83 _l
_cl}_d
/two{{636 0 73 0 536 742 _sc
192 83 _m
536 83 _l
536 0 _l
73 0 _l
73 83 _l
110 121 161 173 226 239 _c
290 304 331 346 348 365 _c
380 400 402 430 414 455 _c
426 479 433 504 433 528 _c
433 566 419 598 392 622 _c
365 646 330 659 286 659 _c
255 659 222 653 188 643 _c
154 632 117 616 78 594 _c
78 694 _l
118 710 155 722 189 730 _c
223 738 255 742 284 742 _c
}_e{359 742 419 723 464 685 _c
509 647 532 597 532 534 _c
532 504 526 475 515 449 _c
504 422 484 390 454 354 _c
446 344 420 317 376 272 _c
332 227 271 164 192 83 _c
_cl}_e}_d
/three{{636 0 76 -13 556 742 _sc
406 393 _m
453 383 490 362 516 330 _c
542 298 556 258 556 212 _c
556 140 531 84 482 45 _c
432 6 362 -13 271 -13 _c
240 -13 208 -10 176 -4 _c
144 1 110 10 76 22 _c
76 117 _l
103 101 133 89 166 81 _c
198 73 232 69 268 69 _c
330 69 377 81 409 105 _c
441 129 458 165 458 212 _c
458 254 443 288 413 312 _c
383 336 341 349 287 349 _c
}_e{202 349 _l
202 430 _l
291 430 _l
339 430 376 439 402 459 _c
428 478 441 506 441 543 _c
441 580 427 609 401 629 _c
374 649 336 659 287 659 _c
260 659 231 656 200 650 _c
169 644 135 635 98 623 _c
98 711 _l
135 721 170 729 203 734 _c
235 739 266 742 296 742 _c
370 742 429 725 473 691 _c
517 657 539 611 539 553 _c
539 513 527 479 504 451 _c
481 423 448 403 406 393 _c
_cl}_e}_d
/four{636 0 49 0 580 729 _sc
378 643 _m
129 254 _l
378 254 _l
378 643 _l
352 729 _m
476 729 _l
476 254 _l
580 254 _l
580 172 _l
476 172 _l
476 0 _l
378 0 _l
378 172 _l
49 172 _l
49 267 _l
352 729 _l
_cl}_d
/five{{636 0 77 -13 549 729 _sc
108 729 _m
495 729 _l
495 646 _l
198 646 _l
198 467 _l
212 472 227 476 241 478 _c
255 480 270 482 284 482 _c
365 482 429 459 477 415 _c
525 370 549 310 549 234 _c
549 155 524 94 475 51 _c
426 8 357 -13 269 -13 _c
238 -13 207 -10 175 -6 _c
143 -1 111 6 77 17 _c
77 116 _l
106 100 136 88 168 80 _c
199 72 232 69 267 69 _c
}_e{323 69 368 83 401 113 _c
433 143 450 183 450 234 _c
450 284 433 324 401 354 _c
368 384 323 399 267 399 _c
241 399 214 396 188 390 _c
162 384 135 375 108 363 _c
108 729 _l
_cl}_e}_d
/six{{636 0 70 -13 573 742 _sc
330 404 _m
286 404 251 388 225 358 _c
199 328 186 286 186 234 _c
186 181 199 139 225 109 _c
251 79 286 64 330 64 _c
374 64 409 79 435 109 _c
461 139 474 181 474 234 _c
474 286 461 328 435 358 _c
409 388 374 404 330 404 _c
526 713 _m
526 623 _l
501 635 476 644 451 650 _c
425 656 400 659 376 659 _c
310 659 260 637 226 593 _c
}_e{192 549 172 482 168 394 _c
187 422 211 444 240 459 _c
269 474 301 482 336 482 _c
409 482 467 459 509 415 _c
551 371 573 310 573 234 _c
573 159 550 99 506 54 _c
462 9 403 -13 330 -13 _c
246 -13 181 19 137 83 _c
92 147 70 241 70 364 _c
70 479 97 571 152 639 _c
206 707 280 742 372 742 _c
396 742 421 739 447 735 _c
472 730 498 723 526 713 _c
_cl}_e}_d
/seven{636 0 82 0 551 729 _sc
82 729 _m
551 729 _l
551 687 _l
286 0 _l
183 0 _l
432 646 _l
82 646 _l
82 729 _l
_cl}_d
/eight{{636 0 68 -13 568 742 _sc
318 346 _m
271 346 234 333 207 308 _c
180 283 167 249 167 205 _c
167 161 180 126 207 101 _c
234 76 271 64 318 64 _c
364 64 401 76 428 102 _c
455 127 469 161 469 205 _c
469 249 455 283 429 308 _c
402 333 365 346 318 346 _c
219 388 _m
177 398 144 418 120 447 _c
96 476 85 511 85 553 _c
85 611 105 657 147 691 _c
188 725 245 742 318 742 _c
}_e{390 742 447 725 489 691 _c
530 657 551 611 551 553 _c
551 511 539 476 515 447 _c
491 418 459 398 417 388 _c
464 377 501 355 528 323 _c
554 291 568 251 568 205 _c
568 134 546 80 503 43 _c
459 5 398 -13 318 -13 _c
237 -13 175 5 132 43 _c
89 80 68 134 68 205 _c
68 251 81 291 108 323 _c
134 355 171 377 219 388 _c
183 544 _m
183 506 194 476 218 455 _c
}_e{242 434 275 424 318 424 _c
360 424 393 434 417 455 _c
441 476 453 506 453 544 _c
453 582 441 611 417 632 _c
393 653 360 664 318 664 _c
275 664 242 653 218 632 _c
194 611 183 582 183 544 _c
_cl}_e}_d
/nine{{636 0 63 -13 566 742 _sc
110 15 _m
110 105 _l
134 93 159 84 185 78 _c
210 72 235 69 260 69 _c
324 69 374 90 408 134 _c
442 178 462 244 468 334 _c
448 306 424 284 396 269 _c
367 254 335 247 300 247 _c
226 247 168 269 126 313 _c
84 357 63 417 63 494 _c
63 568 85 628 129 674 _c
173 719 232 742 306 742 _c
390 742 455 709 499 645 _c
543 580 566 486 566 364 _c
}_e{566 248 538 157 484 89 _c
429 21 356 -13 264 -13 _c
239 -13 214 -10 189 -6 _c
163 -2 137 5 110 15 _c
306 324 _m
350 324 385 339 411 369 _c
437 399 450 441 450 494 _c
450 546 437 588 411 618 _c
385 648 350 664 306 664 _c
262 664 227 648 201 618 _c
175 588 162 546 162 494 _c
162 441 175 399 201 369 _c
227 339 262 324 306 324 _c
_cl}_e}_d
/A{684 0 8 0 676 729 _sc
342 632 _m
208 269 _l
476 269 _l
342 632 _l
286 729 _m
398 729 _l
676 0 _l
573 0 _l
507 187 _l
178 187 _l
112 0 _l
8 0 _l
286 729 _l
_cl}_d
/M{863 0 98 0 765 729 _sc
98 729 _m
245 729 _l
431 233 _l
618 729 _l
765 729 _l
765 0 _l
669 0 _l
669 640 _l
481 140 _l
382 140 _l
194 640 _l
194 0 _l
98 0 _l
98 729 _l
_cl}_d
/P{603 0 98 0 569 729 _sc
197 648 _m
197 374 _l
321 374 _l
367 374 402 385 427 409 _c
452 433 465 467 465 511 _c
465 555 452 588 427 612 _c
402 636 367 648 321 648 _c
197 648 _l
98 729 _m
321 729 _l
402 729 464 710 506 673 _c
548 636 569 582 569 511 _c
569 439 548 384 506 348 _c
464 311 402 293 321 293 _c
197 293 _l
197 0 _l
98 0 _l
98 729 _l
_cl}_d
/U{732 0 87 -13 645 729 _sc
87 729 _m
186 729 _l
186 286 _l
186 208 200 151 228 117 _c
256 83 302 66 366 66 _c
429 66 475 83 503 117 _c
531 151 546 208 546 286 _c
546 729 _l
645 729 _l
645 274 _l
645 178 621 107 574 59 _c
527 11 458 -13 366 -13 _c
274 -13 204 11 157 59 _c
110 107 87 178 87 274 _c
87 729 _l
_cl}_d
/a{{613 0 60 -13 522 560 _sc
343 275 _m
270 275 220 266 192 250 _c
164 233 150 205 150 165 _c
150 133 160 107 181 89 _c
202 70 231 61 267 61 _c
317 61 357 78 387 114 _c
417 149 432 196 432 255 _c
432 275 _l
343 275 _l
522 312 _m
522 0 _l
432 0 _l
432 83 _l
411 49 385 25 355 10 _c
325 -5 287 -13 243 -13 _c
187 -13 142 2 109 33 _c
76 64 60 106 60 159 _c
}_e{60 220 80 266 122 298 _c
163 329 224 345 306 345 _c
432 345 _l
432 354 _l
432 395 418 427 391 450 _c
364 472 326 484 277 484 _c
245 484 215 480 185 472 _c
155 464 127 453 100 439 _c
100 522 _l
132 534 164 544 195 550 _c
226 556 256 560 286 560 _c
365 560 424 539 463 498 _c
502 457 522 395 522 312 _c
_cl}_e}_d
/b{{635 0 91 -13 580 760 _sc
487 273 _m
487 339 473 390 446 428 _c
418 466 381 485 334 485 _c
286 485 249 466 222 428 _c
194 390 181 339 181 273 _c
181 207 194 155 222 117 _c
249 79 286 61 334 61 _c
381 61 418 79 446 117 _c
473 155 487 207 487 273 _c
181 464 _m
199 496 223 520 252 536 _c
281 552 316 560 356 560 _c
422 560 476 533 518 481 _c
559 428 580 359 580 273 _c
}_e{580 187 559 117 518 65 _c
476 13 422 -13 356 -13 _c
316 -13 281 -5 252 10 _c
223 25 199 49 181 82 _c
181 0 _l
91 0 _l
91 760 _l
181 760 _l
181 464 _l
_cl}_e}_d
/c{{550 0 55 -13 488 560 _sc
488 526 _m
488 442 _l
462 456 437 466 411 473 _c
385 480 360 484 334 484 _c
276 484 230 465 198 428 _c
166 391 150 339 150 273 _c
150 206 166 154 198 117 _c
230 80 276 62 334 62 _c
360 62 385 65 411 72 _c
437 79 462 90 488 104 _c
488 21 _l
462 9 436 0 410 -5 _c
383 -10 354 -13 324 -13 _c
242 -13 176 12 128 64 _c
}_e{79 115 55 185 55 273 _c
55 362 79 432 128 483 _c
177 534 244 560 330 560 _c
358 560 385 557 411 551 _c
437 545 463 537 488 526 _c
_cl}_e}_d
/d{{635 0 55 -13 544 760 _sc
454 464 _m
454 760 _l
544 760 _l
544 0 _l
454 0 _l
454 82 _l
435 49 411 25 382 10 _c
353 -5 319 -13 279 -13 _c
213 -13 159 13 117 65 _c
75 117 55 187 55 273 _c
55 359 75 428 117 481 _c
159 533 213 560 279 560 _c
319 560 353 552 382 536 _c
411 520 435 496 454 464 _c
148 273 _m
148 207 161 155 188 117 _c
215 79 253 61 301 61 _c
}_e{348 61 385 79 413 117 _c
440 155 454 207 454 273 _c
454 339 440 390 413 428 _c
385 466 348 485 301 485 _c
253 485 215 466 188 428 _c
161 390 148 339 148 273 _c
_cl}_e}_d
/e{{615 0 55 -13 562 560 _sc
562 296 _m
562 252 _l
149 252 _l
153 190 171 142 205 110 _c
238 78 284 62 344 62 _c
378 62 412 66 444 74 _c
476 82 509 95 541 113 _c
541 28 _l
509 14 476 3 442 -3 _c
408 -9 373 -13 339 -13 _c
251 -13 182 12 131 62 _c
80 112 55 181 55 268 _c
55 357 79 428 127 481 _c
175 533 241 560 323 560 _c
397 560 455 536 498 489 _c
}_e{540 441 562 377 562 296 _c
472 322 _m
471 371 457 410 431 440 _c
404 469 368 484 324 484 _c
274 484 234 469 204 441 _c
174 413 156 373 152 322 _c
472 322 _l
_cl}_e}_d
/i{278 0 94 0 184 760 _sc
94 547 _m
184 547 _l
184 0 _l
94 0 _l
94 547 _l
94 760 _m
184 760 _l
184 646 _l
94 646 _l
94 760 _l
_cl}_d
/l{278 0 94 0 184 760 _sc
94 760 _m
184 760 _l
184 0 _l
94 0 _l
94 760 _l
_cl}_d
/m{{974 0 91 0 889 560 _sc
520 442 _m
542 482 569 511 600 531 _c
631 550 668 560 711 560 _c
767 560 811 540 842 500 _c
873 460 889 403 889 330 _c
889 0 _l
799 0 _l
799 327 _l
799 379 789 418 771 444 _c
752 469 724 482 686 482 _c
639 482 602 466 575 435 _c
548 404 535 362 535 309 _c
535 0 _l
445 0 _l
445 327 _l
445 379 435 418 417 444 _c
398 469 369 482 331 482 _c
}_e{285 482 248 466 221 435 _c
194 404 181 362 181 309 _c
181 0 _l
91 0 _l
91 547 _l
181 547 _l
181 462 _l
201 495 226 520 255 536 _c
283 552 317 560 357 560 _c
397 560 430 550 458 530 _c
486 510 506 480 520 442 _c
_cl}_e}_d
/n{634 0 91 0 549 560 _sc
549 330 _m
549 0 _l
459 0 _l
459 327 _l
459 379 448 417 428 443 _c
408 469 378 482 338 482 _c
289 482 251 466 223 435 _c
195 404 181 362 181 309 _c
181 0 _l
91 0 _l
91 547 _l
181 547 _l
181 462 _l
202 494 227 519 257 535 _c
286 551 320 560 358 560 _c
420 560 468 540 500 501 _c
532 462 549 405 549 330 _c
_cl}_d
/o{612 0 55 -13 557 560 _sc
306 484 _m
258 484 220 465 192 427 _c
164 389 150 338 150 273 _c
150 207 163 156 191 118 _c
219 80 257 62 306 62 _c
354 62 392 80 420 118 _c
448 156 462 207 462 273 _c
462 337 448 389 420 427 _c
392 465 354 484 306 484 _c
306 560 _m
384 560 445 534 490 484 _c
534 433 557 363 557 273 _c
557 183 534 113 490 63 _c
445 12 384 -13 306 -13 _c
227 -13 165 12 121 63 _c
77 113 55 183 55 273 _c
55 363 77 433 121 484 _c
165 534 227 560 306 560 _c
_cl}_d
/r{411 0 91 0 411 560 _sc
411 463 _m
401 469 390 473 378 476 _c
366 478 353 480 339 480 _c
288 480 249 463 222 430 _c
194 397 181 350 181 288 _c
181 0 _l
91 0 _l
91 547 _l
181 547 _l
181 462 _l
199 495 224 520 254 536 _c
284 552 321 560 365 560 _c
371 560 378 559 386 559 _c
393 558 401 557 411 555 _c
411 463 _l
_cl}_d
/t{392 0 27 0 368 702 _sc
183 702 _m
183 547 _l
368 547 _l
368 477 _l
183 477 _l
183 180 _l
183 135 189 106 201 94 _c
213 81 238 75 276 75 _c
368 75 _l
368 0 _l
276 0 _l
206 0 158 13 132 39 _c
106 65 93 112 93 180 _c
93 477 _l
27 477 _l
27 547 _l
93 547 _l
93 702 _l
183 702 _l
_cl}_d
/x{592 0 29 0 559 547 _sc
549 547 _m
351 281 _l
559 0 _l
453 0 _l
294 215 _l
135 0 _l
29 0 _l
241 286 _l
47 547 _l
153 547 _l
298 352 _l
443 547 _l
549 547 _l
_cl}_d
/y{592 0 30 -207 562 547 _sc
322 -50 _m
296 -114 271 -157 247 -177 _c
223 -197 191 -207 151 -207 _c
79 -207 _l
79 -132 _l
132 -132 _l
156 -132 175 -126 189 -114 _c
203 -102 218 -75 235 -31 _c
251 9 _l
30 547 _l
125 547 _l
296 119 _l
467 547 _l
562 547 _l
322 -50 _l
_cl}_d
/z{525 0 43 0 482 547 _sc
55 547 _m
482 547 _l
482 465 _l
144 72 _l
482 72 _l
482 0 _l
43 0 _l
43 82 _l
381 475 _l
55 475 _l
55 547 _l
_cl}_d
/minus{838 0 106 272 732 355 _sc
106 355 _m
732 355 _l
732 272 _l
106 272 _l
106 355 _l
_cl}_d
end readonly def

/BuildGlyph
 {exch begin
 CharStrings exch
 2 copy known not{pop /.notdef}if
 true 3 1 roll get exec
 end}_d

/BuildChar {
 1 index /Encoding get exch get
 1 index /BuildGlyph get exec
}_d

FontName currentdict end definefont pop
end
%%EndProlog
mpldict begin
7.56 161.64 translate
596.88 468.72 0 0 clipbox
gsave
0 0 m
596.88 0 l
596.88 468.72 l
0 468.72 l
cl
1.000 setgray
fill
grestore
gsave
74.61 248.4216 m
284.874545 248.4216 l
284.874545 412.4736 l
74.61 412.4736 l
cl
1.000 setgray
fill
grestore
0.800 setlinewidth
1 setlinejoin
0 setlinecap
[] 0 setdash
0.000 setgray
gsave
/o {
gsave
newpath
translate
0.8 setlinewidth
1 setlinejoin
0 setlinecap
0 0 m
0 -3.5 l

gsave
0.000 setgray
fill
grestore
stroke
grestore
} bind def
82.2367 248.422 o
grestore
/DejaVuSans findfont
10.000 scalefont
setfont
gsave
79.056988 233.827850 translate
0.000000 rotate
0.000000 0.000000 m /zero glyphshow
grestore
gsave
/o {
gsave
newpath
translate
0.8 setlinewidth
1 setlinejoin
0 setlinecap
0 0 m
0 -3.5 l

gsave
0.000 setgray
fill
grestore
stroke
grestore
} bind def
120.853 248.422 o
grestore
gsave
114.493379 233.827850 translate
0.000000 rotate
0.000000 0.000000 m /two glyphshow
6.362305 0.000000 m /zero glyphshow
grestore
gsave
/o {
gsave
newpath
translate
0.8 setlinewidth
1 setlinejoin
0 setlinecap
0 0 m
0 -3.5 l

gsave
0.000 setgray
fill
grestore
stroke
grestore
} bind def
159.469 248.422 o
grestore
gsave
153.109457 233.827850 translate
0.000000 rotate
0.000000 0.000000 m /four glyphshow
6.362305 0.000000 m /zero glyphshow
grestore
gsave
/o {
gsave
newpath
translate
0.8 setlinewidth
1 setlinejoin
0 setlinecap
0 0 m
0 -3.5 l

gsave
0.000 setgray
fill
grestore
stroke
grestore
} bind def
198.085 248.422 o
grestore
gsave
191.725535 233.827850 translate
0.000000 rotate
0.000000 0.000000 m /six glyphshow
6.362305 0.000000 m /zero glyphshow
grestore
gsave
/o {
gsave
newpath
translate
0.8 setlinewidth
1 setlinejoin
0 setlinecap
0 0 m
0 -3.5 l

gsave
0.000 setgray
fill
grestore
stroke
grestore
} bind def
236.701 248.422 o
grestore
gsave
230.341613 233.827850 translate
0.000000 rotate
0.000000 0.000000 m /eight glyphshow
6.362305 0.000000 m /zero glyphshow
grestore
gsave
/o {
gsave
newpath
translate
0.8 setlinewidth
1 setlinejoin
0 setlinecap
0 0 m
0 -3.5 l

gsave
0.000 setgray
fill
grestore
stroke
grestore
} bind def
275.317 248.422 o
grestore
gsave
265.778004 233.827850 translate
0.000000 rotate
0.000000 0.000000 m /one glyphshow
6.362305 0.000000 m /zero glyphshow
12.724609 0.000000 m /zero glyphshow
grestore
gsave
/o {
gsave
newpath
translate
0.8 setlinewidth
1 setlinejoin
0 setlinecap
0 0 m
-3.5 0 l

gsave
0.000 setgray
fill
grestore
stroke
grestore
} bind def
74.61 268.307 o
grestore
gsave
42.172500 264.509816 translate
0.000000 rotate
0.000000 0.000000 m /three glyphshow
6.362305 0.000000 m /six glyphshow
12.724609 0.000000 m /five glyphshow
19.086914 0.000000 m /zero glyphshow
grestore
gsave
/o {
gsave
newpath
translate
0.8 setlinewidth
1 setlinejoin
0 setlinecap
0 0 m
-3.5 0 l

gsave
0.000 setgray
fill
grestore
stroke
grestore
} bind def
74.61 289.02 o
grestore
gsave
42.172500 285.223452 translate
0.000000 rotate
0.000000 0.000000 m /three glyphshow
6.362305 0.000000 m /seven glyphshow
12.724609 0.000000 m /zero glyphshow
19.086914 0.000000 m /zero glyphshow
grestore
gsave
/o {
gsave
newpath
translate
0.8 setlinewidth
1 setlinejoin
0 setlinecap
0 0 m
-3.5 0 l

gsave
0.000 setgray
fill
grestore
stroke
grestore
} bind def
74.61 309.734 o
grestore
gsave
42.172500 305.937089 translate
0.000000 rotate
0.000000 0.000000 m /three glyphshow
6.362305 0.000000 m /seven glyphshow
12.724609 0.000000 m /five glyphshow
19.086914 0.000000 m /zero glyphshow
grestore
gsave
/o {
gsave
newpath
translate
0.8 setlinewidth
1 setlinejoin
0 setlinecap
0 0 m
-3.5 0 l

gsave
0.000 setgray
fill
grestore
stroke
grestore
} bind def
74.61 330.448 o
grestore
gsave
42.172500 326.650725 translate
0.000000 rotate
0.000000 0.000000 m /three glyphshow
6.362305 0.000000 m /eight glyphshow
12.724609 0.000000 m /zero glyphshow
19.086914 0.000000 m /zero glyphshow
grestore
gsave
/o {
gsave
newpath
translate
0.8 setlinewidth
1 setlinejoin
0 setlinecap
0 0 m
-3.5 0 l

gsave
0.000 setgray
fill
grestore
stroke
grestore
} bind def
74.61 351.161 o
grestore
gsave
42.172500 347.364361 translate
0.000000 rotate
0.000000 0.000000 m /three glyphshow
6.362305 0.000000 m /eight glyphshow
12.724609 0.000000 m /five glyphshow
19.086914 0.000000 m /zero glyphshow
grestore
gsave
/o {
gsave
newpath
translate
0.8 setlinewidth
1 setlinejoin
0 setlinecap
0 0 m
-3.5 0 l

gsave
0.000 setgray
fill
grestore
stroke
grestore
} bind def
74.61 371.875 o
grestore
gsave
42.172500 368.077998 translate
0.000000 rotate
0.000000 0.000000 m /three glyphshow
6.362305 0.000000 m /nine glyphshow
12.724609 0.000000 m /zero glyphshow
19.086914 0.000000 m /zero glyphshow
grestore
gsave
/o {
gsave
newpath
translate
0.8 setlinewidth
1 setlinejoin
0 setlinecap
0 0 m
-3.5 0 l

gsave
0.000 setgray
fill
grestore
stroke
grestore
} bind def
74.61 392.589 o
grestore
gsave
42.172500 388.791634 translate
0.000000 rotate
0.000000 0.000000 m /three glyphshow
6.362305 0.000000 m /nine glyphshow
12.724609 0.000000 m /five glyphshow
19.086914 0.000000 m /zero glyphshow
grestore
1.500 setlinewidth
2 setlinecap
0.122 0.467 0.706 setrgbcolor
gsave
210.3 164.1 74.61 248.4 clipbox
84.167479 371.874873 m
86.098283 327.133418 l
88.029087 317.190873 l
89.959891 298.962873 l
91.890695 297.305782 l
93.821499 350.332691 l
95.752303 371.874873 l
97.683107 368.560691 l
99.613911 338.733055 l
101.544715 315.533782 l
103.475518 337.075964 l
105.406322 313.876691 l
107.337126 333.761782 l
109.26793 308.905418 l
111.198734 325.476327 l
113.129538 358.618145 l
115.060342 375.189055 l
116.991146 338.733055 l
118.92195 398.388327 l
120.852754 370.217782 l
122.783557 351.989782 l
124.714361 328.790509 l
126.645165 360.275236 l
128.575969 356.961055 l
130.506773 345.361418 l
132.437577 343.704327 l
134.368381 318.847964 l
136.299185 277.420691 l
138.229989 345.361418 l
140.160793 322.162145 l
142.091597 264.163964 l
144.0224 264.163964 l
145.953204 323.819236 l
147.884008 318.847964 l
149.814812 340.390145 l
151.745616 342.047236 l
153.67642 303.934145 l
155.607224 353.646873 l
157.538028 351.989782 l
159.468832 373.531964 l
161.399636 405.016691 l
163.33044 315.533782 l
165.261243 361.932327 l
167.192047 378.503236 l
169.122851 368.560691 l
171.053655 337.075964 l
172.984459 332.104691 l
174.915263 345.361418 l
176.846067 328.790509 l
178.776871 315.533782 l
180.707675 320.505055 l
182.638479 297.305782 l
184.569282 312.2196 l
186.500086 330.4476 l
188.43089 340.390145 l
190.361694 277.420691 l
192.292498 363.589418 l
194.223302 356.961055 l
196.154106 345.361418 l
198.08491 353.646873 l
200.015714 378.503236 l
201.946518 327.133418 l
203.877322 345.361418 l
205.808125 375.189055 l
207.738929 363.589418 l
209.669733 277.420691 l
211.600537 307.248327 l
213.531341 327.133418 l
215.462145 290.677418 l
217.392949 302.277055 l
219.323753 325.476327 l
221.254557 267.478145 l
223.185361 313.876691 l
225.116165 323.819236 l
227.046968 348.6756 l
228.977772 315.533782 l
230.908576 358.618145 l
232.83938 355.303964 l
234.770184 371.874873 l
236.700988 337.075964 l
238.631792 368.560691 l
240.562596 366.9036 l
242.4934 365.246509 l
244.424204 313.876691 l
246.355008 325.476327 l
248.285811 343.704327 l
250.216615 333.761782 l
252.147419 298.962873 l
254.078223 255.878509 l
256.009027 308.905418 l
257.939831 345.361418 l
259.870635 284.049055 l
261.801439 303.934145 l
263.732243 318.847964 l
265.663047 335.418873 l
267.59385 345.361418 l
269.524654 393.417055 l
271.455458 330.4476 l
273.386262 370.217782 l
275.317066 325.476327 l
stroke
grestore
0.800 setlinewidth
0 setlinejoin
[] 0 setdash
0.000 setgray
gsave
74.61 248.4216 m
74.61 412.4736 l
stroke
grestore
gsave
284.874545 248.4216 m
284.874545 412.4736 l
stroke
grestore
gsave
74.61 248.4216 m
284.874545 248.4216 l
stroke
grestore
gsave
74.61 412.4736 m
284.874545 412.4736 l
stroke
grestore
/DejaVuSans findfont
12.000 scalefont
setfont
gsave
172.507898 418.473600 translate
0.000000 rotate
0.000000 0.000000 m /a glyphshow
7.353516 0.000000 m /x glyphshow
grestore
gsave
326.927455 248.4216 m
537.192 248.4216 l
537.192 412.4736 l
326.927455 412.4736 l
cl
1.000 setgray
fill
grestore
1 setlinejoin
0 setlinecap
[] 0 setdash
gsave
/o {
gsave
newpath
translate
0.8 setlinewidth
1 setlinejoin
0 setlinecap
0 0 m
0 -3.5 l

gsave
0.000 setgray
fill
grestore
stroke
grestore
} bind def
334.554 248.422 o
grestore
/DejaVuSans findfont
10.000 scalefont
setfont
gsave
331.374442 233.827850 translate
0.000000 rotate
0.000000 0.000000 m /zero glyphshow
grestore
gsave
/o {
gsave
newpath
translate
0.8 setlinewidth
1 setlinejoin
0 setlinecap
0 0 m
0 -3.5 l

gsave
0.000 setgray
fill
grestore
stroke
grestore
} bind def
373.17 248.422 o
grestore
gsave
366.810833 233.827850 translate
0.000000 rotate
0.000000 0.000000 m /two glyphshow
6.362305 0.000000 m /zero glyphshow
grestore
gsave
/o {
gsave
newpath
translate
0.8 setlinewidth
1 setlinejoin
0 setlinecap
0 0 m
0 -3.5 l

gsave
0.000 setgray
fill
grestore
stroke
grestore
} bind def
411.786 248.422 o
grestore
gsave
405.426911 233.827850 translate
0.000000 rotate
0.000000 0.000000 m /four glyphshow
6.362305 0.000000 m /zero glyphshow
grestore
gsave
/o {
gsave
newpath
translate
0.8 setlinewidth
1 setlinejoin
0 setlinecap
0 0 m
0 -3.5 l

gsave
0.000 setgray
fill
grestore
stroke
grestore
} bind def
450.402 248.422 o
grestore
gsave
444.042989 233.827850 translate
0.000000 rotate
0.000000 0.000000 m /six glyphshow
6.362305 0.000000 m /zero glyphshow
grestore
gsave
/o {
gsave
newpath
translate
0.8 setlinewidth
1 setlinejoin
0 setlinecap
0 0 m
0 -3.5 l

gsave
0.000 setgray
fill
grestore
stroke
grestore
} bind def
489.018 248.422 o
grestore
gsave
482.659068 233.827850 translate
0.000000 rotate
0.000000 0.000000 m /eight glyphshow
6.362305 0.000000 m /zero glyphshow
grestore
gsave
/o {
gsave
newpath
translate
0.8 setlinewidth
1 setlinejoin
0 setlinecap
0 0 m
0 -3.5 l

gsave
0.000 setgray
fill
grestore
stroke
grestore
} bind def
527.635 248.422 o
grestore
gsave
518.095458 233.827850 translate
0.000000 rotate
0.000000 0.000000 m /one glyphshow
6.362305 0.000000 m /zero glyphshow
12.724609 0.000000 m /zero glyphshow
grestore
gsave
/o {
gsave
newpath
translate
0.8 setlinewidth
1 setlinejoin
0 setlinecap
0 0 m
-3.5 0 l

gsave
0.000 setgray
fill
grestore
stroke
grestore
} bind def
326.927 262.167 o
grestore
gsave
292.474330 258.370594 translate
0.000000 rotate
0.000000 0.000000 m /minus glyphshow
8.378906 0.000000 m /six glyphshow
14.741211 0.000000 m /five glyphshow
21.103516 0.000000 m /zero glyphshow
grestore
gsave
/o {
gsave
newpath
translate
0.8 setlinewidth
1 setlinejoin
0 setlinecap
0 0 m
-3.5 0 l

gsave
0.000 setgray
fill
grestore
stroke
grestore
} bind def
326.927 284.628 o
grestore
gsave
292.474330 280.831163 translate
0.000000 rotate
0.000000 0.000000 m /minus glyphshow
8.378906 0.000000 m /six glyphshow
14.741211 0.000000 m /zero glyphshow
21.103516 0.000000 m /zero glyphshow
grestore
gsave
/o {
gsave
newpath
translate
0.8 setlinewidth
1 setlinejoin
0 setlinecap
0 0 m
-3.5 0 l

gsave
0.000 setgray
fill
grestore
stroke
grestore
} bind def
326.927 307.089 o
grestore
gsave
292.474330 303.291733 translate
0.000000 rotate
0.000000 0.000000 m /minus glyphshow
8.378906 0.000000 m /five glyphshow
14.741211 0.000000 m /five glyphshow
21.103516 0.000000 m /zero glyphshow
grestore
gsave
/o {
gsave
newpath
translate
0.8 setlinewidth
1 setlinejoin
0 setlinecap
0 0 m
-3.5 0 l

gsave
0.000 setgray
fill
grestore
stroke
grestore
} bind def
326.927 329.549 o
grestore
gsave
292.474330 325.752302 translate
0.000000 rotate
0.000000 0.000000 m /minus glyphshow
8.378906 0.000000 m /five glyphshow
14.741211 0.000000 m /zero glyphshow
21.103516 0.000000 m /zero glyphshow
grestore
gsave
/o {
gsave
newpath
translate
0.8 setlinewidth
1 setlinejoin
0 setlinecap
0 0 m
-3.5 0 l

gsave
0.000 setgray
fill
grestore
stroke
grestore
} bind def
326.927 352.01 o
grestore
gsave
292.474330 348.212872 translate
0.000000 rotate
0.000000 0.000000 m /minus glyphshow
8.378906 0.000000 m /four glyphshow
14.741211 0.000000 m /five glyphshow
21.103516 0.000000 m /zero glyphshow
grestore
gsave
/o {
gsave
newpath
translate
0.8 setlinewidth
1 setlinejoin
0 setlinecap
0 0 m
-3.5 0 l

gsave
0.000 setgray
fill
grestore
stroke
grestore
} bind def
326.927 374.47 o
grestore
gsave
292.474330 370.673441 translate
0.000000 rotate
0.000000 0.000000 m /minus glyphshow
8.378906 0.000000 m /four glyphshow
14.741211 0.000000 m /zero glyphshow
21.103516 0.000000 m /zero glyphshow
grestore
gsave
/o {
gsave
newpath
translate
0.8 setlinewidth
1 setlinejoin
0 setlinecap
0 0 m
-3.5 0 l

gsave
0.000 setgray
fill
grestore
stroke
grestore
} bind def
326.927 396.931 o
grestore
gsave
292.474330 393.134011 translate
0.000000 rotate
0.000000 0.000000 m /minus glyphshow
8.378906 0.000000 m /three glyphshow
14.741211 0.000000 m /five glyphshow
21.103516 0.000000 m /zero glyphshow
grestore
1.500 setlinewidth
2 setlinecap
0.122 0.467 0.706 setrgbcolor
gsave
210.3 164.1 326.9 248.4 clipbox
336.484934 282.831193 m
338.415738 275.64381 l
340.346542 313.377567 l
342.277346 320.564949 l
344.20815 363.689243 l
346.138953 329.549177 l
348.069757 324.158641 l
350.000561 291.81542 l
351.931365 261.269046 l
353.862169 336.736559 l
355.792973 358.298706 l
357.723777 325.955486 l
359.654581 316.971258 l
361.585385 316.971258 l
363.516189 318.768104 l
365.446992 320.564949 l
367.377796 336.736559 l
369.3086 336.736559 l
371.239404 354.705015 l
373.170208 288.221729 l
375.101012 320.564949 l
377.031816 297.205957 l
378.96262 275.64381 l
380.893424 354.705015 l
382.824228 333.142868 l
384.755032 302.596494 l
386.685835 309.783876 l
388.616639 309.783876 l
390.547443 358.298706 l
392.478247 318.768104 l
394.409051 345.720787 l
396.339855 288.221729 l
398.270659 351.111324 l
400.201463 322.361795 l
402.132267 286.424884 l
404.063071 333.142868 l
405.993875 342.127096 l
407.924678 281.034347 l
409.855482 293.612266 l
411.786286 300.799648 l
413.71709 311.580722 l
415.647894 284.628038 l
417.578698 297.205957 l
419.509502 311.580722 l
421.440306 318.768104 l
423.37111 322.361795 l
425.301914 327.752332 l
427.232718 255.878509 l
429.163521 336.736559 l
431.094325 313.377567 l
433.025129 343.923942 l
434.955933 297.205957 l
436.886737 370.876625 l
438.817541 340.330251 l
440.748345 297.205957 l
442.679149 309.783876 l
444.609953 291.81542 l
446.540757 281.034347 l
448.47156 295.409112 l
450.402364 309.783876 l
452.333168 299.002803 l
454.263972 286.424884 l
456.194776 352.90817 l
458.12558 347.517633 l
460.056384 320.564949 l
461.987188 316.971258 l
463.917992 300.799648 l
465.848796 327.752332 l
467.7796 327.752332 l
469.710403 376.267162 l
471.641207 297.205957 l
473.572011 360.095552 l
475.502815 333.142868 l
477.433619 331.346023 l
479.364423 340.330251 l
481.295227 343.923942 l
483.226031 327.752332 l
485.156835 343.923942 l
487.087639 315.174413 l
489.018443 281.034347 l
490.949246 272.050119 l
492.88005 299.002803 l
494.810854 290.018575 l
496.741658 324.158641 l
498.672462 351.111324 l
500.603266 302.596494 l
502.53407 336.736559 l
504.464874 405.016691 l
506.395678 342.127096 l
508.326482 286.424884 l
510.257285 282.831193 l
512.188089 360.095552 l
514.118893 316.971258 l
516.049697 367.282934 l
517.980501 352.90817 l
519.911305 304.393339 l
521.842109 336.736559 l
523.772913 342.127096 l
525.703717 309.783876 l
527.634521 340.330251 l
stroke
grestore
0.800 setlinewidth
0 setlinejoin
[] 0 setdash
0.000 setgray
gsave
326.927455 248.4216 m
326.927455 412.4736 l
stroke
grestore
gsave
537.192 248.4216 m
537.192 412.4736 l
stroke
grestore
gsave
326.927455 248.4216 m
537.192 248.4216 l
stroke
grestore
gsave
326.927455 412.4736 m
537.192 412.4736 l
stroke
grestore
/DejaVuSans findfont
12.000 scalefont
setfont
gsave
424.825352 418.473600 translate
0.000000 rotate
0.000000 0.000000 m /a glyphshow
7.353516 0.000000 m /y glyphshow
grestore
gsave
74.61 51.5592 m
284.874545 51.5592 l
284.874545 215.6112 l
74.61 215.6112 l
cl
1.000 setgray
fill
grestore
1 setlinejoin
0 setlinecap
[] 0 setdash
gsave
/o {
gsave
newpath
translate
0.8 setlinewidth
1 setlinejoin
0 setlinecap
0 0 m
0 -3.5 l

gsave
0.000 setgray
fill
grestore
stroke
grestore
} bind def
82.2367 51.5592 o
grestore
/DejaVuSans findfont
10.000 scalefont
setfont
gsave
79.056988 36.965450 translate
0.000000 rotate
0.000000 0.000000 m /zero glyphshow
grestore
gsave
/o {
gsave
newpath
translate
0.8 setlinewidth
1 setlinejoin
0 setlinecap
0 0 m
0 -3.5 l

gsave
0.000 setgray
fill
grestore
stroke
grestore
} bind def
120.853 51.5592 o
grestore
gsave
114.493379 36.965450 translate
0.000000 rotate
0.000000 0.000000 m /two glyphshow
6.362305 0.000000 m /zero glyphshow
grestore
gsave
/o {
gsave
newpath
translate
0.8 setlinewidth
1 setlinejoin
0 setlinecap
0 0 m
0 -3.5 l

gsave
0.000 setgray
fill
grestore
stroke
grestore
} bind def
159.469 51.5592 o
grestore
gsave
153.109457 36.965450 translate
0.000000 rotate
0.000000 0.000000 m /four glyphshow
6.362305 0.000000 m /zero glyphshow
grestore
gsave
/o {
gsave
newpath
translate
0.8 setlinewidth
1 setlinejoin
0 setlinecap
0 0 m
0 -3.5 l

gsave
0.000 setgray
fill
grestore
stroke
grestore
} bind def
198.085 51.5592 o
grestore
gsave
191.725535 36.965450 translate
0.000000 rotate
0.000000 0.000000 m /six glyphshow
6.362305 0.000000 m /zero glyphshow
grestore
gsave
/o {
gsave
newpath
translate
0.8 setlinewidth
1 setlinejoin
0 setlinecap
0 0 m
0 -3.5 l

gsave
0.000 setgray
fill
grestore
stroke
grestore
} bind def
236.701 51.5592 o
grestore
gsave
230.341613 36.965450 translate
0.000000 rotate
0.000000 0.000000 m /eight glyphshow
6.362305 0.000000 m /zero glyphshow
grestore
gsave
/o {
gsave
newpath
translate
0.8 setlinewidth
1 setlinejoin
0 setlinecap
0 0 m
0 -3.5 l

gsave
0.000 setgray
fill
grestore
stroke
grestore
} bind def
275.317 51.5592 o
grestore
gsave
265.778004 36.965450 translate
0.000000 rotate
0.000000 0.000000 m /one glyphshow
6.362305 0.000000 m /zero glyphshow
12.724609 0.000000 m /zero glyphshow
grestore
gsave
/o {
gsave
newpath
translate
0.8 setlinewidth
1 setlinejoin
0 setlinecap
0 0 m
-3.5 0 l

gsave
0.000 setgray
fill
grestore
stroke
grestore
} bind def
74.61 76.5618 o
grestore
gsave
35.813125 72.764903 translate
0.000000 rotate
0.000000 0.000000 m /one glyphshow
6.362305 0.000000 m /four glyphshow
12.724609 0.000000 m /zero glyphshow
19.086914 0.000000 m /zero glyphshow
25.449219 0.000000 m /zero glyphshow
grestore
gsave
/o {
gsave
newpath
translate
0.8 setlinewidth
1 setlinejoin
0 setlinecap
0 0 m
-3.5 0 l

gsave
0.000 setgray
fill
grestore
stroke
grestore
} bind def
74.61 103.977 o
grestore
gsave
35.813125 100.180009 translate
0.000000 rotate
0.000000 0.000000 m /one glyphshow
6.362305 0.000000 m /four glyphshow
12.724609 0.000000 m /one glyphshow
19.086914 0.000000 m /zero glyphshow
25.449219 0.000000 m /zero glyphshow
grestore
gsave
/o {
gsave
newpath
translate
0.8 setlinewidth
1 setlinejoin
0 setlinecap
0 0 m
-3.5 0 l

gsave
0.000 setgray
fill
grestore
stroke
grestore
} bind def
74.61 131.392 o
grestore
gsave
35.813125 127.595116 translate
0.000000 rotate
0.000000 0.000000 m /one glyphshow
6.362305 0.000000 m /four glyphshow
12.724609 0.000000 m /two glyphshow
19.086914 0.000000 m /zero glyphshow
25.449219 0.000000 m /zero glyphshow
grestore
gsave
/o {
gsave
newpath
translate
0.8 setlinewidth
1 setlinejoin
0 setlinecap
0 0 m
-3.5 0 l

gsave
0.000 setgray
fill
grestore
stroke
grestore
} bind def
74.61 158.807 o
grestore
gsave
35.813125 155.010223 translate
0.000000 rotate
0.000000 0.000000 m /one glyphshow
6.362305 0.000000 m /four glyphshow
12.724609 0.000000 m /three glyphshow
19.086914 0.000000 m /zero glyphshow
25.449219 0.000000 m /zero glyphshow
grestore
gsave
/o {
gsave
newpath
translate
0.8 setlinewidth
1 setlinejoin
0 setlinecap
0 0 m
-3.5 0 l

gsave
0.000 setgray
fill
grestore
stroke
grestore
} bind def
74.61 186.222 o
grestore
gsave
35.813125 182.425330 translate
0.000000 rotate
0.000000 0.000000 m /one glyphshow
6.362305 0.000000 m /four glyphshow
12.724609 0.000000 m /four glyphshow
19.086914 0.000000 m /zero glyphshow
25.449219 0.000000 m /zero glyphshow
grestore
gsave
/o {
gsave
newpath
translate
0.8 setlinewidth
1 setlinejoin
0 setlinecap
0 0 m
-3.5 0 l

gsave
0.000 setgray
fill
grestore
stroke
grestore
} bind def
74.61 213.637 o
grestore
gsave
35.813125 209.840437 translate
0.000000 rotate
0.000000 0.000000 m /one glyphshow
6.362305 0.000000 m /four glyphshow
12.724609 0.000000 m /five glyphshow
19.086914 0.000000 m /zero glyphshow
25.449219 0.000000 m /zero glyphshow
grestore
1.500 setlinewidth
2 setlinecap
0.122 0.467 0.706 setrgbcolor
gsave
210.3 164.1 74.61 51.56 clipbox
84.167479 175.256163 m
86.098283 142.358034 l
88.029087 185.125601 l
89.959891 163.193516 l
91.890695 128.102179 l
93.821499 157.710494 l
95.752303 100.687072 l
97.683107 192.801831 l
99.613911 159.903703 l
101.544715 151.130868 l
103.475518 95.20405 l
105.406322 123.715761 l
107.337126 121.522553 l
109.26793 119.329344 l
111.198734 131.391991 l
113.129538 125.90897 l
115.060342 118.23274 l
116.991146 116.039532 l
118.92195 143.454639 l
120.852754 134.681804 l
122.783557 171.96635 l
124.714361 179.64258 l
126.645165 142.358034 l
128.575969 152.227473 l
130.506773 197.188248 l
132.437577 122.619157 l
134.368381 191.705227 l
136.299185 161.000307 l
138.229989 159.903703 l
140.160793 137.971617 l
142.091597 169.773141 l
144.0224 128.102179 l
145.953204 130.295387 l
147.884008 151.130868 l
149.814812 77.658382 l
151.745616 103.976884 l
153.67642 134.681804 l
155.607224 94.107446 l
157.538028 101.783676 l
159.468832 118.23274 l
161.399636 169.773141 l
163.33044 166.483328 l
165.261243 135.778409 l
167.192047 145.647847 l
169.122851 134.681804 l
171.053655 159.903703 l
172.984459 154.420681 l
174.915263 177.449371 l
176.846067 184.028997 l
178.776871 131.391991 l
180.707675 125.90897 l
182.638479 150.034264 l
184.569282 124.812366 l
186.500086 89.721029 l
188.43089 128.102179 l
190.361694 146.744451 l
192.292498 109.459906 l
194.223302 96.300655 l
196.154106 97.397259 l
198.08491 154.420681 l
200.015714 133.5852 l
201.946518 148.93766 l
203.877322 109.459906 l
205.808125 110.55651 l
207.738929 176.352767 l
209.669733 175.256163 l
211.600537 194.99504 l
213.531341 177.449371 l
215.462145 171.96635 l
217.392949 169.773141 l
219.323753 189.512018 l
221.254557 119.329344 l
223.185361 105.073489 l
225.116165 128.102179 l
227.046968 125.90897 l
228.977772 89.721029 l
230.908576 101.783676 l
232.83938 93.010842 l
234.770184 161.000307 l
236.700988 133.5852 l
238.631792 159.903703 l
240.562596 140.164826 l
242.4934 157.710494 l
244.424204 169.773141 l
246.355008 208.154291 l
248.285811 171.96635 l
250.216615 159.903703 l
252.147419 174.159558 l
254.078223 182.932393 l
256.009027 165.386724 l
257.939831 151.130868 l
259.870635 173.062954 l
261.801439 169.773141 l
263.732243 59.016109 l
265.663047 164.29012 l
267.59385 165.386724 l
269.524654 67.788943 l
271.455458 156.61389 l
273.386262 112.749719 l
275.317066 111.653114 l
stroke
grestore
0.800 setlinewidth
0 setlinejoin
[] 0 setdash
0.000 setgray
gsave
74.61 51.5592 m
74.61 215.6112 l
stroke
grestore
gsave
284.874545 51.5592 m
284.874545 215.6112 l
stroke
grestore
gsave
74.61 51.5592 m
284.874545 51.5592 l
stroke
grestore
gsave
74.61 215.6112 m
284.874545 215.6112 l
stroke
grestore
/DejaVuSans findfont
12.000 scalefont
setfont
gsave
172.914148 221.611200 translate
0.000000 rotate
0.000000 0.000000 m /a glyphshow
7.353516 0.000000 m /z glyphshow
grestore
gsave
326.927455 51.5592 m
537.192 51.5592 l
537.192 215.6112 l
326.927455 215.6112 l
cl
1.000 setgray
fill
grestore
1 setlinejoin
0 setlinecap
[] 0 setdash
gsave
/o {
gsave
newpath
translate
0.8 setlinewidth
1 setlinejoin
0 setlinecap
0 0 m
0 -3.5 l

gsave
0.000 setgray
fill
grestore
stroke
grestore
} bind def
334.554 51.5592 o
grestore
/DejaVuSans findfont
10.000 scalefont
setfont
gsave
331.374442 36.965450 translate
0.000000 rotate
0.000000 0.000000 m /zero glyphshow
grestore
gsave
/o {
gsave
newpath
translate
0.8 setlinewidth
1 setlinejoin
0 setlinecap
0 0 m
0 -3.5 l

gsave
0.000 setgray
fill
grestore
stroke
grestore
} bind def
373.17 51.5592 o
grestore
gsave
366.810833 36.965450 translate
0.000000 rotate
0.000000 0.000000 m /two glyphshow
6.362305 0.000000 m /zero glyphshow
grestore
gsave
/o {
gsave
newpath
translate
0.8 setlinewidth
1 setlinejoin
0 setlinecap
0 0 m
0 -3.5 l

gsave
0.000 setgray
fill
grestore
stroke
grestore
} bind def
411.786 51.5592 o
grestore
gsave
405.426911 36.965450 translate
0.000000 rotate
0.000000 0.000000 m /four glyphshow
6.362305 0.000000 m /zero glyphshow
grestore
gsave
/o {
gsave
newpath
translate
0.8 setlinewidth
1 setlinejoin
0 setlinecap
0 0 m
0 -3.5 l

gsave
0.000 setgray
fill
grestore
stroke
grestore
} bind def
450.402 51.5592 o
grestore
gsave
444.042989 36.965450 translate
0.000000 rotate
0.000000 0.000000 m /six glyphshow
6.362305 0.000000 m /zero glyphshow
grestore
gsave
/o {
gsave
newpath
translate
0.8 setlinewidth
1 setlinejoin
0 setlinecap
0 0 m
0 -3.5 l

gsave
0.000 setgray
fill
grestore
stroke
grestore
} bind def
489.018 51.5592 o
grestore
gsave
482.659068 36.965450 translate
0.000000 rotate
0.000000 0.000000 m /eight glyphshow
6.362305 0.000000 m /zero glyphshow
grestore
gsave
/o {
gsave
newpath
translate
0.8 setlinewidth
1 setlinejoin
0 setlinecap
0 0 m
0 -3.5 l

gsave
0.000 setgray
fill
grestore
stroke
grestore
} bind def
527.635 51.5592 o
grestore
gsave
518.095458 36.965450 translate
0.000000 rotate
0.000000 0.000000 m /one glyphshow
6.362305 0.000000 m /zero glyphshow
12.724609 0.000000 m /zero glyphshow
grestore
gsave
/o {
gsave
newpath
translate
0.8 setlinewidth
1 setlinejoin
0 setlinecap
0 0 m
-3.5 0 l

gsave
0.000 setgray
fill
grestore
stroke
grestore
} bind def
326.927 65.5552 o
grestore
gsave
313.568080 61.758309 translate
0.000000 rotate
0.000000 0.000000 m /zero glyphshow
grestore
gsave
/o {
gsave
newpath
translate
0.8 setlinewidth
1 setlinejoin
0 setlinecap
0 0 m
-3.5 0 l

gsave
0.000 setgray
fill
grestore
stroke
grestore
} bind def
326.927 90.1752 o
grestore
gsave
294.489955 86.378321 translate
0.000000 rotate
0.000000 0.000000 m /two glyphshow
6.362305 0.000000 m /five glyphshow
12.724609 0.000000 m /zero glyphshow
19.086914 0.000000 m /zero glyphshow
grestore
gsave
/o {
gsave
newpath
translate
0.8 setlinewidth
1 setlinejoin
0 setlinecap
0 0 m
-3.5 0 l

gsave
0.000 setgray
fill
grestore
stroke
grestore
} bind def
326.927 114.795 o
grestore
gsave
294.489955 110.998332 translate
0.000000 rotate
0.000000 0.000000 m /five glyphshow
6.362305 0.000000 m /zero glyphshow
12.724609 0.000000 m /zero glyphshow
19.086914 0.000000 m /zero glyphshow
grestore
gsave
/o {
gsave
newpath
translate
0.8 setlinewidth
1 setlinejoin
0 setlinecap
0 0 m
-3.5 0 l

gsave
0.000 setgray
fill
grestore
stroke
grestore
} bind def
326.927 139.415 o
grestore
gsave
294.489955 135.618344 translate
0.000000 rotate
0.000000 0.000000 m /seven glyphshow
6.362305 0.000000 m /five glyphshow
12.724609 0.000000 m /zero glyphshow
19.086914 0.000000 m /zero glyphshow
grestore
gsave
/o {
gsave
newpath
translate
0.8 setlinewidth
1 setlinejoin
0 setlinecap
0 0 m
-3.5 0 l

gsave
0.000 setgray
fill
grestore
stroke
grestore
} bind def
326.927 164.035 o
grestore
gsave
288.130580 160.238355 translate
0.000000 rotate
0.000000 0.000000 m /one glyphshow
6.362305 0.000000 m /zero glyphshow
12.724609 0.000000 m /zero glyphshow
19.086914 0.000000 m /zero glyphshow
25.449219 0.000000 m /zero glyphshow
grestore
gsave
/o {
gsave
newpath
translate
0.8 setlinewidth
1 setlinejoin
0 setlinecap
0 0 m
-3.5 0 l

gsave
0.000 setgray
fill
grestore
stroke
grestore
} bind def
326.927 188.655 o
grestore
gsave
288.130580 184.858367 translate
0.000000 rotate
0.000000 0.000000 m /one glyphshow
6.362305 0.000000 m /two glyphshow
12.724609 0.000000 m /five glyphshow
19.086914 0.000000 m /zero glyphshow
25.449219 0.000000 m /zero glyphshow
grestore
gsave
/o {
gsave
newpath
translate
0.8 setlinewidth
1 setlinejoin
0 setlinecap
0 0 m
-3.5 0 l

gsave
0.000 setgray
fill
grestore
stroke
grestore
} bind def
326.927 213.275 o
grestore
gsave
288.130580 209.478378 translate
0.000000 rotate
0.000000 0.000000 m /one glyphshow
6.362305 0.000000 m /five glyphshow
12.724609 0.000000 m /zero glyphshow
19.086914 0.000000 m /zero glyphshow
25.449219 0.000000 m /zero glyphshow
grestore
1.500 setlinewidth
2 setlinecap
0.122 0.467 0.706 setrgbcolor
gsave
210.3 164.1 326.9 51.56 clipbox
336.484934 103.962402 m
338.415738 102.898818 l
340.346542 102.662466 l
342.277346 102.229153 l
344.20815 102.189761 l
346.138953 103.450306 l
348.069757 103.962402 l
350.000561 103.883618 l
351.931365 103.174562 l
353.862169 102.623074 l
355.792973 103.13517 l
357.723777 102.583681 l
359.654581 103.056386 l
361.585385 102.465505 l
363.516189 102.859426 l
365.446992 103.647266 l
367.377796 104.041186 l
369.3086 103.174562 l
371.239404 104.592674 l
373.170208 103.92301 l
375.101012 103.489698 l
377.031816 102.93821 l
378.96262 103.686658 l
380.893424 103.607874 l
382.824228 103.33213 l
384.755032 103.292738 l
386.685835 102.701858 l
388.616639 101.717057 l
390.547443 103.33213 l
392.478247 102.780642 l
394.409051 101.401921 l
396.339855 101.401921 l
398.270659 102.820034 l
400.201463 102.701858 l
402.132267 103.213954 l
404.063071 103.253346 l
405.993875 102.347329 l
407.924678 103.52909 l
409.855482 103.489698 l
411.786286 104.001794 l
413.71709 104.750243 l
415.647894 102.623074 l
417.578698 103.72605 l
419.509502 104.11997 l
421.440306 103.883618 l
423.37111 103.13517 l
425.301914 103.016994 l
427.232718 103.33213 l
429.163521 102.93821 l
431.094325 102.623074 l
433.025129 102.74125 l
434.955933 102.189761 l
436.886737 102.544289 l
438.817541 102.977602 l
440.748345 103.213954 l
442.679149 101.717057 l
444.609953 103.765442 l
446.540757 103.607874 l
448.47156 103.33213 l
450.402364 103.52909 l
452.333168 104.11997 l
454.263972 102.898818 l
456.194776 103.33213 l
458.12558 104.041186 l
460.056384 103.765442 l
461.987188 101.717057 l
463.917992 102.426113 l
465.848796 102.898818 l
467.7796 102.032193 l
469.710403 102.307937 l
471.641207 102.859426 l
473.572011 101.480705 l
475.502815 102.583681 l
477.433619 102.820034 l
479.364423 103.410914 l
481.295227 102.623074 l
483.226031 103.647266 l
485.156835 103.568482 l
487.087639 103.962402 l
489.018443 103.13517 l
490.949246 103.883618 l
492.88005 103.844226 l
494.810854 103.804834 l
496.741658 102.583681 l
498.672462 102.859426 l
500.603266 103.292738 l
502.53407 103.056386 l
504.464874 102.229153 l
506.395678 101.204961 l
508.326482 102.465505 l
510.257285 103.33213 l
512.188089 101.874625 l
514.118893 102.347329 l
516.049697 102.701858 l
517.980501 103.095778 l
519.911305 103.33213 l
521.842109 104.474498 l
523.772913 102.977602 l
525.703717 103.92301 l
527.634521 102.859426 l
stroke
grestore
1.000 0.498 0.055 setrgbcolor
gsave
210.3 164.1 326.9 51.56 clipbox
336.484934 59.606989 m
338.415738 59.449421 l
340.346542 60.276654 l
342.277346 60.434222 l
344.20815 61.37963 l
346.138953 60.631182 l
348.069757 60.513006 l
350.000561 59.803949 l
351.931365 59.134285 l
353.862169 60.78875 l
355.792973 61.261454 l
357.723777 60.552398 l
359.654581 60.355438 l
361.585385 60.355438 l
363.516189 60.39483 l
365.446992 60.434222 l
367.377796 60.78875 l
369.3086 60.78875 l
371.239404 61.18267 l
373.170208 59.725165 l
375.101012 60.434222 l
377.031816 59.922126 l
378.96262 59.449421 l
380.893424 61.18267 l
382.824228 60.709966 l
384.755032 60.040302 l
386.685835 60.19787 l
388.616639 60.19787 l
390.547443 61.261454 l
392.478247 60.39483 l
394.409051 60.98571 l
396.339855 59.725165 l
398.270659 61.103886 l
400.201463 60.473614 l
402.132267 59.685773 l
404.063071 60.709966 l
405.993875 60.906926 l
407.924678 59.567597 l
409.855482 59.843341 l
411.786286 60.00091 l
413.71709 60.237262 l
415.647894 59.646381 l
417.578698 59.922126 l
419.509502 60.237262 l
421.440306 60.39483 l
423.37111 60.473614 l
425.301914 60.59179 l
427.232718 59.016109 l
429.163521 60.78875 l
431.094325 60.276654 l
433.025129 60.946318 l
434.955933 59.922126 l
436.886737 61.537198 l
438.817541 60.867534 l
440.748345 59.922126 l
442.679149 60.19787 l
444.609953 59.803949 l
446.540757 59.567597 l
448.47156 59.882733 l
450.402364 60.19787 l
452.333168 59.961518 l
454.263972 59.685773 l
456.194776 61.143278 l
458.12558 61.025102 l
460.056384 60.434222 l
461.987188 60.355438 l
463.917992 60.00091 l
465.848796 60.59179 l
467.7796 60.59179 l
469.710403 61.655374 l
471.641207 59.922126 l
473.572011 61.300846 l
475.502815 60.709966 l
477.433619 60.670574 l
479.364423 60.867534 l
481.295227 60.946318 l
483.226031 60.59179 l
485.156835 60.946318 l
487.087639 60.316046 l
489.018443 59.567597 l
490.949246 59.370637 l
492.88005 59.961518 l
494.810854 59.764557 l
496.741658 60.513006 l
498.672462 61.103886 l
500.603266 60.040302 l
502.53407 60.78875 l
504.464874 62.285647 l
506.395678 60.906926 l
508.326482 59.685773 l
510.257285 59.606989 l
512.188089 61.300846 l
514.118893 60.355438 l
516.049697 61.458414 l
517.980501 61.143278 l
519.911305 60.079694 l
521.842109 60.78875 l
523.772913 60.906926 l
525.703717 60.19787 l
527.634521 60.867534 l
stroke
grestore
0.173 0.627 0.173 setrgbcolor
gsave
210.3 164.1 326.9 51.56 clipbox
336.484934 206.97253 m
338.415738 205.79077 l
340.346542 207.327059 l
342.277346 206.539218 l
344.20815 205.278674 l
346.138953 206.342258 l
348.069757 204.293873 l
350.000561 207.602803 l
351.931365 206.421042 l
353.862169 206.105906 l
355.792973 204.096913 l
357.723777 205.121105 l
359.654581 205.042321 l
361.585385 204.963537 l
363.516189 205.39685 l
365.446992 205.19989 l
367.377796 204.924145 l
369.3086 204.845361 l
371.239404 205.830162 l
373.170208 205.515026 l
375.101012 206.854354 l
377.031816 207.130098 l
378.96262 205.79077 l
380.893424 206.145298 l
382.824228 207.760371 l
384.755032 205.081713 l
386.685835 207.563411 l
388.616639 206.460434 l
390.547443 206.421042 l
392.478247 205.633202 l
394.409051 206.77557 l
396.339855 205.278674 l
398.270659 205.357458 l
400.201463 206.105906 l
402.132267 203.466641 l
404.063071 204.412049 l
405.993875 205.515026 l
407.924678 204.057521 l
409.855482 204.333265 l
411.786286 204.924145 l
413.71709 206.77557 l
415.647894 206.657394 l
417.578698 205.554418 l
419.509502 205.908946 l
421.440306 205.515026 l
423.37111 206.421042 l
425.301914 206.224082 l
427.232718 207.051314 l
429.163521 207.287667 l
431.094325 205.39685 l
433.025129 205.19989 l
434.955933 206.066514 l
436.886737 205.160498 l
438.817541 203.899953 l
440.748345 205.278674 l
442.679149 205.948338 l
444.609953 204.609009 l
446.540757 204.136305 l
448.47156 204.175697 l
450.402364 206.224082 l
452.333168 205.475634 l
454.263972 206.027122 l
456.194776 204.609009 l
458.12558 204.648401 l
460.056384 207.011922 l
461.987188 206.97253 l
463.917992 207.681587 l
465.848796 207.051314 l
467.7796 206.854354 l
469.710403 206.77557 l
471.641207 207.484627 l
473.572011 204.963537 l
475.502815 204.451441 l
477.433619 205.278674 l
479.364423 205.19989 l
481.295227 203.899953 l
483.226031 204.333265 l
485.156835 204.018129 l
487.087639 206.460434 l
489.018443 205.475634 l
490.949246 206.421042 l
492.88005 205.711986 l
494.810854 206.342258 l
496.741658 206.77557 l
498.672462 208.154291 l
500.603266 206.854354 l
502.53407 206.421042 l
504.464874 206.933138 l
506.395678 207.248274 l
508.326482 206.618002 l
510.257285 206.105906 l
512.188089 206.893746 l
514.118893 206.77557 l
516.049697 202.796976 l
517.980501 206.57861 l
519.911305 206.618002 l
521.842109 203.112113 l
523.772913 206.302866 l
525.703717 204.727185 l
527.634521 204.687793 l
stroke
grestore
0.800 setlinewidth
0 setlinejoin
[] 0 setdash
0.000 setgray
gsave
326.927455 51.5592 m
326.927455 215.6112 l
stroke
grestore
gsave
537.192 51.5592 m
537.192 215.6112 l
stroke
grestore
gsave
326.927455 51.5592 m
537.192 51.5592 l
stroke
grestore
gsave
326.927455 215.6112 m
537.192 215.6112 l
stroke
grestore
/DejaVuSans findfont
12.000 scalefont
setfont
gsave
399.583165 221.611200 translate
0.000000 rotate
0.000000 0.000000 m /a glyphshow
7.353516 0.000000 m /x glyphshow
14.455078 0.000000 m /comma glyphshow
18.269531 0.000000 m /space glyphshow
22.083984 0.000000 m /a glyphshow
29.437500 0.000000 m /y glyphshow
36.539062 0.000000 m /space glyphshow
40.353516 0.000000 m /y glyphshow
47.455078 0.000000 m /space glyphshow
51.269531 0.000000 m /a glyphshow
58.623047 0.000000 m /z glyphshow
grestore
gsave
188.400937 450.220600 translate
0.000000 rotate
0.000000 0.000000 m /A glyphshow
8.208984 0.000000 m /c glyphshow
14.806641 0.000000 m /e glyphshow
22.189453 0.000000 m /l glyphshow
25.523438 0.000000 m /e glyphshow
32.906250 0.000000 m /r glyphshow
37.839844 0.000000 m /o glyphshow
45.181641 0.000000 m /m glyphshow
56.871094 0.000000 m /e glyphshow
64.253906 0.000000 m /t glyphshow
68.958984 0.000000 m /r glyphshow
73.892578 0.000000 m /o glyphshow
81.234375 0.000000 m /space glyphshow
85.048828 0.000000 m /n glyphshow
92.654297 0.000000 m /o glyphshow
99.996094 0.000000 m /space glyphshow
103.810547 0.000000 m /c glyphshow
110.408203 0.000000 m /a glyphshow
117.761719 0.000000 m /l glyphshow
121.095703 0.000000 m /i glyphshow
124.429688 0.000000 m /b glyphshow
132.046875 0.000000 m /r glyphshow
136.980469 0.000000 m /a glyphshow
144.333984 0.000000 m /d glyphshow
151.951172 0.000000 m /o glyphshow
159.292969 0.000000 m /space glyphshow
163.107422 0.000000 m /M glyphshow
173.460938 0.000000 m /P glyphshow
180.697266 0.000000 m /U glyphshow
189.480469 0.000000 m /six glyphshow
197.115234 0.000000 m /zero glyphshow
204.750000 0.000000 m /five glyphshow
212.384766 0.000000 m /zero glyphshow
grestore

end
showpage
