%!PS-Adobe-3.0 EPSF-3.0
%%Title: /home/pi/Desktop/GYRO-NO.eps
%%Creator: matplotlib version 3.0.2, http://matplotlib.org/
%%CreationDate: Sun Apr 11 20:02:28 2021
%%Orientation: portrait
%%BoundingBox: 7 162 604 630
%%EndComments
%%BeginProlog
/mpldict 8 dict def
mpldict begin
/m { moveto } bind def
/l { lineto } bind def
/r { rlineto } bind def
/c { curveto } bind def
/cl { closepath } bind def
/box {
m
1 index 0 r
0 exch r
neg 0 r
cl
} bind def
/clipbox {
box
clip
newpath
} bind def
%!PS-Adobe-3.0 Resource-Font
%%Title: DejaVu Sans
%%Copyright: Copyright (c) 2003 by Bitstream, Inc. All Rights Reserved. Copyright (c) 2006 by Tavmjong Bah. All Rights Reserved. DejaVu changes are in public domain 
%%Creator: Converted from TrueType to type 3 by PPR
25 dict begin
/_d{bind def}bind def
/_m{moveto}_d
/_l{lineto}_d
/_cl{closepath eofill}_d
/_c{curveto}_d
/_sc{7 -1 roll{setcachedevice}{pop pop pop pop pop pop}ifelse}_d
/_e{exec}_d
/FontName /DejaVuSans def
/PaintType 0 def
/FontMatrix[.001 0 0 .001 0 0]def
/FontBBox[-1021 -463 1793 1232]def
/FontType 3 def
/Encoding [ /space /comma /zero /one /two /three /four /five /six /seven /eight /nine /G /M /P /U /a /b /c /d /g /i /l /n /o /p /r /s /x /y /z /minus ] def
/FontInfo 10 dict dup begin
/FamilyName (DejaVu Sans) def
/FullName (DejaVu Sans) def
/Notice (Copyright (c) 2003 by Bitstream, Inc. All Rights Reserved. Copyright (c) 2006 by Tavmjong Bah. All Rights Reserved. DejaVu changes are in public domain ) def
/Weight (Book) def
/Version (Version 2.35) def
/ItalicAngle 0.0 def
/isFixedPitch false def
/UnderlinePosition -130 def
/UnderlineThickness 90 def
end readonly def
/CharStrings 33 dict dup begin
/.notdef 0 def
/space{318 0 0 0 0 0 _sc
}_d
/comma{318 0 77 -115 220 124 _sc
117 124 _m
220 124 _l
220 40 _l
140 -115 _l
77 -115 _l
117 40 _l
117 124 _l
_cl}_d
/zero{636 0 66 -13 570 742 _sc
318 664 _m
267 664 229 639 203 589 _c
177 539 165 464 165 364 _c
165 264 177 189 203 139 _c
229 89 267 64 318 64 _c
369 64 407 89 433 139 _c
458 189 471 264 471 364 _c
471 464 458 539 433 589 _c
407 639 369 664 318 664 _c
318 742 _m
399 742 461 709 505 645 _c
548 580 570 486 570 364 _c
570 241 548 147 505 83 _c
461 19 399 -13 318 -13 _c
236 -13 173 19 130 83 _c
87 147 66 241 66 364 _c
66 486 87 580 130 645 _c
173 709 236 742 318 742 _c
_cl}_d
/one{636 0 110 0 544 729 _sc
124 83 _m
285 83 _l
285 639 _l
110 604 _l
110 694 _l
284 729 _l
383 729 _l
383 83 _l
544 83 _l
544 0 _l
124 0 _l
124 83 _l
_cl}_d
/two{{636 0 73 0 536 742 _sc
192 83 _m
536 83 _l
536 0 _l
73 0 _l
73 83 _l
110 121 161 173 226 239 _c
290 304 331 346 348 365 _c
380 400 402 430 414 455 _c
426 479 433 504 433 528 _c
433 566 419 598 392 622 _c
365 646 330 659 286 659 _c
255 659 222 653 188 643 _c
154 632 117 616 78 594 _c
78 694 _l
118 710 155 722 189 730 _c
223 738 255 742 284 742 _c
}_e{359 742 419 723 464 685 _c
509 647 532 597 532 534 _c
532 504 526 475 515 449 _c
504 422 484 390 454 354 _c
446 344 420 317 376 272 _c
332 227 271 164 192 83 _c
_cl}_e}_d
/three{{636 0 76 -13 556 742 _sc
406 393 _m
453 383 490 362 516 330 _c
542 298 556 258 556 212 _c
556 140 531 84 482 45 _c
432 6 362 -13 271 -13 _c
240 -13 208 -10 176 -4 _c
144 1 110 10 76 22 _c
76 117 _l
103 101 133 89 166 81 _c
198 73 232 69 268 69 _c
330 69 377 81 409 105 _c
441 129 458 165 458 212 _c
458 254 443 288 413 312 _c
383 336 341 349 287 349 _c
}_e{202 349 _l
202 430 _l
291 430 _l
339 430 376 439 402 459 _c
428 478 441 506 441 543 _c
441 580 427 609 401 629 _c
374 649 336 659 287 659 _c
260 659 231 656 200 650 _c
169 644 135 635 98 623 _c
98 711 _l
135 721 170 729 203 734 _c
235 739 266 742 296 742 _c
370 742 429 725 473 691 _c
517 657 539 611 539 553 _c
539 513 527 479 504 451 _c
481 423 448 403 406 393 _c
_cl}_e}_d
/four{636 0 49 0 580 729 _sc
378 643 _m
129 254 _l
378 254 _l
378 643 _l
352 729 _m
476 729 _l
476 254 _l
580 254 _l
580 172 _l
476 172 _l
476 0 _l
378 0 _l
378 172 _l
49 172 _l
49 267 _l
352 729 _l
_cl}_d
/five{{636 0 77 -13 549 729 _sc
108 729 _m
495 729 _l
495 646 _l
198 646 _l
198 467 _l
212 472 227 476 241 478 _c
255 480 270 482 284 482 _c
365 482 429 459 477 415 _c
525 370 549 310 549 234 _c
549 155 524 94 475 51 _c
426 8 357 -13 269 -13 _c
238 -13 207 -10 175 -6 _c
143 -1 111 6 77 17 _c
77 116 _l
106 100 136 88 168 80 _c
199 72 232 69 267 69 _c
}_e{323 69 368 83 401 113 _c
433 143 450 183 450 234 _c
450 284 433 324 401 354 _c
368 384 323 399 267 399 _c
241 399 214 396 188 390 _c
162 384 135 375 108 363 _c
108 729 _l
_cl}_e}_d
/six{{636 0 70 -13 573 742 _sc
330 404 _m
286 404 251 388 225 358 _c
199 328 186 286 186 234 _c
186 181 199 139 225 109 _c
251 79 286 64 330 64 _c
374 64 409 79 435 109 _c
461 139 474 181 474 234 _c
474 286 461 328 435 358 _c
409 388 374 404 330 404 _c
526 713 _m
526 623 _l
501 635 476 644 451 650 _c
425 656 400 659 376 659 _c
310 659 260 637 226 593 _c
}_e{192 549 172 482 168 394 _c
187 422 211 444 240 459 _c
269 474 301 482 336 482 _c
409 482 467 459 509 415 _c
551 371 573 310 573 234 _c
573 159 550 99 506 54 _c
462 9 403 -13 330 -13 _c
246 -13 181 19 137 83 _c
92 147 70 241 70 364 _c
70 479 97 571 152 639 _c
206 707 280 742 372 742 _c
396 742 421 739 447 735 _c
472 730 498 723 526 713 _c
_cl}_e}_d
/seven{636 0 82 0 551 729 _sc
82 729 _m
551 729 _l
551 687 _l
286 0 _l
183 0 _l
432 646 _l
82 646 _l
82 729 _l
_cl}_d
/eight{{636 0 68 -13 568 742 _sc
318 346 _m
271 346 234 333 207 308 _c
180 283 167 249 167 205 _c
167 161 180 126 207 101 _c
234 76 271 64 318 64 _c
364 64 401 76 428 102 _c
455 127 469 161 469 205 _c
469 249 455 283 429 308 _c
402 333 365 346 318 346 _c
219 388 _m
177 398 144 418 120 447 _c
96 476 85 511 85 553 _c
85 611 105 657 147 691 _c
188 725 245 742 318 742 _c
}_e{390 742 447 725 489 691 _c
530 657 551 611 551 553 _c
551 511 539 476 515 447 _c
491 418 459 398 417 388 _c
464 377 501 355 528 323 _c
554 291 568 251 568 205 _c
568 134 546 80 503 43 _c
459 5 398 -13 318 -13 _c
237 -13 175 5 132 43 _c
89 80 68 134 68 205 _c
68 251 81 291 108 323 _c
134 355 171 377 219 388 _c
183 544 _m
183 506 194 476 218 455 _c
}_e{242 434 275 424 318 424 _c
360 424 393 434 417 455 _c
441 476 453 506 453 544 _c
453 582 441 611 417 632 _c
393 653 360 664 318 664 _c
275 664 242 653 218 632 _c
194 611 183 582 183 544 _c
_cl}_e}_d
/nine{{636 0 63 -13 566 742 _sc
110 15 _m
110 105 _l
134 93 159 84 185 78 _c
210 72 235 69 260 69 _c
324 69 374 90 408 134 _c
442 178 462 244 468 334 _c
448 306 424 284 396 269 _c
367 254 335 247 300 247 _c
226 247 168 269 126 313 _c
84 357 63 417 63 494 _c
63 568 85 628 129 674 _c
173 719 232 742 306 742 _c
390 742 455 709 499 645 _c
543 580 566 486 566 364 _c
}_e{566 248 538 157 484 89 _c
429 21 356 -13 264 -13 _c
239 -13 214 -10 189 -6 _c
163 -2 137 5 110 15 _c
306 324 _m
350 324 385 339 411 369 _c
437 399 450 441 450 494 _c
450 546 437 588 411 618 _c
385 648 350 664 306 664 _c
262 664 227 648 201 618 _c
175 588 162 546 162 494 _c
162 441 175 399 201 369 _c
227 339 262 324 306 324 _c
_cl}_e}_d
/G{{775 0 56 -13 693 742 _sc
595 104 _m
595 300 _l
434 300 _l
434 381 _l
693 381 _l
693 68 _l
655 40 613 20 567 7 _c
521 -6 472 -13 420 -13 _c
306 -13 216 20 152 86 _c
88 152 56 245 56 364 _c
56 482 88 575 152 642 _c
216 708 306 742 420 742 _c
467 742 512 736 555 724 _c
598 712 638 695 674 673 _c
674 568 _l
637 598 598 621 557 637 _c
516 653 473 661 428 661 _c
}_e{338 661 271 636 227 586 _c
182 536 160 462 160 364 _c
160 265 182 191 227 141 _c
271 91 338 67 428 67 _c
462 67 493 70 521 76 _c
549 82 573 91 595 104 _c
_cl}_e}_d
/M{863 0 98 0 765 729 _sc
98 729 _m
245 729 _l
431 233 _l
618 729 _l
765 729 _l
765 0 _l
669 0 _l
669 640 _l
481 140 _l
382 140 _l
194 640 _l
194 0 _l
98 0 _l
98 729 _l
_cl}_d
/P{603 0 98 0 569 729 _sc
197 648 _m
197 374 _l
321 374 _l
367 374 402 385 427 409 _c
452 433 465 467 465 511 _c
465 555 452 588 427 612 _c
402 636 367 648 321 648 _c
197 648 _l
98 729 _m
321 729 _l
402 729 464 710 506 673 _c
548 636 569 582 569 511 _c
569 439 548 384 506 348 _c
464 311 402 293 321 293 _c
197 293 _l
197 0 _l
98 0 _l
98 729 _l
_cl}_d
/U{732 0 87 -13 645 729 _sc
87 729 _m
186 729 _l
186 286 _l
186 208 200 151 228 117 _c
256 83 302 66 366 66 _c
429 66 475 83 503 117 _c
531 151 546 208 546 286 _c
546 729 _l
645 729 _l
645 274 _l
645 178 621 107 574 59 _c
527 11 458 -13 366 -13 _c
274 -13 204 11 157 59 _c
110 107 87 178 87 274 _c
87 729 _l
_cl}_d
/a{{613 0 60 -13 522 560 _sc
343 275 _m
270 275 220 266 192 250 _c
164 233 150 205 150 165 _c
150 133 160 107 181 89 _c
202 70 231 61 267 61 _c
317 61 357 78 387 114 _c
417 149 432 196 432 255 _c
432 275 _l
343 275 _l
522 312 _m
522 0 _l
432 0 _l
432 83 _l
411 49 385 25 355 10 _c
325 -5 287 -13 243 -13 _c
187 -13 142 2 109 33 _c
76 64 60 106 60 159 _c
}_e{60 220 80 266 122 298 _c
163 329 224 345 306 345 _c
432 345 _l
432 354 _l
432 395 418 427 391 450 _c
364 472 326 484 277 484 _c
245 484 215 480 185 472 _c
155 464 127 453 100 439 _c
100 522 _l
132 534 164 544 195 550 _c
226 556 256 560 286 560 _c
365 560 424 539 463 498 _c
502 457 522 395 522 312 _c
_cl}_e}_d
/b{{635 0 91 -13 580 760 _sc
487 273 _m
487 339 473 390 446 428 _c
418 466 381 485 334 485 _c
286 485 249 466 222 428 _c
194 390 181 339 181 273 _c
181 207 194 155 222 117 _c
249 79 286 61 334 61 _c
381 61 418 79 446 117 _c
473 155 487 207 487 273 _c
181 464 _m
199 496 223 520 252 536 _c
281 552 316 560 356 560 _c
422 560 476 533 518 481 _c
559 428 580 359 580 273 _c
}_e{580 187 559 117 518 65 _c
476 13 422 -13 356 -13 _c
316 -13 281 -5 252 10 _c
223 25 199 49 181 82 _c
181 0 _l
91 0 _l
91 760 _l
181 760 _l
181 464 _l
_cl}_e}_d
/c{{550 0 55 -13 488 560 _sc
488 526 _m
488 442 _l
462 456 437 466 411 473 _c
385 480 360 484 334 484 _c
276 484 230 465 198 428 _c
166 391 150 339 150 273 _c
150 206 166 154 198 117 _c
230 80 276 62 334 62 _c
360 62 385 65 411 72 _c
437 79 462 90 488 104 _c
488 21 _l
462 9 436 0 410 -5 _c
383 -10 354 -13 324 -13 _c
242 -13 176 12 128 64 _c
}_e{79 115 55 185 55 273 _c
55 362 79 432 128 483 _c
177 534 244 560 330 560 _c
358 560 385 557 411 551 _c
437 545 463 537 488 526 _c
_cl}_e}_d
/d{{635 0 55 -13 544 760 _sc
454 464 _m
454 760 _l
544 760 _l
544 0 _l
454 0 _l
454 82 _l
435 49 411 25 382 10 _c
353 -5 319 -13 279 -13 _c
213 -13 159 13 117 65 _c
75 117 55 187 55 273 _c
55 359 75 428 117 481 _c
159 533 213 560 279 560 _c
319 560 353 552 382 536 _c
411 520 435 496 454 464 _c
148 273 _m
148 207 161 155 188 117 _c
215 79 253 61 301 61 _c
}_e{348 61 385 79 413 117 _c
440 155 454 207 454 273 _c
454 339 440 390 413 428 _c
385 466 348 485 301 485 _c
253 485 215 466 188 428 _c
161 390 148 339 148 273 _c
_cl}_e}_d
/g{{635 0 55 -207 544 560 _sc
454 280 _m
454 344 440 395 414 431 _c
387 467 349 485 301 485 _c
253 485 215 467 188 431 _c
161 395 148 344 148 280 _c
148 215 161 165 188 129 _c
215 93 253 75 301 75 _c
349 75 387 93 414 129 _c
440 165 454 215 454 280 _c
544 68 _m
544 -24 523 -93 482 -139 _c
440 -184 377 -207 292 -207 _c
260 -207 231 -204 203 -200 _c
175 -195 147 -188 121 -178 _c
}_e{121 -91 _l
147 -105 173 -115 199 -122 _c
225 -129 251 -133 278 -133 _c
336 -133 380 -117 410 -87 _c
439 -56 454 -10 454 52 _c
454 96 _l
435 64 411 40 382 24 _c
353 8 319 0 279 0 _c
211 0 157 25 116 76 _c
75 127 55 195 55 280 _c
55 364 75 432 116 483 _c
157 534 211 560 279 560 _c
319 560 353 552 382 536 _c
411 520 435 496 454 464 _c
454 547 _l
544 547 _l
}_e{544 68 _l
_cl}_e}_d
/i{278 0 94 0 184 760 _sc
94 547 _m
184 547 _l
184 0 _l
94 0 _l
94 547 _l
94 760 _m
184 760 _l
184 646 _l
94 646 _l
94 760 _l
_cl}_d
/l{278 0 94 0 184 760 _sc
94 760 _m
184 760 _l
184 0 _l
94 0 _l
94 760 _l
_cl}_d
/n{634 0 91 0 549 560 _sc
549 330 _m
549 0 _l
459 0 _l
459 327 _l
459 379 448 417 428 443 _c
408 469 378 482 338 482 _c
289 482 251 466 223 435 _c
195 404 181 362 181 309 _c
181 0 _l
91 0 _l
91 547 _l
181 547 _l
181 462 _l
202 494 227 519 257 535 _c
286 551 320 560 358 560 _c
420 560 468 540 500 501 _c
532 462 549 405 549 330 _c
_cl}_d
/o{612 0 55 -13 557 560 _sc
306 484 _m
258 484 220 465 192 427 _c
164 389 150 338 150 273 _c
150 207 163 156 191 118 _c
219 80 257 62 306 62 _c
354 62 392 80 420 118 _c
448 156 462 207 462 273 _c
462 337 448 389 420 427 _c
392 465 354 484 306 484 _c
306 560 _m
384 560 445 534 490 484 _c
534 433 557 363 557 273 _c
557 183 534 113 490 63 _c
445 12 384 -13 306 -13 _c
227 -13 165 12 121 63 _c
77 113 55 183 55 273 _c
55 363 77 433 121 484 _c
165 534 227 560 306 560 _c
_cl}_d
/p{{635 0 91 -207 580 560 _sc
181 82 _m
181 -207 _l
91 -207 _l
91 547 _l
181 547 _l
181 464 _l
199 496 223 520 252 536 _c
281 552 316 560 356 560 _c
422 560 476 533 518 481 _c
559 428 580 359 580 273 _c
580 187 559 117 518 65 _c
476 13 422 -13 356 -13 _c
316 -13 281 -5 252 10 _c
223 25 199 49 181 82 _c
487 273 _m
487 339 473 390 446 428 _c
418 466 381 485 334 485 _c
}_e{286 485 249 466 222 428 _c
194 390 181 339 181 273 _c
181 207 194 155 222 117 _c
249 79 286 61 334 61 _c
381 61 418 79 446 117 _c
473 155 487 207 487 273 _c
_cl}_e}_d
/r{411 0 91 0 411 560 _sc
411 463 _m
401 469 390 473 378 476 _c
366 478 353 480 339 480 _c
288 480 249 463 222 430 _c
194 397 181 350 181 288 _c
181 0 _l
91 0 _l
91 547 _l
181 547 _l
181 462 _l
199 495 224 520 254 536 _c
284 552 321 560 365 560 _c
371 560 378 559 386 559 _c
393 558 401 557 411 555 _c
411 463 _l
_cl}_d
/s{{521 0 54 -13 472 560 _sc
443 531 _m
443 446 _l
417 458 391 468 364 475 _c
336 481 308 485 279 485 _c
234 485 200 478 178 464 _c
156 450 145 430 145 403 _c
145 382 153 366 169 354 _c
185 342 217 330 265 320 _c
296 313 _l
360 299 405 279 432 255 _c
458 230 472 195 472 151 _c
472 100 452 60 412 31 _c
372 1 316 -13 246 -13 _c
216 -13 186 -10 154 -5 _c
}_e{122 0 89 8 54 20 _c
54 113 _l
87 95 120 82 152 74 _c
184 65 216 61 248 61 _c
290 61 323 68 346 82 _c
368 96 380 117 380 144 _c
380 168 371 187 355 200 _c
339 213 303 226 247 238 _c
216 245 _l
160 257 119 275 95 299 _c
70 323 58 356 58 399 _c
58 450 76 490 112 518 _c
148 546 200 560 268 560 _c
301 560 332 557 362 552 _c
391 547 418 540 443 531 _c
}_e{_cl}_e}_d
/x{592 0 29 0 559 547 _sc
549 547 _m
351 281 _l
559 0 _l
453 0 _l
294 215 _l
135 0 _l
29 0 _l
241 286 _l
47 547 _l
153 547 _l
298 352 _l
443 547 _l
549 547 _l
_cl}_d
/y{592 0 30 -207 562 547 _sc
322 -50 _m
296 -114 271 -157 247 -177 _c
223 -197 191 -207 151 -207 _c
79 -207 _l
79 -132 _l
132 -132 _l
156 -132 175 -126 189 -114 _c
203 -102 218 -75 235 -31 _c
251 9 _l
30 547 _l
125 547 _l
296 119 _l
467 547 _l
562 547 _l
322 -50 _l
_cl}_d
/z{525 0 43 0 482 547 _sc
55 547 _m
482 547 _l
482 465 _l
144 72 _l
482 72 _l
482 0 _l
43 0 _l
43 82 _l
381 475 _l
55 475 _l
55 547 _l
_cl}_d
/minus{838 0 106 272 732 355 _sc
106 355 _m
732 355 _l
732 272 _l
106 272 _l
106 355 _l
_cl}_d
end readonly def

/BuildGlyph
 {exch begin
 CharStrings exch
 2 copy known not{pop /.notdef}if
 true 3 1 roll get exec
 end}_d

/BuildChar {
 1 index /Encoding get exch get
 1 index /BuildGlyph get exec
}_d

FontName currentdict end definefont pop
end
%%EndProlog
mpldict begin
7.2 162 translate
597.6 468 0 0 clipbox
gsave
0 0 m
597.6 0 l
597.6 468 l
0 468 l
cl
1.000 setgray
fill
grestore
gsave
74.7 248.04 m
285.218182 248.04 l
285.218182 411.84 l
74.7 411.84 l
cl
1.000 setgray
fill
grestore
0.800 setlinewidth
1 setlinejoin
0 setlinecap
[] 0 setdash
0.000 setgray
gsave
/o {
gsave
newpath
translate
0.8 setlinewidth
1 setlinejoin
0 setlinecap
0 0 m
0 -3.5 l

gsave
0.000 setgray
fill
grestore
stroke
grestore
} bind def
82.3359 248.04 o
grestore
/DejaVuSans findfont
10.000 scalefont
setfont
gsave
79.156188 233.446250 translate
0.000000 rotate
0.000000 0.000000 m /zero glyphshow
grestore
gsave
/o {
gsave
newpath
translate
0.8 setlinewidth
1 setlinejoin
0 setlinecap
0 0 m
0 -3.5 l

gsave
0.000 setgray
fill
grestore
stroke
grestore
} bind def
120.999 248.04 o
grestore
gsave
114.639160 233.446250 translate
0.000000 rotate
0.000000 0.000000 m /two glyphshow
6.362305 0.000000 m /zero glyphshow
grestore
gsave
/o {
gsave
newpath
translate
0.8 setlinewidth
1 setlinejoin
0 setlinecap
0 0 m
0 -3.5 l

gsave
0.000 setgray
fill
grestore
stroke
grestore
} bind def
159.661 248.04 o
grestore
gsave
153.301820 233.446250 translate
0.000000 rotate
0.000000 0.000000 m /four glyphshow
6.362305 0.000000 m /zero glyphshow
grestore
gsave
/o {
gsave
newpath
translate
0.8 setlinewidth
1 setlinejoin
0 setlinecap
0 0 m
0 -3.5 l

gsave
0.000 setgray
fill
grestore
stroke
grestore
} bind def
198.324 248.04 o
grestore
gsave
191.964479 233.446250 translate
0.000000 rotate
0.000000 0.000000 m /six glyphshow
6.362305 0.000000 m /zero glyphshow
grestore
gsave
/o {
gsave
newpath
translate
0.8 setlinewidth
1 setlinejoin
0 setlinecap
0 0 m
0 -3.5 l

gsave
0.000 setgray
fill
grestore
stroke
grestore
} bind def
236.987 248.04 o
grestore
gsave
230.627139 233.446250 translate
0.000000 rotate
0.000000 0.000000 m /eight glyphshow
6.362305 0.000000 m /zero glyphshow
grestore
gsave
/o {
gsave
newpath
translate
0.8 setlinewidth
1 setlinejoin
0 setlinecap
0 0 m
0 -3.5 l

gsave
0.000 setgray
fill
grestore
stroke
grestore
} bind def
275.649 248.04 o
grestore
gsave
266.110111 233.446250 translate
0.000000 rotate
0.000000 0.000000 m /one glyphshow
6.362305 0.000000 m /zero glyphshow
12.724609 0.000000 m /zero glyphshow
grestore
gsave
/o {
gsave
newpath
translate
0.8 setlinewidth
1 setlinejoin
0 setlinecap
0 0 m
-3.5 0 l

gsave
0.000 setgray
fill
grestore
stroke
grestore
} bind def
74.7 270.193 o
grestore
gsave
40.246875 266.395650 translate
0.000000 rotate
0.000000 0.000000 m /minus glyphshow
8.378906 0.000000 m /eight glyphshow
14.741211 0.000000 m /four glyphshow
21.103516 0.000000 m /zero glyphshow
grestore
gsave
/o {
gsave
newpath
translate
0.8 setlinewidth
1 setlinejoin
0 setlinecap
0 0 m
-3.5 0 l

gsave
0.000 setgray
fill
grestore
stroke
grestore
} bind def
74.7 306.96 o
grestore
gsave
40.246875 303.163327 translate
0.000000 rotate
0.000000 0.000000 m /minus glyphshow
8.378906 0.000000 m /eight glyphshow
14.741211 0.000000 m /two glyphshow
21.103516 0.000000 m /zero glyphshow
grestore
gsave
/o {
gsave
newpath
translate
0.8 setlinewidth
1 setlinejoin
0 setlinecap
0 0 m
-3.5 0 l

gsave
0.000 setgray
fill
grestore
stroke
grestore
} bind def
74.7 343.728 o
grestore
gsave
40.246875 339.931004 translate
0.000000 rotate
0.000000 0.000000 m /minus glyphshow
8.378906 0.000000 m /eight glyphshow
14.741211 0.000000 m /zero glyphshow
21.103516 0.000000 m /zero glyphshow
grestore
gsave
/o {
gsave
newpath
translate
0.8 setlinewidth
1 setlinejoin
0 setlinecap
0 0 m
-3.5 0 l

gsave
0.000 setgray
fill
grestore
stroke
grestore
} bind def
74.7 380.496 o
grestore
gsave
40.246875 376.698681 translate
0.000000 rotate
0.000000 0.000000 m /minus glyphshow
8.378906 0.000000 m /seven glyphshow
14.741211 0.000000 m /eight glyphshow
21.103516 0.000000 m /zero glyphshow
grestore
1.500 setlinewidth
2 setlinecap
0.122 0.467 0.706 setrgbcolor
gsave
210.5 163.8 74.7 248 clipbox
84.269008 323.505657 m
86.202141 316.152121 l
88.135274 347.404646 l
90.068407 290.414747 l
92.00154 295.929899 l
93.934673 319.828889 l
95.867806 345.566263 l
97.800939 272.030909 l
99.734072 330.859192 l
101.667205 336.374343 l
103.600338 297.768283 l
105.533471 306.960202 l
107.466604 279.384444 l
109.399737 338.212727 l
111.33287 281.222828 l
113.266003 284.899596 l
115.199136 312.475354 l
117.132269 288.576364 l
119.065402 336.374343 l
120.998535 314.313737 l
122.931668 351.081414 l
124.864801 301.445051 l
126.797934 288.576364 l
128.731067 340.051111 l
130.6642 292.253131 l
132.597333 290.414747 l
134.530466 301.445051 l
136.463599 295.929899 l
138.396732 281.222828 l
140.329865 266.515758 l
142.262998 308.798586 l
144.196131 264.677374 l
146.129264 317.990505 l
148.062397 284.899596 l
149.99553 330.859192 l
151.928663 303.283434 l
153.861796 286.73798 l
155.794929 330.859192 l
157.728062 332.697576 l
159.661195 345.566263 l
161.594328 312.475354 l
163.527461 306.960202 l
165.460594 301.445051 l
167.393727 327.182424 l
169.32686 305.121818 l
171.259992 294.091515 l
173.193125 345.566263 l
175.126258 358.434949 l
177.059391 264.677374 l
178.992524 306.960202 l
180.925657 273.869293 l
182.85879 292.253131 l
184.791923 327.182424 l
186.725056 321.667273 l
188.658189 321.667273 l
190.591322 319.828889 l
192.524455 329.020808 l
194.457588 314.313737 l
196.390721 294.091515 l
198.323854 312.475354 l
200.256987 255.485455 l
202.19012 349.24303 l
204.123253 316.152121 l
206.056386 378.657172 l
207.989519 288.576364 l
209.922652 380.495556 l
211.855785 305.121818 l
213.788918 277.546061 l
215.722051 341.889495 l
217.655184 310.63697 l
219.588317 281.222828 l
221.52145 284.899596 l
223.454583 306.960202 l
225.387716 330.859192 l
227.320849 284.899596 l
229.253982 330.859192 l
231.187115 323.505657 l
233.120248 312.475354 l
235.053381 345.566263 l
236.986514 340.051111 l
238.919647 314.313737 l
240.85278 334.53596 l
242.785913 404.394545 l
244.719046 332.697576 l
246.652179 330.859192 l
248.585312 347.404646 l
250.518445 290.414747 l
252.451578 362.111717 l
254.384711 314.313737 l
256.317844 329.020808 l
258.250977 338.212727 l
260.18411 299.606667 l
262.117243 340.051111 l
264.050376 325.34404 l
265.983509 303.283434 l
267.916642 332.697576 l
269.849775 321.667273 l
271.782908 312.475354 l
273.716041 343.727879 l
275.649174 286.73798 l
stroke
grestore
0.800 setlinewidth
0 setlinejoin
[] 0 setdash
0.000 setgray
gsave
74.7 248.04 m
74.7 411.84 l
stroke
grestore
gsave
285.218182 248.04 m
285.218182 411.84 l
stroke
grestore
gsave
74.7 248.04 m
285.218182 248.04 l
stroke
grestore
gsave
74.7 411.84 m
285.218182 411.84 l
stroke
grestore
/DejaVuSans findfont
12.000 scalefont
setfont
gsave
172.591903 417.840000 translate
0.000000 rotate
0.000000 0.000000 m /g glyphshow
7.617188 0.000000 m /x glyphshow
grestore
gsave
327.321818 248.04 m
537.84 248.04 l
537.84 411.84 l
327.321818 411.84 l
cl
1.000 setgray
fill
grestore
1 setlinejoin
0 setlinecap
[] 0 setdash
gsave
/o {
gsave
newpath
translate
0.8 setlinewidth
1 setlinejoin
0 setlinecap
0 0 m
0 -3.5 l

gsave
0.000 setgray
fill
grestore
stroke
grestore
} bind def
334.958 248.04 o
grestore
/DejaVuSans findfont
10.000 scalefont
setfont
gsave
331.778006 233.446250 translate
0.000000 rotate
0.000000 0.000000 m /zero glyphshow
grestore
gsave
/o {
gsave
newpath
translate
0.8 setlinewidth
1 setlinejoin
0 setlinecap
0 0 m
0 -3.5 l

gsave
0.000 setgray
fill
grestore
stroke
grestore
} bind def
373.62 248.04 o
grestore
gsave
367.260978 233.446250 translate
0.000000 rotate
0.000000 0.000000 m /two glyphshow
6.362305 0.000000 m /zero glyphshow
grestore
gsave
/o {
gsave
newpath
translate
0.8 setlinewidth
1 setlinejoin
0 setlinecap
0 0 m
0 -3.5 l

gsave
0.000 setgray
fill
grestore
stroke
grestore
} bind def
412.283 248.04 o
grestore
gsave
405.923638 233.446250 translate
0.000000 rotate
0.000000 0.000000 m /four glyphshow
6.362305 0.000000 m /zero glyphshow
grestore
gsave
/o {
gsave
newpath
translate
0.8 setlinewidth
1 setlinejoin
0 setlinecap
0 0 m
0 -3.5 l

gsave
0.000 setgray
fill
grestore
stroke
grestore
} bind def
450.946 248.04 o
grestore
gsave
444.586297 233.446250 translate
0.000000 rotate
0.000000 0.000000 m /six glyphshow
6.362305 0.000000 m /zero glyphshow
grestore
gsave
/o {
gsave
newpath
translate
0.8 setlinewidth
1 setlinejoin
0 setlinecap
0 0 m
0 -3.5 l

gsave
0.000 setgray
fill
grestore
stroke
grestore
} bind def
489.608 248.04 o
grestore
gsave
483.248957 233.446250 translate
0.000000 rotate
0.000000 0.000000 m /eight glyphshow
6.362305 0.000000 m /zero glyphshow
grestore
gsave
/o {
gsave
newpath
translate
0.8 setlinewidth
1 setlinejoin
0 setlinecap
0 0 m
0 -3.5 l

gsave
0.000 setgray
fill
grestore
stroke
grestore
} bind def
528.271 248.04 o
grestore
gsave
518.731929 233.446250 translate
0.000000 rotate
0.000000 0.000000 m /one glyphshow
6.362305 0.000000 m /zero glyphshow
12.724609 0.000000 m /zero glyphshow
grestore
gsave
/o {
gsave
newpath
translate
0.8 setlinewidth
1 setlinejoin
0 setlinecap
0 0 m
-3.5 0 l

gsave
0.000 setgray
fill
grestore
stroke
grestore
} bind def
327.322 263.463 o
grestore
gsave
301.243693 259.665852 translate
0.000000 rotate
0.000000 0.000000 m /two glyphshow
6.362305 0.000000 m /eight glyphshow
12.724609 0.000000 m /zero glyphshow
grestore
gsave
/o {
gsave
newpath
translate
0.8 setlinewidth
1 setlinejoin
0 setlinecap
0 0 m
-3.5 0 l

gsave
0.000 setgray
fill
grestore
stroke
grestore
} bind def
327.322 290.054 o
grestore
gsave
301.243693 286.256761 translate
0.000000 rotate
0.000000 0.000000 m /three glyphshow
6.362305 0.000000 m /zero glyphshow
12.724609 0.000000 m /zero glyphshow
grestore
gsave
/o {
gsave
newpath
translate
0.8 setlinewidth
1 setlinejoin
0 setlinecap
0 0 m
-3.5 0 l

gsave
0.000 setgray
fill
grestore
stroke
grestore
} bind def
327.322 316.645 o
grestore
gsave
301.243693 312.847670 translate
0.000000 rotate
0.000000 0.000000 m /three glyphshow
6.362305 0.000000 m /two glyphshow
12.724609 0.000000 m /zero glyphshow
grestore
gsave
/o {
gsave
newpath
translate
0.8 setlinewidth
1 setlinejoin
0 setlinecap
0 0 m
-3.5 0 l

gsave
0.000 setgray
fill
grestore
stroke
grestore
} bind def
327.322 343.235 o
grestore
gsave
301.243693 339.438580 translate
0.000000 rotate
0.000000 0.000000 m /three glyphshow
6.362305 0.000000 m /four glyphshow
12.724609 0.000000 m /zero glyphshow
grestore
gsave
/o {
gsave
newpath
translate
0.8 setlinewidth
1 setlinejoin
0 setlinecap
0 0 m
-3.5 0 l

gsave
0.000 setgray
fill
grestore
stroke
grestore
} bind def
327.322 369.826 o
grestore
gsave
301.243693 366.029489 translate
0.000000 rotate
0.000000 0.000000 m /three glyphshow
6.362305 0.000000 m /six glyphshow
12.724609 0.000000 m /zero glyphshow
grestore
gsave
/o {
gsave
newpath
translate
0.8 setlinewidth
1 setlinejoin
0 setlinecap
0 0 m
-3.5 0 l

gsave
0.000 setgray
fill
grestore
stroke
grestore
} bind def
327.322 396.417 o
grestore
gsave
301.243693 392.620398 translate
0.000000 rotate
0.000000 0.000000 m /three glyphshow
6.362305 0.000000 m /eight glyphshow
12.724609 0.000000 m /zero glyphshow
grestore
1.500 setlinewidth
2 setlinecap
0.122 0.467 0.706 setrgbcolor
gsave
210.5 163.8 327.3 248 clipbox
336.890826 325.951364 m
338.823959 284.735455 l
340.757092 255.485455 l
342.690225 329.94 l
344.623358 351.212727 l
346.556491 327.280909 l
348.489624 307.337727 l
350.422757 328.610455 l
352.35589 308.667273 l
354.289023 348.553636 l
356.222156 327.280909 l
358.155289 263.462727 l
360.088422 404.394545 l
362.021555 361.849091 l
363.954688 313.985455 l
365.887821 369.826364 l
367.820954 328.610455 l
369.754087 348.553636 l
371.68722 343.235455 l
373.620353 351.212727 l
375.553486 347.224091 l
377.486619 295.371818 l
379.419752 296.701364 l
381.352885 307.337727 l
383.286018 328.610455 l
385.219151 371.155909 l
387.152284 284.735455 l
389.085417 327.280909 l
391.01855 335.258182 l
392.951683 309.996818 l
394.884816 355.201364 l
396.817949 364.508182 l
398.751082 320.633182 l
400.684215 371.155909 l
402.617348 348.553636 l
404.550481 343.235455 l
406.483614 348.553636 l
408.416747 316.644545 l
410.34988 327.280909 l
412.283013 333.928636 l
414.216146 332.599091 l
416.149279 328.610455 l
418.082412 296.701364 l
420.015545 315.315 l
421.948678 333.928636 l
423.881811 311.326364 l
425.814944 351.212727 l
427.748077 365.837727 l
429.68121 309.996818 l
431.614343 329.94 l
433.547476 341.905909 l
435.480609 357.860455 l
437.413742 320.633182 l
439.346875 312.655909 l
441.280008 327.280909 l
443.21314 308.667273 l
445.146273 351.212727 l
447.079406 288.724091 l
449.012539 294.042273 l
450.945672 303.349091 l
452.878805 331.269545 l
454.811938 329.94 l
456.745071 308.667273 l
458.678204 324.621818 l
460.611337 377.803636 l
462.54447 313.985455 l
464.477603 325.951364 l
466.410736 327.280909 l
468.343869 321.962727 l
470.277002 351.212727 l
472.210135 335.258182 l
474.143268 367.167273 l
476.076401 373.815 l
478.009534 339.246818 l
479.942667 348.553636 l
481.8758 356.530909 l
483.808933 328.610455 l
485.742066 344.565 l
487.675199 320.633182 l
489.608332 309.996818 l
491.541465 307.337727 l
493.474598 266.121818 l
495.407731 321.962727 l
497.340864 304.678636 l
499.273997 355.201364 l
501.20713 319.303636 l
503.140263 304.678636 l
505.073396 337.917273 l
507.006529 355.201364 l
508.939662 356.530909 l
510.872795 355.201364 l
512.805928 352.542273 l
514.739061 341.905909 l
516.672194 332.599091 l
518.605327 287.394545 l
520.53846 324.621818 l
522.471593 364.508182 l
524.404726 308.667273 l
526.337859 355.201364 l
528.270992 327.280909 l
stroke
grestore
0.800 setlinewidth
0 setlinejoin
[] 0 setdash
0.000 setgray
gsave
327.321818 248.04 m
327.321818 411.84 l
stroke
grestore
gsave
537.84 248.04 m
537.84 411.84 l
stroke
grestore
gsave
327.321818 248.04 m
537.84 248.04 l
stroke
grestore
gsave
327.321818 411.84 m
537.84 411.84 l
stroke
grestore
/DejaVuSans findfont
12.000 scalefont
setfont
gsave
425.213722 417.840000 translate
0.000000 rotate
0.000000 0.000000 m /g glyphshow
7.617188 0.000000 m /y glyphshow
grestore
gsave
74.7 51.48 m
285.218182 51.48 l
285.218182 215.28 l
74.7 215.28 l
cl
1.000 setgray
fill
grestore
1 setlinejoin
0 setlinecap
[] 0 setdash
gsave
/o {
gsave
newpath
translate
0.8 setlinewidth
1 setlinejoin
0 setlinecap
0 0 m
0 -3.5 l

gsave
0.000 setgray
fill
grestore
stroke
grestore
} bind def
82.3359 51.48 o
grestore
/DejaVuSans findfont
10.000 scalefont
setfont
gsave
79.156188 36.886250 translate
0.000000 rotate
0.000000 0.000000 m /zero glyphshow
grestore
gsave
/o {
gsave
newpath
translate
0.8 setlinewidth
1 setlinejoin
0 setlinecap
0 0 m
0 -3.5 l

gsave
0.000 setgray
fill
grestore
stroke
grestore
} bind def
120.999 51.48 o
grestore
gsave
114.639160 36.886250 translate
0.000000 rotate
0.000000 0.000000 m /two glyphshow
6.362305 0.000000 m /zero glyphshow
grestore
gsave
/o {
gsave
newpath
translate
0.8 setlinewidth
1 setlinejoin
0 setlinecap
0 0 m
0 -3.5 l

gsave
0.000 setgray
fill
grestore
stroke
grestore
} bind def
159.661 51.48 o
grestore
gsave
153.301820 36.886250 translate
0.000000 rotate
0.000000 0.000000 m /four glyphshow
6.362305 0.000000 m /zero glyphshow
grestore
gsave
/o {
gsave
newpath
translate
0.8 setlinewidth
1 setlinejoin
0 setlinecap
0 0 m
0 -3.5 l

gsave
0.000 setgray
fill
grestore
stroke
grestore
} bind def
198.324 51.48 o
grestore
gsave
191.964479 36.886250 translate
0.000000 rotate
0.000000 0.000000 m /six glyphshow
6.362305 0.000000 m /zero glyphshow
grestore
gsave
/o {
gsave
newpath
translate
0.8 setlinewidth
1 setlinejoin
0 setlinecap
0 0 m
0 -3.5 l

gsave
0.000 setgray
fill
grestore
stroke
grestore
} bind def
236.987 51.48 o
grestore
gsave
230.627139 36.886250 translate
0.000000 rotate
0.000000 0.000000 m /eight glyphshow
6.362305 0.000000 m /zero glyphshow
grestore
gsave
/o {
gsave
newpath
translate
0.8 setlinewidth
1 setlinejoin
0 setlinecap
0 0 m
0 -3.5 l

gsave
0.000 setgray
fill
grestore
stroke
grestore
} bind def
275.649 51.48 o
grestore
gsave
266.110111 36.886250 translate
0.000000 rotate
0.000000 0.000000 m /one glyphshow
6.362305 0.000000 m /zero glyphshow
12.724609 0.000000 m /zero glyphshow
grestore
gsave
/o {
gsave
newpath
translate
0.8 setlinewidth
1 setlinejoin
0 setlinecap
0 0 m
-3.5 0 l

gsave
0.000 setgray
fill
grestore
stroke
grestore
} bind def
74.7 69.5618 o
grestore
gsave
40.246875 65.764943 translate
0.000000 rotate
0.000000 0.000000 m /minus glyphshow
8.378906 0.000000 m /two glyphshow
14.741211 0.000000 m /three glyphshow
21.103516 0.000000 m /zero glyphshow
grestore
gsave
/o {
gsave
newpath
translate
0.8 setlinewidth
1 setlinejoin
0 setlinecap
0 0 m
-3.5 0 l

gsave
0.000 setgray
fill
grestore
stroke
grestore
} bind def
74.7 90.8345 o
grestore
gsave
40.246875 87.037670 translate
0.000000 rotate
0.000000 0.000000 m /minus glyphshow
8.378906 0.000000 m /two glyphshow
14.741211 0.000000 m /two glyphshow
21.103516 0.000000 m /zero glyphshow
grestore
gsave
/o {
gsave
newpath
translate
0.8 setlinewidth
1 setlinejoin
0 setlinecap
0 0 m
-3.5 0 l

gsave
0.000 setgray
fill
grestore
stroke
grestore
} bind def
74.7 112.107 o
grestore
gsave
40.246875 108.310398 translate
0.000000 rotate
0.000000 0.000000 m /minus glyphshow
8.378906 0.000000 m /two glyphshow
14.741211 0.000000 m /one glyphshow
21.103516 0.000000 m /zero glyphshow
grestore
gsave
/o {
gsave
newpath
translate
0.8 setlinewidth
1 setlinejoin
0 setlinecap
0 0 m
-3.5 0 l

gsave
0.000 setgray
fill
grestore
stroke
grestore
} bind def
74.7 133.38 o
grestore
gsave
40.246875 129.583125 translate
0.000000 rotate
0.000000 0.000000 m /minus glyphshow
8.378906 0.000000 m /two glyphshow
14.741211 0.000000 m /zero glyphshow
21.103516 0.000000 m /zero glyphshow
grestore
gsave
/o {
gsave
newpath
translate
0.8 setlinewidth
1 setlinejoin
0 setlinecap
0 0 m
-3.5 0 l

gsave
0.000 setgray
fill
grestore
stroke
grestore
} bind def
74.7 154.653 o
grestore
gsave
40.246875 150.855852 translate
0.000000 rotate
0.000000 0.000000 m /minus glyphshow
8.378906 0.000000 m /one glyphshow
14.741211 0.000000 m /nine glyphshow
21.103516 0.000000 m /zero glyphshow
grestore
gsave
/o {
gsave
newpath
translate
0.8 setlinewidth
1 setlinejoin
0 setlinecap
0 0 m
-3.5 0 l

gsave
0.000 setgray
fill
grestore
stroke
grestore
} bind def
74.7 175.925 o
grestore
gsave
40.246875 172.128580 translate
0.000000 rotate
0.000000 0.000000 m /minus glyphshow
8.378906 0.000000 m /one glyphshow
14.741211 0.000000 m /eight glyphshow
21.103516 0.000000 m /zero glyphshow
grestore
gsave
/o {
gsave
newpath
translate
0.8 setlinewidth
1 setlinejoin
0 setlinecap
0 0 m
-3.5 0 l

gsave
0.000 setgray
fill
grestore
stroke
grestore
} bind def
74.7 197.198 o
grestore
gsave
40.246875 193.401307 translate
0.000000 rotate
0.000000 0.000000 m /minus glyphshow
8.378906 0.000000 m /one glyphshow
14.741211 0.000000 m /seven glyphshow
21.103516 0.000000 m /zero glyphshow
grestore
1.500 setlinewidth
2 setlinecap
0.122 0.467 0.706 setrgbcolor
gsave
210.5 163.8 74.7 51.48 clipbox
84.269008 65.307273 m
86.202141 118.489091 l
88.135274 135.507273 l
90.068407 146.143636 l
92.00154 114.234545 l
93.934673 112.107273 l
95.867806 167.416364 l
97.800939 188.689091 l
99.734072 133.38 l
101.667205 165.289091 l
103.600338 92.961818 l
105.533471 133.38 l
107.466604 152.525455 l
109.399737 95.089091 l
111.33287 120.616364 l
113.266003 131.252727 l
115.199136 144.016364 l
117.132269 135.507273 l
119.065402 137.634545 l
120.998535 156.78 l
122.931668 146.143636 l
124.864801 124.870909 l
126.797934 182.307273 l
128.731067 175.925455 l
130.6642 175.925455 l
132.597333 124.870909 l
134.530466 195.070909 l
136.463599 163.161818 l
138.396732 199.325455 l
140.329865 178.052727 l
142.262998 180.18 l
144.196131 152.525455 l
146.129264 131.252727 l
148.062397 122.743636 l
149.99553 107.852727 l
151.928663 90.834545 l
153.861796 86.58 l
155.794929 152.525455 l
157.728062 129.125455 l
159.661195 141.889091 l
161.594328 169.543636 l
163.527461 122.743636 l
165.460594 120.616364 l
167.393727 163.161818 l
169.32686 152.525455 l
171.259992 124.870909 l
173.193125 141.889091 l
175.126258 152.525455 l
177.059391 152.525455 l
178.992524 139.761818 l
180.925657 190.816364 l
182.85879 150.398182 l
184.791923 122.743636 l
186.725056 144.016364 l
188.658189 109.98 l
190.591322 103.598182 l
192.524455 144.016364 l
194.457588 103.598182 l
196.390721 116.361818 l
198.323854 137.634545 l
200.256987 156.78 l
202.19012 207.834545 l
204.123253 144.016364 l
206.056386 186.561818 l
207.989519 146.143636 l
209.922652 190.816364 l
211.855785 163.161818 l
213.788918 203.58 l
215.722051 150.398182 l
217.655184 188.689091 l
219.588317 148.270909 l
221.52145 144.016364 l
223.454583 109.98 l
225.387716 101.470909 l
227.320849 101.470909 l
229.253982 103.598182 l
231.187115 129.125455 l
233.120248 120.616364 l
235.053381 103.598182 l
236.986514 129.125455 l
238.919647 154.652727 l
240.85278 180.18 l
242.785913 144.016364 l
244.719046 161.034545 l
246.652179 122.743636 l
248.585312 173.798182 l
250.518445 133.38 l
252.451578 173.798182 l
254.384711 199.325455 l
256.317844 144.016364 l
258.250977 148.270909 l
260.18411 137.634545 l
262.117243 103.598182 l
264.050376 105.725455 l
265.983509 148.270909 l
267.916642 78.070909 l
269.849775 109.98 l
271.782908 58.925455 l
273.716041 114.234545 l
275.649174 112.107273 l
stroke
grestore
0.800 setlinewidth
0 setlinejoin
[] 0 setdash
0.000 setgray
gsave
74.7 51.48 m
74.7 215.28 l
stroke
grestore
gsave
285.218182 51.48 m
285.218182 215.28 l
stroke
grestore
gsave
74.7 51.48 m
285.218182 51.48 l
stroke
grestore
gsave
74.7 215.28 m
285.218182 215.28 l
stroke
grestore
/DejaVuSans findfont
12.000 scalefont
setfont
gsave
172.998153 221.280000 translate
0.000000 rotate
0.000000 0.000000 m /g glyphshow
7.617188 0.000000 m /z glyphshow
grestore
gsave
327.321818 51.48 m
537.84 51.48 l
537.84 215.28 l
327.321818 215.28 l
cl
1.000 setgray
fill
grestore
1 setlinejoin
0 setlinecap
[] 0 setdash
gsave
/o {
gsave
newpath
translate
0.8 setlinewidth
1 setlinejoin
0 setlinecap
0 0 m
0 -3.5 l

gsave
0.000 setgray
fill
grestore
stroke
grestore
} bind def
334.958 51.48 o
grestore
/DejaVuSans findfont
10.000 scalefont
setfont
gsave
331.778006 36.886250 translate
0.000000 rotate
0.000000 0.000000 m /zero glyphshow
grestore
gsave
/o {
gsave
newpath
translate
0.8 setlinewidth
1 setlinejoin
0 setlinecap
0 0 m
0 -3.5 l

gsave
0.000 setgray
fill
grestore
stroke
grestore
} bind def
373.62 51.48 o
grestore
gsave
367.260978 36.886250 translate
0.000000 rotate
0.000000 0.000000 m /two glyphshow
6.362305 0.000000 m /zero glyphshow
grestore
gsave
/o {
gsave
newpath
translate
0.8 setlinewidth
1 setlinejoin
0 setlinecap
0 0 m
0 -3.5 l

gsave
0.000 setgray
fill
grestore
stroke
grestore
} bind def
412.283 51.48 o
grestore
gsave
405.923638 36.886250 translate
0.000000 rotate
0.000000 0.000000 m /four glyphshow
6.362305 0.000000 m /zero glyphshow
grestore
gsave
/o {
gsave
newpath
translate
0.8 setlinewidth
1 setlinejoin
0 setlinecap
0 0 m
0 -3.5 l

gsave
0.000 setgray
fill
grestore
stroke
grestore
} bind def
450.946 51.48 o
grestore
gsave
444.586297 36.886250 translate
0.000000 rotate
0.000000 0.000000 m /six glyphshow
6.362305 0.000000 m /zero glyphshow
grestore
gsave
/o {
gsave
newpath
translate
0.8 setlinewidth
1 setlinejoin
0 setlinecap
0 0 m
0 -3.5 l

gsave
0.000 setgray
fill
grestore
stroke
grestore
} bind def
489.608 51.48 o
grestore
gsave
483.248957 36.886250 translate
0.000000 rotate
0.000000 0.000000 m /eight glyphshow
6.362305 0.000000 m /zero glyphshow
grestore
gsave
/o {
gsave
newpath
translate
0.8 setlinewidth
1 setlinejoin
0 setlinecap
0 0 m
0 -3.5 l

gsave
0.000 setgray
fill
grestore
stroke
grestore
} bind def
528.271 51.48 o
grestore
gsave
518.731929 36.886250 translate
0.000000 rotate
0.000000 0.000000 m /one glyphshow
6.362305 0.000000 m /zero glyphshow
12.724609 0.000000 m /zero glyphshow
grestore
gsave
/o {
gsave
newpath
translate
0.8 setlinewidth
1 setlinejoin
0 setlinecap
0 0 m
-3.5 0 l

gsave
0.000 setgray
fill
grestore
stroke
grestore
} bind def
327.322 64.7177 o
grestore
gsave
292.868693 60.920829 translate
0.000000 rotate
0.000000 0.000000 m /minus glyphshow
8.378906 0.000000 m /eight glyphshow
14.741211 0.000000 m /zero glyphshow
21.103516 0.000000 m /zero glyphshow
grestore
gsave
/o {
gsave
newpath
translate
0.8 setlinewidth
1 setlinejoin
0 setlinecap
0 0 m
-3.5 0 l

gsave
0.000 setgray
fill
grestore
stroke
grestore
} bind def
327.322 88.8521 o
grestore
gsave
292.868693 85.055204 translate
0.000000 rotate
0.000000 0.000000 m /minus glyphshow
8.378906 0.000000 m /six glyphshow
14.741211 0.000000 m /zero glyphshow
21.103516 0.000000 m /zero glyphshow
grestore
gsave
/o {
gsave
newpath
translate
0.8 setlinewidth
1 setlinejoin
0 setlinecap
0 0 m
-3.5 0 l

gsave
0.000 setgray
fill
grestore
stroke
grestore
} bind def
327.322 112.986 o
grestore
gsave
292.868693 109.189579 translate
0.000000 rotate
0.000000 0.000000 m /minus glyphshow
8.378906 0.000000 m /four glyphshow
14.741211 0.000000 m /zero glyphshow
21.103516 0.000000 m /zero glyphshow
grestore
gsave
/o {
gsave
newpath
translate
0.8 setlinewidth
1 setlinejoin
0 setlinecap
0 0 m
-3.5 0 l

gsave
0.000 setgray
fill
grestore
stroke
grestore
} bind def
327.322 137.121 o
grestore
gsave
292.868693 133.323953 translate
0.000000 rotate
0.000000 0.000000 m /minus glyphshow
8.378906 0.000000 m /two glyphshow
14.741211 0.000000 m /zero glyphshow
21.103516 0.000000 m /zero glyphshow
grestore
gsave
/o {
gsave
newpath
translate
0.8 setlinewidth
1 setlinejoin
0 setlinecap
0 0 m
-3.5 0 l

gsave
0.000 setgray
fill
grestore
stroke
grestore
} bind def
327.322 161.255 o
grestore
gsave
313.962443 157.458328 translate
0.000000 rotate
0.000000 0.000000 m /zero glyphshow
grestore
gsave
/o {
gsave
newpath
translate
0.8 setlinewidth
1 setlinejoin
0 setlinecap
0 0 m
-3.5 0 l

gsave
0.000 setgray
fill
grestore
stroke
grestore
} bind def
327.322 185.39 o
grestore
gsave
301.243693 181.592702 translate
0.000000 rotate
0.000000 0.000000 m /two glyphshow
6.362305 0.000000 m /zero glyphshow
12.724609 0.000000 m /zero glyphshow
grestore
gsave
/o {
gsave
newpath
translate
0.8 setlinewidth
1 setlinejoin
0 setlinecap
0 0 m
-3.5 0 l

gsave
0.000 setgray
fill
grestore
stroke
grestore
} bind def
327.322 209.524 o
grestore
gsave
301.243693 205.727077 translate
0.000000 rotate
0.000000 0.000000 m /four glyphshow
6.362305 0.000000 m /zero glyphshow
12.724609 0.000000 m /zero glyphshow
grestore
1.500 setlinewidth
2 setlinecap
0.122 0.467 0.706 setrgbcolor
gsave
210.5 163.8 327.3 51.48 clipbox
336.890826 63.390314 m
338.823959 62.907626 l
340.757092 64.959048 l
342.690225 61.21822 l
344.623358 61.580236 l
346.556491 63.14897 l
348.489624 64.838376 l
350.422757 60.011501 l
352.35589 63.873001 l
354.289023 64.235017 l
356.222156 61.700908 l
358.155289 62.304267 l
360.088422 60.494189 l
362.021555 64.355689 l
363.954688 60.614861 l
365.887821 60.856205 l
367.820954 62.666283 l
369.754087 61.097548 l
371.68722 64.235017 l
373.620353 62.786954 l
375.553486 65.200392 l
377.486619 61.942251 l
379.419752 61.097548 l
381.352885 64.476361 l
383.286018 61.338892 l
385.219151 61.21822 l
387.152284 61.942251 l
389.085417 61.580236 l
391.01855 60.614861 l
392.951683 59.649486 l
394.884816 62.424939 l
396.817949 59.528814 l
398.751082 63.028298 l
400.684215 60.856205 l
402.617348 63.873001 l
404.550481 62.062923 l
406.483614 60.976876 l
408.416747 63.873001 l
410.34988 63.993673 l
412.283013 64.838376 l
414.216146 62.666283 l
416.149279 62.304267 l
418.082412 61.942251 l
420.015545 63.631658 l
421.948678 62.183595 l
423.881811 61.459564 l
425.814944 64.838376 l
427.748077 65.683079 l
429.68121 59.528814 l
431.614343 62.304267 l
433.547476 60.132173 l
435.480609 61.338892 l
437.413742 63.631658 l
439.346875 63.269642 l
441.280008 63.269642 l
443.21314 63.14897 l
445.146273 63.752329 l
447.079406 62.786954 l
449.012539 61.459564 l
450.945672 62.666283 l
452.878805 58.925455 l
454.811938 65.07972 l
456.745071 62.907626 l
458.678204 67.01047 l
460.611337 61.097548 l
462.54447 67.131142 l
464.477603 62.183595 l
466.410736 60.373517 l
468.343869 64.597033 l
470.277002 62.545611 l
472.210135 60.614861 l
474.143268 60.856205 l
476.076401 62.304267 l
478.009534 63.873001 l
479.942667 60.856205 l
481.8758 63.873001 l
483.808933 63.390314 l
485.742066 62.666283 l
487.675199 64.838376 l
489.608332 64.476361 l
491.541465 62.786954 l
493.474598 64.114345 l
495.407731 68.699876 l
497.340864 63.993673 l
499.273997 63.873001 l
501.20713 64.959048 l
503.140263 61.21822 l
505.073396 65.924423 l
507.006529 62.786954 l
508.939662 63.752329 l
510.872795 64.355689 l
512.805928 61.821579 l
514.739061 64.476361 l
516.672194 63.510986 l
518.605327 62.062923 l
520.53846 63.993673 l
522.471593 63.269642 l
524.404726 62.666283 l
526.337859 64.717704 l
528.270992 60.976876 l
stroke
grestore
1.000 0.498 0.055 setrgbcolor
gsave
210.5 163.8 327.3 51.48 clipbox
336.890826 200.714905 m
338.823959 196.974077 l
340.757092 194.319296 l
342.690225 201.076921 l
344.623358 203.007671 l
346.556491 200.835577 l
348.489624 199.025499 l
350.422757 200.956249 l
352.35589 199.146171 l
354.289023 202.766327 l
356.222156 200.835577 l
358.155289 195.043327 l
360.088422 207.834545 l
362.021555 203.973046 l
363.954688 199.628858 l
365.887821 204.697077 l
367.820954 200.956249 l
369.754087 202.766327 l
371.68722 202.283639 l
373.620353 203.007671 l
375.553486 202.645655 l
377.486619 197.939452 l
379.419752 198.060124 l
381.352885 199.025499 l
383.286018 200.956249 l
385.219151 204.817749 l
387.152284 196.974077 l
389.085417 200.835577 l
391.01855 201.559608 l
392.951683 199.266842 l
394.884816 203.369686 l
396.817949 204.214389 l
398.751082 200.232217 l
400.684215 204.817749 l
402.617348 202.766327 l
404.550481 202.283639 l
406.483614 202.766327 l
408.416747 199.870202 l
410.34988 200.835577 l
412.283013 201.438936 l
414.216146 201.318264 l
416.149279 200.956249 l
418.082412 198.060124 l
420.015545 199.74953 l
421.948678 201.438936 l
423.881811 199.387514 l
425.814944 203.007671 l
427.748077 204.335061 l
429.68121 199.266842 l
431.614343 201.076921 l
433.547476 202.162967 l
435.480609 203.61103 l
437.413742 200.232217 l
439.346875 199.508186 l
441.280008 200.835577 l
443.21314 199.146171 l
445.146273 203.007671 l
447.079406 197.336093 l
449.012539 197.81878 l
450.945672 198.663483 l
452.878805 201.197592 l
454.811938 201.076921 l
456.745071 199.146171 l
458.678204 200.594233 l
460.611337 205.421108 l
462.54447 199.628858 l
464.477603 200.714905 l
466.410736 200.835577 l
468.343869 200.352889 l
470.277002 203.007671 l
472.210135 201.559608 l
474.143268 204.455733 l
476.076401 205.059092 l
478.009534 201.921624 l
479.942667 202.766327 l
481.8758 203.490358 l
483.808933 200.956249 l
485.742066 202.404311 l
487.675199 200.232217 l
489.608332 199.266842 l
491.541465 199.025499 l
493.474598 195.284671 l
495.407731 200.352889 l
497.340864 198.784155 l
499.273997 203.369686 l
501.20713 200.111546 l
503.140263 198.784155 l
505.073396 201.800952 l
507.006529 203.369686 l
508.939662 203.490358 l
510.872795 203.369686 l
512.805928 203.128342 l
514.739061 202.162967 l
516.672194 201.318264 l
518.605327 197.215421 l
520.53846 200.594233 l
522.471593 204.214389 l
524.404726 199.146171 l
526.337859 203.369686 l
528.270992 200.835577 l
stroke
grestore
0.173 0.627 0.173 setrgbcolor
gsave
210.5 163.8 327.3 51.48 clipbox
336.890826 133.259328 m
338.823959 136.276125 l
340.757092 137.2415 l
342.690225 137.844859 l
344.623358 136.034781 l
346.556491 135.914109 l
348.489624 139.051578 l
350.422757 140.258297 l
352.35589 137.120828 l
354.289023 138.930906 l
356.222156 134.828062 l
358.155289 137.120828 l
360.088422 138.206875 l
362.021555 134.948734 l
363.954688 136.396797 l
365.887821 137.000156 l
367.820954 137.724187 l
369.754087 137.2415 l
371.68722 137.362172 l
373.620353 138.448219 l
375.553486 137.844859 l
377.486619 136.638141 l
379.419752 139.896281 l
381.352885 139.534266 l
383.286018 139.534266 l
385.219151 136.638141 l
387.152284 140.620312 l
389.085417 138.810234 l
391.01855 140.861656 l
392.951683 139.654937 l
394.884816 139.775609 l
396.817949 138.206875 l
398.751082 137.000156 l
400.684215 136.517469 l
402.617348 135.672766 l
404.550481 134.707391 l
406.483614 134.466047 l
408.416747 138.206875 l
410.34988 136.879484 l
412.283013 137.603516 l
414.216146 139.17225 l
416.149279 136.517469 l
418.082412 136.396797 l
420.015545 138.810234 l
421.948678 138.206875 l
423.881811 136.638141 l
425.814944 137.603516 l
427.748077 138.206875 l
429.68121 138.206875 l
431.614343 137.482844 l
433.547476 140.378969 l
435.480609 138.086203 l
437.413742 136.517469 l
439.346875 137.724187 l
441.280008 135.793437 l
443.21314 135.431422 l
445.146273 137.724187 l
447.079406 135.431422 l
449.012539 136.155453 l
450.945672 137.362172 l
452.878805 138.448219 l
454.811938 141.344344 l
456.745071 137.724187 l
458.678204 140.137625 l
460.611337 137.844859 l
462.54447 140.378969 l
464.477603 138.810234 l
466.410736 141.103 l
468.343869 138.086203 l
470.277002 140.258297 l
472.210135 137.965531 l
474.143268 137.724187 l
476.076401 135.793437 l
478.009534 135.31075 l
479.942667 135.31075 l
481.8758 135.431422 l
483.808933 136.879484 l
485.742066 136.396797 l
487.675199 135.431422 l
489.608332 136.879484 l
491.541465 138.327547 l
493.474598 139.775609 l
495.407731 137.724187 l
497.340864 138.689562 l
499.273997 136.517469 l
501.20713 139.413594 l
503.140263 137.120828 l
505.073396 139.413594 l
507.006529 140.861656 l
508.939662 137.724187 l
510.872795 137.965531 l
512.805928 137.362172 l
514.739061 135.431422 l
516.672194 135.552094 l
518.605327 137.965531 l
520.53846 133.983359 l
522.471593 135.793437 l
524.404726 132.897313 l
526.337859 136.034781 l
528.270992 135.914109 l
stroke
grestore
0.800 setlinewidth
0 setlinejoin
[] 0 setdash
0.000 setgray
gsave
327.321818 51.48 m
327.321818 215.28 l
stroke
grestore
gsave
537.84 51.48 m
537.84 215.28 l
stroke
grestore
gsave
327.321818 51.48 m
537.84 51.48 l
stroke
grestore
gsave
327.321818 215.28 m
537.84 215.28 l
stroke
grestore
/DejaVuSans findfont
12.000 scalefont
setfont
gsave
399.705909 221.280000 translate
0.000000 rotate
0.000000 0.000000 m /g glyphshow
7.617188 0.000000 m /x glyphshow
14.718750 0.000000 m /comma glyphshow
18.533203 0.000000 m /space glyphshow
22.347656 0.000000 m /g glyphshow
29.964844 0.000000 m /y glyphshow
37.066406 0.000000 m /space glyphshow
40.880859 0.000000 m /y glyphshow
47.982422 0.000000 m /space glyphshow
51.796875 0.000000 m /g glyphshow
59.414062 0.000000 m /z glyphshow
grestore
gsave
197.690625 449.515000 translate
0.000000 rotate
0.000000 0.000000 m /G glyphshow
9.298828 0.000000 m /i glyphshow
12.632812 0.000000 m /r glyphshow
17.566406 0.000000 m /o glyphshow
24.908203 0.000000 m /s glyphshow
31.160156 0.000000 m /c glyphshow
37.757812 0.000000 m /o glyphshow
45.099609 0.000000 m /p glyphshow
52.716797 0.000000 m /i glyphshow
56.050781 0.000000 m /o glyphshow
63.392578 0.000000 m /space glyphshow
67.207031 0.000000 m /n glyphshow
74.812500 0.000000 m /o glyphshow
82.154297 0.000000 m /space glyphshow
85.968750 0.000000 m /c glyphshow
92.566406 0.000000 m /a glyphshow
99.919922 0.000000 m /l glyphshow
103.253906 0.000000 m /i glyphshow
106.587891 0.000000 m /b glyphshow
114.205078 0.000000 m /r glyphshow
119.138672 0.000000 m /a glyphshow
126.492188 0.000000 m /d glyphshow
134.109375 0.000000 m /o glyphshow
141.451172 0.000000 m /space glyphshow
145.265625 0.000000 m /M glyphshow
155.619141 0.000000 m /P glyphshow
162.855469 0.000000 m /U glyphshow
171.638672 0.000000 m /six glyphshow
179.273438 0.000000 m /zero glyphshow
186.908203 0.000000 m /five glyphshow
194.542969 0.000000 m /zero glyphshow
grestore

end
showpage
