{
	"info": {
		"_postman_id": "a37a84a0-6631-476d-8225-5612f3333201",
		"name": "credivalores",
		"schema": "https://schema.getpostman.com/json/collection/v2.1.0/collection.json"
	},
	"item": [
		{
			"name": "cursos",
			"item": [
				{
					"name": "all",
					"event": [
						{
							"listen": "prerequest",
							"script": {
								"exec": [
									""
								],
								"type": "text/javascript"
							}
						},
						{
							"listen": "test",
							"script": {
								"exec": [
									"pm.test(\"Status code is 200\", function () {\r",
									"    pm.response.to.have.status(200);\r",
									"});"
								],
								"type": "text/javascript"
							}
						}
					],
					"request": {
						"auth": {
							"type": "apikey"
						},
						"method": "GET",
						"header": [],
						"url": {
							"raw": "{{servidorNodejs}}cursos",
							"host": [
								"{{servidorNodejs}}cursos"
							]
						}
					},
					"response": []
				},
				{
					"name": "crear",
					"event": [
						{
							"listen": "test",
							"script": {
								"exec": [
									"pm.test(\"Status code is 200\", function () {\r",
									"    pm.response.to.have.status(200);\r",
									"});"
								],
								"type": "text/javascript"
							}
						}
					],
					"request": {
						"method": "POST",
						"header": [],
						"body": {
							"mode": "raw",
							"raw": "{\r\n    \"nombre\":\"Español\"\r\n}"
						},
						"url": {
							"raw": "{{servidorNodejs}}cursos",
							"host": [
								"{{servidorNodejs}}cursos"
							]
						}
					},
					"response": []
				},
				{
					"name": "editar",
					"event": [
						{
							"listen": "test",
							"script": {
								"exec": [
									"pm.test(\"Status code is 200\", function () {\r",
									"    pm.response.to.have.status(200);\r",
									"});"
								],
								"type": "text/javascript"
							}
						}
					],
					"request": {
						"method": "PUT",
						"header": [],
						"body": {
							"mode": "raw",
							"raw": "{\r\n    \"nombre\":\"otra cosa\"\r\n}"
						},
						"url": {
							"raw": "{{servidorNodejs}}curso/1",
							"host": [
								"{{servidorNodejs}}curso"
							],
							"path": [
								"1"
							]
						}
					},
					"response": []
				},
				{
					"name": "eliminar",
					"event": [
						{
							"listen": "test",
							"script": {
								"exec": [
									"pm.test(\"Status code is 200\", function () {\r",
									"    pm.response.to.have.status(200);\r",
									"});"
								],
								"type": "text/javascript"
							}
						}
					],
					"request": {
						"method": "DELETE",
						"header": [],
						"body": {
							"mode": "raw",
							"raw": "{\r\n    \"nombre\":\"otra cosa\"\r\n\r\n}"
						},
						"url": {
							"raw": "{{servidorNodejs}}curso/1",
							"host": [
								"{{servidorNodejs}}curso"
							],
							"path": [
								"1"
							]
						}
					},
					"response": []
				}
			]
		}
	]
}