,id,partner,fecha,fecha_proceso,estado,idPedidoInternoMarketPlace
0,4759756,WAITRY,2021-08-01 00:32:29,2021-08-01 00:33:04,ADESPACHAR,11700
1,391326945,PEDIDOSYA,2021-08-01 00:32:29,2021-08-01 00:32:39,ADESPACHAR,11721
2,391326559,PEDIDOSYA,2021-08-01 00:32:29,2021-08-01 00:32:39,ADESPACHAR,11722
3,4760097,WAITRY,2021-08-01 00:32:30,2021-08-01 00:33:04,ADESPACHAR,11723
4,391349004,PEDIDOSYA,2021-08-01 00:32:30,2021-08-01 00:32:39,ADESPACHAR,11724
5,56280692,RAPPI,2021-08-01 00:32:30,2021-08-01 00:33:04,ADESPACHAR,11725
6,391359700,PEDIDOSYA,2021-08-01 00:32:30,2021-08-01 00:32:39,ADESPACHAR,11726
7,56285286,RAPPI,2021-08-01 00:32:31,2021-08-01 00:33:04,ADESPACHAR,11727
8,56287226,RAPPI,2021-08-01 00:32:31,2021-08-01 00:33:04,ADESPACHAR,11728
9,56290211,RAPPI,2021-08-01 00:32:31,2021-08-01 00:33:04,ADESPACHAR,11729
10,4760304,WAITRY,2021-08-01 00:32:31,2021-08-01 00:33:04,ADESPACHAR,11730
11,4759797,WAITRY,2021-08-01 00:32:49,2021-08-01 00:33:04,ADESPACHAR,11701
12,391232797,PEDIDOSYA,2021-08-01 00:33:09,2021-08-01 00:33:18,ADESPACHAR,11702
13,391239432,PEDIDOSYA,2021-08-01 00:33:29,2021-08-01 00:33:38,ADESPACHAR,11703
14,391252717,PEDIDOSYA,2021-08-01 00:34:29,2021-08-01 00:34:38,ADESPACHAR,11705
15,391272007,PEDIDOSYA,2021-08-01 00:34:39,2021-08-01 00:34:48,ADESPACHAR,11707
16,4759526,WAITRY,2021-08-01 00:34:59,2021-08-01 00:35:03,ADESPACHAR,11699
17,391320027,PEDIDOSYA,2021-08-01 00:34:59,2021-08-01 00:35:08,ADESPACHAR,11719
18,56321998,RAPPI,2021-08-01 13:30:18,2021-08-01 13:31:03,ACK,11731
19,56321998,RAPPI,2021-08-01 13:31:03,2021-08-01 13:32:03,ACONFIRMAR,11731
20,56321998,RAPPI,2021-08-01 13:54:21,2021-08-01 13:55:04,ADESPACHAR,11731
21,56326212,RAPPI,2021-08-01 14:10:18,2021-08-01 14:11:05,ACK,11732
22,56326212,RAPPI,2021-08-01 14:11:04,2021-08-01 14:12:03,ACONFIRMAR,11732
23,56326212,RAPPI,2021-08-01 14:36:01,2021-08-01 14:36:03,ADESPACHAR,11732
24,4771478,WAITRY,2021-08-01 19:46:49,2021-08-01 19:47:05,ACK,11733
25,4771478,WAITRY,2021-08-01 19:48:11,2021-08-01 19:49:05,ACONFIRMAR,11733
26,391893762,PEDIDOSYA,2021-08-01 20:00:09,2021-08-01 20:00:16,ACK,11734
27,391893762,PEDIDOSYA,2021-08-01 20:00:21,2021-08-01 20:00:23,ACONFIRMAR,11734
28,56362362,RAPPI,2021-08-01 20:24:18,2021-08-01 20:25:10,ACK,11735
29,56362362,RAPPI,2021-08-01 20:25:10,2021-08-01 20:26:03,ACONFIRMAR,11735
30,391964085,PEDIDOSYA,2021-08-01 20:51:08,2021-08-01 20:51:13,ACK,11736
31,391964085,PEDIDOSYA,2021-08-01 20:51:22,2021-08-01 20:51:37,ACONFIRMAR,11736
32,391966476,PEDIDOSYA,2021-08-01 20:52:09,2021-08-01 20:52:15,ACK,11737
33,391966476,PEDIDOSYA,2021-08-01 20:52:21,2021-08-01 20:52:31,ACONFIRMAR,11737
34,391990151,PEDIDOSYA,2021-08-01 21:07:09,2021-08-01 21:07:12,ACK,11738
35,391990151,PEDIDOSYA,2021-08-01 21:07:31,2021-08-01 21:07:34,ACONFIRMAR,11738
36,56374320,RAPPI,2021-08-01 21:10:19,2021-08-01 21:11:04,ACK,11739
37,56374320,RAPPI,2021-08-01 21:11:04,2021-08-01 21:12:06,ACONFIRMAR,11739
38,391999604,PEDIDOSYA,2021-08-01 21:12:09,2021-08-01 21:12:12,ACK,11740
39,391999604,PEDIDOSYA,2021-08-01 21:12:31,2021-08-01 21:12:41,ACONFIRMAR,11740
40,392011698,PEDIDOSYA,2021-08-01 21:19:09,2021-08-01 21:19:14,ACK,11741
41,56375966,RAPPI,2021-08-01 21:19:09,2021-08-01 21:20:04,ACK,11742
42,392011698,PEDIDOSYA,2021-08-01 21:19:32,2021-08-01 21:19:41,ACONFIRMAR,11741
43,56375966,RAPPI,2021-08-01 21:20:03,2021-08-01 21:21:03,ACONFIRMAR,11742
44,392043841,PEDIDOSYA,2021-08-01 21:40:09,2021-08-01 21:40:13,ACK,11743
45,392043841,PEDIDOSYA,2021-08-01 21:41:41,2021-08-01 21:41:51,ACONFIRMAR,11743
46,392054989,PEDIDOSYA,2021-08-01 21:48:09,2021-08-01 21:48:13,ACK,11744
47,392054989,PEDIDOSYA,2021-08-01 21:48:22,2021-08-01 21:48:31,ACONFIRMAR,11744
48,56388903,RAPPI,2021-08-01 22:33:10,2021-08-01 22:34:07,ACK,11745
49,4771763,WAITRY,2021-08-01 22:33:10,2021-08-01 22:34:07,ACK,11746
50,56388903,RAPPI,2021-08-01 22:34:06,2021-08-01 22:35:04,ACONFIRMAR,11745
51,4771763,WAITRY,2021-08-01 22:34:07,2021-08-01 22:35:05,ACONFIRMAR,11746
52,392114098,PEDIDOSYA,2021-08-01 22:39:09,2021-08-01 22:39:12,ACK,11747
53,392114098,PEDIDOSYA,2021-08-01 22:39:18,2021-08-01 22:39:22,ACONFIRMAR,11747
54,392114545,PEDIDOSYA,2021-08-01 22:40:09,2021-08-01 22:40:12,ACK,11748
55,392114545,PEDIDOSYA,2021-08-01 22:40:28,2021-08-01 22:40:32,ACONFIRMAR,11748
56,391893762,PEDIDOSYA,2021-08-01 23:04:19,2021-08-01 23:04:21,ADESPACHAR,11734
57,56388903,RAPPI,2021-08-01 23:04:19,2021-08-01 23:05:07,ADESPACHAR,11745
58,392011698,PEDIDOSYA,2021-08-01 23:05:09,2021-08-01 23:05:11,ADESPACHAR,11741
59,56362362,RAPPI,2021-08-01 23:05:48,2021-08-01 23:06:07,ADESPACHAR,11735
60,392043841,PEDIDOSYA,2021-08-01 23:06:09,2021-08-01 23:06:11,ADESPACHAR,11743
61,392054989,PEDIDOSYA,2021-08-01 23:06:09,2021-08-01 23:06:12,ADESPACHAR,11744
62,392114098,PEDIDOSYA,2021-08-01 23:06:09,2021-08-01 23:06:13,ADESPACHAR,11747
63,392114545,PEDIDOSYA,2021-08-01 23:06:09,2021-08-01 23:06:14,ADESPACHAR,11748
64,391990151,PEDIDOSYA,2021-08-01 23:11:49,2021-08-01 23:11:52,ADESPACHAR,11738
65,391964085,PEDIDOSYA,2021-08-01 23:11:59,2021-08-01 23:12:01,ADESPACHAR,11736
0,392206838,PEDIDOSYA,2021-08-02 12:29:11,2021-08-02 12:29:20,ACK,11749
1,392206838,PEDIDOSYA,2021-08-02 12:29:27,2021-08-02 12:29:31,ACONFIRMAR,11749
2,392210480,PEDIDOSYA,2021-08-02 12:36:11,2021-08-02 12:36:21,ACK,11750
3,392210480,PEDIDOSYA,2021-08-02 12:36:37,2021-08-02 12:36:40,ACONFIRMAR,11750
4,392224170,PEDIDOSYA,2021-08-02 13:01:11,2021-08-02 13:01:20,ACK,11751
5,392224170,PEDIDOSYA,2021-08-02 13:01:27,2021-08-02 13:01:30,ACONFIRMAR,11751
6,392224170,PEDIDOSYA,2021-08-02 13:05:07,2021-08-02 13:05:10,ADESPACHAR,11751
7,56412725,RAPPI,2021-08-02 13:41:11,2021-08-02 13:42:03,ACK,11752
8,56412725,RAPPI,2021-08-02 13:42:03,2021-08-02 13:43:03,ACONFIRMAR,11752
9,392263282,PEDIDOSYA,2021-08-02 14:02:11,2021-08-02 14:02:20,ACK,11753
10,392263282,PEDIDOSYA,2021-08-02 14:02:47,2021-08-02 14:02:51,ACONFIRMAR,11753
11,392269847,PEDIDOSYA,2021-08-02 14:12:11,2021-08-02 14:12:20,ACK,11754
12,392269847,PEDIDOSYA,2021-08-02 14:12:27,2021-08-02 14:12:30,ACONFIRMAR,11754
13,392210480,PEDIDOSYA,2021-08-02 15:22:58,2021-08-02 15:23:00,ADESPACHAR,11750
14,56412725,RAPPI,2021-08-02 15:23:17,2021-08-02 15:24:03,ADESPACHAR,11752
15,392263282,PEDIDOSYA,2021-08-02 15:25:07,2021-08-02 15:25:10,ADESPACHAR,11753
16,4776188,WAITRY,2021-08-02 15:44:01,2021-08-02 15:44:04,ACK,11755
17,4776188,WAITRY,2021-08-02 15:45:27,2021-08-02 15:46:06,ACONFIRMAR,11755
18,392414727,PEDIDOSYA,2021-08-02 19:54:12,2021-08-02 19:54:17,ACK,11756
19,392414727,PEDIDOSYA,2021-08-02 19:54:29,2021-08-02 19:54:37,ACONFIRMAR,11756
20,4779517,WAITRY,2021-08-02 20:26:52,2021-08-02 20:27:04,ACK,11757
21,4779517,WAITRY,2021-08-02 20:27:09,2021-08-02 20:28:03,ACONFIRMAR,11757
22,4779503,WAITRY,2021-08-02 20:27:42,2021-08-02 20:28:03,ACK,11758
23,4779503,WAITRY,2021-08-02 20:28:09,2021-08-02 20:29:07,ACONFIRMAR,11758
24,392469775,PEDIDOSYA,2021-08-02 20:54:12,2021-08-02 20:54:18,ACK,11759
25,392469775,PEDIDOSYA,2021-08-02 20:54:59,2021-08-02 20:55:06,ACONFIRMAR,11759
26,56445332,RAPPI,2021-08-02 20:56:12,2021-08-02 20:57:07,ACK,11760
27,56445332,RAPPI,2021-08-02 20:57:07,2021-08-02 20:58:05,ACONFIRMAR,11760
28,56448927,RAPPI,2021-08-02 21:16:12,2021-08-02 21:17:04,ACK,11761
29,56448927,RAPPI,2021-08-02 21:17:29,2021-08-02 21:18:05,ACONFIRMAR,11761
30,392502261,PEDIDOSYA,2021-08-02 21:24:12,2021-08-02 21:24:18,ACK,11762
31,392502261,PEDIDOSYA,2021-08-02 21:24:39,2021-08-02 21:24:46,ACONFIRMAR,11762
32,56452591,RAPPI,2021-08-02 21:39:12,2021-08-02 21:40:03,ACK,11763
33,56452591,RAPPI,2021-08-02 21:40:02,2021-08-02 21:41:04,ACONFIRMAR,11763
34,4779613,WAITRY,2021-08-02 21:44:02,2021-08-02 21:44:06,ACK,11764
35,4779613,WAITRY,2021-08-02 21:44:18,2021-08-02 21:45:10,ACONFIRMAR,11764
36,56453517,RAPPI,2021-08-02 21:46:52,2021-08-02 21:47:08,ACK,11765
37,56453517,RAPPI,2021-08-02 21:47:18,2021-08-02 21:48:05,ACONFIRMAR,11765
38,392560139,PEDIDOSYA,2021-08-02 22:23:12,2021-08-02 22:23:19,ACK,11766
39,392560139,PEDIDOSYA,2021-08-02 22:25:48,2021-08-02 22:25:57,ACONFIRMAR,11766
40,392574110,PEDIDOSYA,2021-08-02 22:40:12,2021-08-02 22:40:17,ACK,11767
41,392574110,PEDIDOSYA,2021-08-02 22:40:48,2021-08-02 22:40:57,ACONFIRMAR,11767
42,4779685,WAITRY,2021-08-02 23:20:02,2021-08-02 23:21:03,ACK,11768
43,4779685,WAITRY,2021-08-02 23:21:08,2021-08-02 23:22:03,ACONFIRMAR,11768
0,4779711,WAITRY,2021-08-03 00:17:12,2021-08-03 00:18:03,ACK,11769
1,4779711,WAITRY,2021-08-03 00:18:38,2021-08-03 00:19:03,ACONFIRMAR,11769
2,392560139,PEDIDOSYA,2021-08-03 01:06:58,2021-08-03 01:07:06,ADESPACHAR,11766
3,392414727,PEDIDOSYA,2021-08-03 01:07:48,2021-08-03 01:07:56,ADESPACHAR,11756
4,392574110,PEDIDOSYA,2021-08-03 01:07:48,2021-08-03 01:07:57,ADESPACHAR,11767
5,56453517,RAPPI,2021-08-03 01:08:28,2021-08-03 01:09:02,ADESPACHAR,11765
6,392641386,PEDIDOSYA,2021-08-03 11:49:15,2021-08-03 11:49:18,ACK,11770
7,392641386,PEDIDOSYA,2021-08-03 11:49:34,2021-08-03 11:49:38,ACONFIRMAR,11770
8,4783173,WAITRY,2021-08-03 11:58:04,2021-08-03 11:59:03,ACK,11771
9,4783173,WAITRY,2021-08-03 11:59:03,2021-08-03 12:00:03,ACONFIRMAR,11771
10,392661223,PEDIDOSYA,2021-08-03 12:37:04,2021-08-03 12:37:14,ACK,11772
11,392661223,PEDIDOSYA,2021-08-03 12:37:14,2021-08-03 12:37:23,ACONFIRMAR,11772
12,4783252,WAITRY,2021-08-03 12:38:54,2021-08-03 12:39:06,ACK,11773
13,4783252,WAITRY,2021-08-03 12:39:14,2021-08-03 12:40:05,ACONFIRMAR,11773
14,392689803,PEDIDOSYA,2021-08-03 13:24:14,2021-08-03 13:24:25,ACK,11774
15,392689803,PEDIDOSYA,2021-08-03 13:24:34,2021-08-03 13:24:43,ACONFIRMAR,11774
16,4787805,WAITRY,2021-08-03 20:02:56,2021-08-03 20:03:02,ACK,11775
17,56506924,RAPPI,2021-08-03 20:03:15,2021-08-03 20:04:04,ACK,11776
18,4787805,WAITRY,2021-08-03 20:03:17,2021-08-03 20:04:05,ACONFIRMAR,11775
19,56506924,RAPPI,2021-08-03 20:04:03,2021-08-03 20:05:03,ACONFIRMAR,11776
20,392884427,PEDIDOSYA,2021-08-03 20:04:05,2021-08-03 20:04:08,ACK,11777
21,392884427,PEDIDOSYA,2021-08-03 20:04:27,2021-08-03 20:04:37,ACONFIRMAR,11777
22,392889955,PEDIDOSYA,2021-08-03 20:10:15,2021-08-03 20:10:20,ACK,11778
23,392889955,PEDIDOSYA,2021-08-03 20:10:27,2021-08-03 20:10:37,ACONFIRMAR,11778
24,392903719,PEDIDOSYA,2021-08-03 20:23:06,2021-08-03 20:23:09,ACK,11779
25,392903719,PEDIDOSYA,2021-08-03 20:23:17,2021-08-03 20:23:27,ACONFIRMAR,11779
26,392981958,PEDIDOSYA,2021-08-03 21:30:06,2021-08-03 21:30:08,ACK,11780
27,392981958,PEDIDOSYA,2021-08-03 21:30:17,2021-08-03 21:30:27,ACONFIRMAR,11780
28,392981958,PEDIDOSYA,2021-08-03 21:55:29,2021-08-03 21:55:37,ADESPACHAR,11780
0,393168677,PEDIDOSYA,2021-08-04 13:21:09,2021-08-04 13:21:18,ACK,11781
1,393168677,PEDIDOSYA,2021-08-04 13:21:23,2021-08-04 13:21:27,ACONFIRMAR,11781
2,56556461,RAPPI,2021-08-04 13:39:19,2021-08-04 13:40:05,ACK,11782
3,56556461,RAPPI,2021-08-04 13:40:04,2021-08-04 13:41:03,ACONFIRMAR,11782
4,393168677,PEDIDOSYA,2021-08-04 13:43:38,2021-08-04 13:43:47,ADESPACHAR,11781
5,393187359,PEDIDOSYA,2021-08-04 13:48:09,2021-08-04 13:48:17,ACK,11783
6,393187359,PEDIDOSYA,2021-08-04 13:48:17,2021-08-04 13:48:27,ACONFIRMAR,11783
7,393190917,PEDIDOSYA,2021-08-04 13:53:09,2021-08-04 13:53:18,ACK,11784
8,393190917,PEDIDOSYA,2021-08-04 13:53:29,2021-08-04 13:53:37,ACONFIRMAR,11784
9,393198899,PEDIDOSYA,2021-08-04 14:05:09,2021-08-04 14:05:18,ACK,11785
10,393198899,PEDIDOSYA,2021-08-04 14:05:18,2021-08-04 14:05:27,ACONFIRMAR,11785
11,393198899,PEDIDOSYA,2021-08-04 14:36:48,2021-08-04 14:36:57,ADESPACHAR,11785
12,393225441,PEDIDOSYA,2021-08-04 14:47:09,2021-08-04 14:47:17,ACK,11786
13,393225441,PEDIDOSYA,2021-08-04 14:47:17,2021-08-04 14:47:27,ACONFIRMAR,11786
14,4796208,WAITRY,2021-08-04 19:13:29,2021-08-04 19:14:03,ACK,11787
15,4796208,WAITRY,2021-08-04 19:14:03,2021-08-04 19:15:04,ACONFIRMAR,11787
16,393353335,PEDIDOSYA,2021-08-04 19:35:09,2021-08-04 19:35:16,ACK,11788
17,393353335,PEDIDOSYA,2021-08-04 19:44:47,2021-08-04 19:44:54,ACONFIRMAR,11788
18,393363108,PEDIDOSYA,2021-08-04 19:50:09,2021-08-04 19:50:18,ACK,11789
19,393363108,PEDIDOSYA,2021-08-04 19:52:27,2021-08-04 19:52:34,ACONFIRMAR,11789
20,393373321,PEDIDOSYA,2021-08-04 20:02:09,2021-08-04 20:02:18,ACK,11790
21,393373321,PEDIDOSYA,2021-08-04 20:02:27,2021-08-04 20:02:34,ACONFIRMAR,11790
22,393388095,PEDIDOSYA,2021-08-04 20:15:09,2021-08-04 20:15:17,ACK,11791
23,393388095,PEDIDOSYA,2021-08-04 20:21:07,2021-08-04 20:21:16,ACONFIRMAR,11791
24,56589556,RAPPI,2021-08-04 20:35:18,2021-08-04 20:36:04,ACK,11792
25,56589556,RAPPI,2021-08-04 20:36:07,2021-08-04 20:37:04,ACONFIRMAR,11792
26,56590243,RAPPI,2021-08-04 20:38:18,2021-08-04 20:39:07,ACK,11793
27,56590243,RAPPI,2021-08-04 20:39:06,2021-08-04 20:40:04,ACONFIRMAR,11793
28,393476759,PEDIDOSYA,2021-08-04 21:26:19,2021-08-04 21:26:27,ACK,11794
29,393476759,PEDIDOSYA,2021-08-04 21:26:37,2021-08-04 21:26:44,ACONFIRMAR,11794
30,393487639,PEDIDOSYA,2021-08-04 21:33:09,2021-08-04 21:33:18,ACK,11795
31,393487639,PEDIDOSYA,2021-08-04 21:33:47,2021-08-04 21:33:56,ACONFIRMAR,11795
32,393509722,PEDIDOSYA,2021-08-04 21:51:45,2021-08-04 21:51:56,ACK,11796
33,393509722,PEDIDOSYA,2021-08-04 21:51:58,2021-08-04 21:52:05,ACONFIRMAR,11796
34,393531130,PEDIDOSYA,2021-08-04 22:13:44,2021-08-04 22:13:55,ACK,11797
35,393531130,PEDIDOSYA,2021-08-04 22:13:57,2021-08-04 22:14:05,ACONFIRMAR,11797
36,393353335,PEDIDOSYA,2021-08-04 23:26:38,2021-08-04 23:26:44,ADESPACHAR,11788
37,393531130,PEDIDOSYA,2021-08-04 23:26:38,2021-08-04 23:26:44,ADESPACHAR,11797
38,393487639,PEDIDOSYA,2021-08-04 23:26:58,2021-08-04 23:27:05,ADESPACHAR,11795
39,393388095,PEDIDOSYA,2021-08-04 23:27:18,2021-08-04 23:27:24,ADESPACHAR,11791
40,56589556,RAPPI,2021-08-04 23:28:38,2021-08-04 23:29:03,ADESPACHAR,11792
41,393373321,PEDIDOSYA,2021-08-04 23:28:48,2021-08-04 23:28:54,ADESPACHAR,11790
42,393363108,PEDIDOSYA,2021-08-04 23:28:58,2021-08-04 23:29:04,ADESPACHAR,11789
0,393619107,PEDIDOSYA,2021-08-05 11:06:11,2021-08-05 11:06:15,ACK,11798
1,393619107,PEDIDOSYA,2021-08-05 11:06:43,2021-08-05 11:06:45,ACONFIRMAR,11798
2,393625026,PEDIDOSYA,2021-08-05 11:32:11,2021-08-05 11:32:15,ACK,11799
3,393625026,PEDIDOSYA,2021-08-05 11:32:24,2021-08-05 11:32:25,ACONFIRMAR,11799
4,393625026,PEDIDOSYA,2021-08-05 11:52:04,2021-08-05 11:52:06,ADESPACHAR,11799
5,393633797,PEDIDOSYA,2021-08-05 12:00:11,2021-08-05 12:03:18,ACK,11800
6,393633797,PEDIDOSYA,2021-08-05 12:03:18,2021-08-05 12:03:27,ACONFIRMAR,11800
7,393633797,PEDIDOSYA,2021-08-05 12:28:24,2021-08-05 12:28:27,ADESPACHAR,11800
8,393658198,PEDIDOSYA,2021-08-05 12:47:11,2021-08-05 12:47:19,ACK,11801
9,393658198,PEDIDOSYA,2021-08-05 12:47:44,2021-08-05 12:47:47,ACONFIRMAR,11801
10,393666694,PEDIDOSYA,2021-08-05 13:01:11,2021-08-05 13:01:19,ACK,11802
11,393666694,PEDIDOSYA,2021-08-05 13:01:24,2021-08-05 13:01:28,ACONFIRMAR,11802
12,393658198,PEDIDOSYA,2021-08-05 13:03:14,2021-08-05 13:03:21,ADESPACHAR,11801
13,393675228,PEDIDOSYA,2021-08-05 13:13:12,2021-08-05 13:13:19,ACK,11803
14,393675228,PEDIDOSYA,2021-08-05 13:13:24,2021-08-05 13:13:28,ACONFIRMAR,11803
15,56631744,RAPPI,2021-08-05 13:22:11,2021-08-05 13:23:03,ACK,11804
16,56631744,RAPPI,2021-08-05 13:23:02,2021-08-05 13:24:04,ACONFIRMAR,11804
17,393697247,PEDIDOSYA,2021-08-05 13:41:11,2021-08-05 13:41:19,ACK,11805
18,393697247,PEDIDOSYA,2021-08-05 13:42:34,2021-08-05 13:42:38,ACONFIRMAR,11805
19,393666694,PEDIDOSYA,2021-08-05 15:41:05,2021-08-05 15:41:07,ADESPACHAR,11802
20,393697247,PEDIDOSYA,2021-08-05 15:41:54,2021-08-05 15:41:57,ADESPACHAR,11805
21,4805273,WAITRY,2021-08-05 19:45:13,2021-08-05 19:46:04,ACK,11806
22,4805273,WAITRY,2021-08-05 19:47:59,2021-08-05 19:48:07,ACONFIRMAR,11806
23,393883900,PEDIDOSYA,2021-08-05 19:48:13,2021-08-05 19:48:23,ACK,11807
24,393883900,PEDIDOSYA,2021-08-05 19:48:29,2021-08-05 19:48:34,ACONFIRMAR,11807
25,393885882,PEDIDOSYA,2021-08-05 19:50:12,2021-08-05 19:50:23,ACK,11808
26,393885882,PEDIDOSYA,2021-08-05 19:50:39,2021-08-05 19:50:44,ACONFIRMAR,11808
27,393897043,PEDIDOSYA,2021-08-05 20:03:12,2021-08-05 20:03:23,ACK,11809
28,393897043,PEDIDOSYA,2021-08-05 20:03:29,2021-08-05 20:03:34,ACONFIRMAR,11809
29,56667754,RAPPI,2021-08-05 20:38:13,2021-08-05 20:39:04,ACK,11810
30,56667754,RAPPI,2021-08-05 20:39:03,2021-08-05 20:40:05,ACONFIRMAR,11810
31,393939773,PEDIDOSYA,2021-08-05 20:40:14,2021-08-05 20:40:26,ACK,11811
32,393939773,PEDIDOSYA,2021-08-05 20:40:49,2021-08-05 20:40:55,ACONFIRMAR,11811
33,393964038,PEDIDOSYA,2021-08-05 20:59:03,2021-08-05 20:59:14,ACK,11812
34,393964038,PEDIDOSYA,2021-08-05 20:59:29,2021-08-05 20:59:35,ACONFIRMAR,11812
35,56673880,RAPPI,2021-08-05 21:04:13,2021-08-05 21:05:03,ACK,11813
36,56673880,RAPPI,2021-08-05 21:05:02,2021-08-05 21:06:05,ACONFIRMAR,11813
37,393999432,PEDIDOSYA,2021-08-05 21:23:13,2021-08-05 21:23:26,ACK,11814
38,393999432,PEDIDOSYA,2021-08-05 21:23:39,2021-08-05 21:23:44,ACONFIRMAR,11814
39,4805533,WAITRY,2021-08-05 21:25:13,2021-08-05 21:26:03,ACK,11815
40,4805533,WAITRY,2021-08-05 21:26:03,2021-08-05 21:27:03,ACONFIRMAR,11815
41,394035244,PEDIDOSYA,2021-08-05 21:50:13,2021-08-05 21:50:25,ACK,11816
42,394035244,PEDIDOSYA,2021-08-05 21:50:49,2021-08-05 21:50:54,ACONFIRMAR,11816
43,394034000,PEDIDOSYA,2021-08-05 21:51:13,2021-08-05 21:51:26,ACK,11817
44,394034000,PEDIDOSYA,2021-08-05 21:51:39,2021-08-05 21:51:43,ACONFIRMAR,11817
45,4805607,WAITRY,2021-08-05 21:53:23,2021-08-05 21:56:11,ACK,11818
46,4805607,WAITRY,2021-08-05 21:55:03,2021-08-05 21:56:06,ACONFIRMAR,11818
47,4805607,WAITRY,2021-08-05 21:56:11,2021-08-05 21:57:05,ACONFIRMAR,11818
48,394054035,PEDIDOSYA,2021-08-05 22:06:13,2021-08-05 22:06:24,ACK,11819
49,394054035,PEDIDOSYA,2021-08-05 22:07:19,2021-08-05 22:07:28,ACONFIRMAR,11819
50,4805657,WAITRY,2021-08-05 22:19:03,2021-08-05 22:19:05,ACK,11820
51,4805657,WAITRY,2021-08-05 22:19:29,2021-08-05 22:20:08,ACONFIRMAR,11820
52,4805705,WAITRY,2021-08-05 22:31:43,2021-08-05 22:32:04,ACK,11821
53,4805705,WAITRY,2021-08-05 22:32:09,2021-08-05 22:33:04,ACONFIRMAR,11821
54,4805273,WAITRY,2021-08-05 23:26:40,2021-08-05 23:27:03,ADESPACHAR,11806
55,394035244,PEDIDOSYA,2021-08-05 23:26:40,2021-08-05 23:26:43,ADESPACHAR,11816
56,394034000,PEDIDOSYA,2021-08-05 23:26:40,2021-08-05 23:26:43,ADESPACHAR,11817
57,4805607,WAITRY,2021-08-05 23:26:41,2021-08-05 23:27:03,ADESPACHAR,11818
58,394054035,PEDIDOSYA,2021-08-05 23:26:41,2021-08-05 23:26:43,ADESPACHAR,11819
59,4805657,WAITRY,2021-08-05 23:26:41,2021-08-05 23:27:03,ADESPACHAR,11820
60,4805705,WAITRY,2021-08-05 23:26:41,2021-08-05 23:27:03,ADESPACHAR,11821
61,56673880,RAPPI,2021-08-05 23:31:10,2021-08-05 23:32:04,ADESPACHAR,11813
62,393885882,PEDIDOSYA,2021-08-05 23:33:10,2021-08-05 23:33:12,ADESPACHAR,11808
63,393883900,PEDIDOSYA,2021-08-05 23:33:20,2021-08-05 23:33:23,ADESPACHAR,11807
0,394171690,PEDIDOSYA,2021-08-06 12:04:05,2021-08-06 12:04:08,ACK,11822
1,394171690,PEDIDOSYA,2021-08-06 12:04:43,2021-08-06 12:04:47,ACONFIRMAR,11822
2,4809729,WAITRY,2021-08-06 12:19:25,2021-08-06 12:20:05,ACK,11823
3,4809729,WAITRY,2021-08-06 12:20:05,2021-08-06 12:21:04,ACONFIRMAR,11823
4,394197974,PEDIDOSYA,2021-08-06 12:49:15,2021-08-06 12:49:19,ACK,11824
5,394197974,PEDIDOSYA,2021-08-06 12:49:33,2021-08-06 12:49:37,ACONFIRMAR,11824
6,394256776,PEDIDOSYA,2021-08-06 14:03:05,2021-08-06 14:03:08,ACK,11825
7,394256776,PEDIDOSYA,2021-08-06 14:03:13,2021-08-06 14:03:19,ACONFIRMAR,11825
8,56726090,RAPPI,2021-08-06 14:58:15,2021-08-06 14:59:03,ACK,11826
9,56726090,RAPPI,2021-08-06 14:59:03,2021-08-06 15:00:03,ACONFIRMAR,11826
10,56742749,RAPPI,2021-08-06 19:23:17,2021-08-06 19:24:06,ACK,11827
11,56742749,RAPPI,2021-08-06 19:24:05,2021-08-06 19:25:03,ACONFIRMAR,11827
12,394436134,PEDIDOSYA,2021-08-06 19:36:06,2021-08-06 19:36:09,ACK,11828
13,394436134,PEDIDOSYA,2021-08-06 19:36:39,2021-08-06 19:36:49,ACONFIRMAR,11828
14,4816359,WAITRY,2021-08-06 19:38:26,2021-08-06 19:39:05,ACK,11829
15,4816359,WAITRY,2021-08-06 19:39:09,2021-08-06 19:40:07,ACONFIRMAR,11829
16,56747699,RAPPI,2021-08-06 19:57:16,2021-08-06 19:58:03,ACK,11830
17,56747699,RAPPI,2021-08-06 19:58:02,2021-08-06 19:59:03,ACONFIRMAR,11830
18,4816440,WAITRY,2021-08-06 20:01:46,2021-08-06 20:02:07,ACK,11831
19,4816440,WAITRY,2021-08-06 20:02:19,2021-08-06 20:03:08,ACONFIRMAR,11831
20,4816454,WAITRY,2021-08-06 20:04:46,2021-08-06 20:05:08,ACK,11832
21,4816454,WAITRY,2021-08-06 20:05:09,2021-08-06 20:06:06,ACONFIRMAR,11832
22,4816504,WAITRY,2021-08-06 20:22:07,2021-08-06 20:23:06,ACK,11833
23,4816504,WAITRY,2021-08-06 20:23:06,2021-08-06 20:24:05,ACONFIRMAR,11833
24,4816538,WAITRY,2021-08-06 20:25:36,2021-08-06 20:26:05,ACK,11834
25,4816538,WAITRY,2021-08-06 20:26:19,2021-08-06 20:27:05,ACONFIRMAR,11834
26,394500140,PEDIDOSYA,2021-08-06 20:30:07,2021-08-06 20:30:11,ACK,11835
27,394500140,PEDIDOSYA,2021-08-06 20:30:19,2021-08-06 20:30:35,ACONFIRMAR,11835
28,4816639,WAITRY,2021-08-06 20:53:07,2021-08-06 20:54:07,ACK,11836
29,4816639,WAITRY,2021-08-06 20:54:07,2021-08-06 20:55:04,ACONFIRMAR,11836
30,394552924,PEDIDOSYA,2021-08-06 21:00:07,2021-08-06 21:00:13,ACK,11837
31,394552924,PEDIDOSYA,2021-08-06 21:00:29,2021-08-06 21:00:35,ACONFIRMAR,11837
32,394563802,PEDIDOSYA,2021-08-06 21:05:06,2021-08-06 21:05:10,ACK,11838
33,394563802,PEDIDOSYA,2021-08-06 21:07:20,2021-08-06 21:07:30,ACONFIRMAR,11838
34,394570496,PEDIDOSYA,2021-08-06 21:10:07,2021-08-06 21:10:10,ACK,11839
35,394574509,PEDIDOSYA,2021-08-06 21:12:17,2021-08-06 21:12:27,ACK,11840
36,394570496,PEDIDOSYA,2021-08-06 21:16:00,2021-08-06 21:16:09,ACONFIRMAR,11839
37,394574509,PEDIDOSYA,2021-08-06 21:16:00,2021-08-06 21:16:09,ACONFIRMAR,11840
38,394580770,PEDIDOSYA,2021-08-06 21:17:07,2021-08-06 21:17:11,ACK,11841
39,394580770,PEDIDOSYA,2021-08-06 21:17:30,2021-08-06 21:17:39,ACONFIRMAR,11841
40,4816847,WAITRY,2021-08-06 21:40:47,2021-08-06 21:41:05,ACK,11842
41,4816847,WAITRY,2021-08-06 21:41:30,2021-08-06 21:42:08,ACONFIRMAR,11842
42,4816793,WAITRY,2021-08-06 21:44:07,2021-08-06 21:45:03,ACK,11843
43,4816793,WAITRY,2021-08-06 21:45:03,2021-08-06 21:46:05,ACONFIRMAR,11843
44,4816866,WAITRY,2021-08-06 21:45:37,2021-08-06 21:46:05,ACK,11844
45,4816866,WAITRY,2021-08-06 21:46:19,2021-08-06 21:47:05,ACONFIRMAR,11844
46,394643071,PEDIDOSYA,2021-08-06 21:48:19,2021-08-06 21:48:34,ACK,11845
47,394643071,PEDIDOSYA,2021-08-06 21:51:30,2021-08-06 21:51:40,ACONFIRMAR,11845
48,4816912,WAITRY,2021-08-06 21:55:47,2021-08-06 21:56:09,ACK,11846
49,4816912,WAITRY,2021-08-06 21:56:10,2021-08-06 21:57:04,ACONFIRMAR,11846
50,4816935,WAITRY,2021-08-06 22:00:17,2021-08-06 22:01:06,ACK,11847
51,4816935,WAITRY,2021-08-06 22:01:06,2021-08-06 22:02:06,ACONFIRMAR,11847
52,4817070,WAITRY,2021-08-06 22:31:07,2021-08-06 22:32:03,ACK,11848
53,4817070,WAITRY,2021-08-06 22:32:03,2021-08-06 22:33:04,ACONFIRMAR,11848
54,4816359,WAITRY,2021-08-06 23:03:40,2021-08-06 23:04:04,ADESPACHAR,11829
55,4816440,WAITRY,2021-08-06 23:03:41,2021-08-06 23:04:04,ADESPACHAR,11831
56,4816639,WAITRY,2021-08-06 23:07:51,2021-08-06 23:08:03,ADESPACHAR,11836
57,56742749,RAPPI,2021-08-06 23:08:00,2021-08-06 23:08:03,ADESPACHAR,11827
58,4817070,WAITRY,2021-08-06 23:08:00,2021-08-06 23:08:03,ADESPACHAR,11848
59,4816866,WAITRY,2021-08-06 23:08:30,2021-08-06 23:09:03,ADESPACHAR,11844
60,4816935,WAITRY,2021-08-06 23:08:50,2021-08-06 23:09:03,ADESPACHAR,11847
0,394552924,PEDIDOSYA,2021-08-07 00:23:50,2021-08-07 00:23:59,ADESPACHAR,11837
1,394563802,PEDIDOSYA,2021-08-07 00:24:00,2021-08-07 00:24:09,ADESPACHAR,11838
2,394580770,PEDIDOSYA,2021-08-07 00:25:10,2021-08-07 00:25:19,ADESPACHAR,11841
3,394643071,PEDIDOSYA,2021-08-07 00:25:20,2021-08-07 00:25:29,ADESPACHAR,11845
4,394852819,PEDIDOSYA,2021-08-07 12:53:09,2021-08-07 12:53:17,ACK,11849
5,394852819,PEDIDOSYA,2021-08-07 12:55:21,2021-08-07 12:55:26,ACONFIRMAR,11849
6,4821774,WAITRY,2021-08-07 13:21:09,2021-08-07 13:22:03,ACK,11850
7,4821774,WAITRY,2021-08-07 13:22:03,2021-08-07 13:23:04,ACONFIRMAR,11850
8,394852819,PEDIDOSYA,2021-08-07 13:27:41,2021-08-07 13:27:46,ADESPACHAR,11849
9,394893051,PEDIDOSYA,2021-08-07 13:50:09,2021-08-07 13:50:16,ACK,11851
10,4821878,WAITRY,2021-08-07 13:50:10,2021-08-07 13:51:05,ACK,11852
11,394893051,PEDIDOSYA,2021-08-07 13:50:31,2021-08-07 13:50:36,ACONFIRMAR,11851
12,4821878,WAITRY,2021-08-07 13:51:05,2021-08-07 13:52:03,ACONFIRMAR,11852
13,394893051,PEDIDOSYA,2021-08-07 13:56:21,2021-08-07 13:56:27,ADESPACHAR,11851
14,4828590,WAITRY,2021-08-07 19:47:10,2021-08-07 19:48:08,ACK,11853
15,4828590,WAITRY,2021-08-07 19:48:08,2021-08-07 19:49:05,ACONFIRMAR,11853
16,395124221,PEDIDOSYA,2021-08-07 19:58:09,2021-08-07 19:58:17,ACK,11854
17,395124221,PEDIDOSYA,2021-08-07 20:01:04,2021-08-07 20:01:06,ACONFIRMAR,11854
18,4828481,WAITRY,2021-08-07 20:26:49,2021-08-07 20:27:06,ACK,11855
19,4828481,WAITRY,2021-08-07 20:27:14,2021-08-07 20:28:04,ACONFIRMAR,11855
20,395167987,PEDIDOSYA,2021-08-07 20:31:21,2021-08-07 20:31:30,ACK,11856
21,395167987,PEDIDOSYA,2021-08-07 20:32:04,2021-08-07 20:32:09,ACONFIRMAR,11856
22,4828718,WAITRY,2021-08-07 20:34:49,2021-08-07 20:35:08,ACK,11857
23,4828718,WAITRY,2021-08-07 20:35:24,2021-08-07 20:36:07,ACONFIRMAR,11857
24,4828756,WAITRY,2021-08-07 20:42:20,2021-08-07 20:43:05,ACK,11858
25,4828791,WAITRY,2021-08-07 20:44:39,2021-08-07 20:45:06,ACK,11859
26,4828756,WAITRY,2021-08-07 20:47:04,2021-08-07 20:47:11,ACONFIRMAR,11858
27,4828791,WAITRY,2021-08-07 20:47:04,2021-08-07 20:48:08,ACONFIRMAR,11859
28,395203758,PEDIDOSYA,2021-08-07 20:53:09,2021-08-07 20:53:17,ACK,11860
29,395203758,PEDIDOSYA,2021-08-07 20:53:54,2021-08-07 20:54:01,ACONFIRMAR,11860
30,395221724,PEDIDOSYA,2021-08-07 21:05:10,2021-08-07 21:05:18,ACK,11861
31,395221724,PEDIDOSYA,2021-08-07 21:05:54,2021-08-07 21:05:57,ACONFIRMAR,11861
32,4828891,WAITRY,2021-08-07 21:06:20,2021-08-07 21:07:07,ACK,11862
33,4828891,WAITRY,2021-08-07 21:07:07,2021-08-07 21:08:05,ACONFIRMAR,11862
34,395255024,PEDIDOSYA,2021-08-07 21:23:10,2021-08-07 21:23:19,ACK,11863
35,395255024,PEDIDOSYA,2021-08-07 21:24:14,2021-08-07 21:24:27,ACONFIRMAR,11863
36,395286988,PEDIDOSYA,2021-08-07 21:39:10,2021-08-07 21:39:19,ACK,11864
37,395286988,PEDIDOSYA,2021-08-07 21:39:44,2021-08-07 21:39:47,ACONFIRMAR,11864
38,4829088,WAITRY,2021-08-07 21:42:21,2021-08-07 21:43:06,ACK,11865
39,4829078,WAITRY,2021-08-07 21:42:39,2021-08-07 21:43:08,ACK,11866
40,4829088,WAITRY,2021-08-07 21:43:06,2021-08-07 21:44:05,ACONFIRMAR,11865
41,4829078,WAITRY,2021-08-07 21:43:08,2021-08-07 21:44:06,ACONFIRMAR,11866
42,395324973,PEDIDOSYA,2021-08-07 22:02:11,2021-08-07 22:02:24,ACK,11867
43,395324973,PEDIDOSYA,2021-08-07 22:02:44,2021-08-07 22:02:50,ACONFIRMAR,11867
44,4829146,WAITRY,2021-08-07 22:17:20,2021-08-07 22:18:03,ACK,11868
45,4829146,WAITRY,2021-08-07 22:19:34,2021-08-07 22:20:08,ACONFIRMAR,11868
46,395355391,PEDIDOSYA,2021-08-07 22:21:10,2021-08-07 22:21:18,ACK,11869
47,395355391,PEDIDOSYA,2021-08-07 22:21:44,2021-08-07 22:21:47,ACONFIRMAR,11869
48,395375556,PEDIDOSYA,2021-08-07 22:37:10,2021-08-07 22:37:17,ACK,11870
49,395375556,PEDIDOSYA,2021-08-07 22:37:24,2021-08-07 22:37:29,ACONFIRMAR,11870
50,395384269,PEDIDOSYA,2021-08-07 22:42:10,2021-08-07 22:42:17,ACK,11871
51,395384269,PEDIDOSYA,2021-08-07 22:42:24,2021-08-07 22:42:29,ACONFIRMAR,11871
52,395390947,PEDIDOSYA,2021-08-07 22:51:16,2021-08-07 22:51:18,ACK,11872
53,395390947,PEDIDOSYA,2021-08-07 22:51:34,2021-08-07 22:51:36,ACONFIRMAR,11872
54,4828481,WAITRY,2021-08-07 23:06:25,2021-08-07 23:07:03,ADESPACHAR,11855
55,4828756,WAITRY,2021-08-07 23:06:44,2021-08-07 23:07:03,ADESPACHAR,11858
56,4829088,WAITRY,2021-08-07 23:07:04,2021-08-07 23:08:03,ADESPACHAR,11865
0,395375556,PEDIDOSYA,2021-08-08 01:31:11,2021-08-08 01:31:16,ADESPACHAR,11870
1,395355391,PEDIDOSYA,2021-08-08 01:31:31,2021-08-08 01:31:36,ADESPACHAR,11869
2,395286988,PEDIDOSYA,2021-08-08 01:32:41,2021-08-08 01:32:46,ADESPACHAR,11864
3,395255024,PEDIDOSYA,2021-08-08 01:34:31,2021-08-08 01:34:36,ADESPACHAR,11863
4,395221724,PEDIDOSYA,2021-08-08 01:34:51,2021-08-08 01:34:56,ADESPACHAR,11861
5,395497407,PEDIDOSYA,2021-08-08 11:53:11,2021-08-08 11:53:20,ACK,11873
6,395497407,PEDIDOSYA,2021-08-08 11:54:47,2021-08-08 11:54:49,ACONFIRMAR,11873
7,395497407,PEDIDOSYA,2021-08-08 12:35:17,2021-08-08 12:35:20,ADESPACHAR,11873
8,395574004,PEDIDOSYA,2021-08-08 13:50:12,2021-08-08 13:50:19,ACK,11874
9,395574004,PEDIDOSYA,2021-08-08 13:50:57,2021-08-08 13:50:58,ACONFIRMAR,11874
10,395586473,PEDIDOSYA,2021-08-08 14:05:11,2021-08-08 14:05:19,ACK,11875
11,395586473,PEDIDOSYA,2021-08-08 14:05:27,2021-08-08 14:05:28,ACONFIRMAR,11875
12,395574004,PEDIDOSYA,2021-08-08 14:18:17,2021-08-08 14:18:21,ADESPACHAR,11874
13,395586473,PEDIDOSYA,2021-08-08 14:39:17,2021-08-08 14:39:28,ADESPACHAR,11875
14,395622958,PEDIDOSYA,2021-08-08 14:42:09,2021-08-08 14:42:18,ACK,11876
15,395622958,PEDIDOSYA,2021-08-08 14:42:27,2021-08-08 14:42:28,ACONFIRMAR,11876
16,395614160,PEDIDOSYA,2021-08-08 14:44:09,2021-08-08 14:44:18,ACK,11877
17,395614160,PEDIDOSYA,2021-08-08 14:44:27,2021-08-08 14:44:28,ACONFIRMAR,11877
18,4840062,WAITRY,2021-08-08 19:33:23,2021-08-08 19:34:05,ACK,11878
19,4840062,WAITRY,2021-08-08 19:38:10,2021-08-08 19:39:07,ACONFIRMAR,11878
20,4840091,WAITRY,2021-08-08 19:44:52,2021-08-08 19:45:05,ACK,11879
21,4840091,WAITRY,2021-08-08 19:45:10,2021-08-08 19:46:04,ACONFIRMAR,11879
22,4840051,WAITRY,2021-08-08 19:57:12,2021-08-08 19:58:06,ACK,11880
23,4840051,WAITRY,2021-08-08 19:59:30,2021-08-08 20:00:07,ACONFIRMAR,11880
24,4840172,WAITRY,2021-08-08 20:25:22,2021-08-08 20:26:04,ACK,11881
25,4840172,WAITRY,2021-08-08 20:26:04,2021-08-08 20:27:04,ACONFIRMAR,11881
26,395908029,PEDIDOSYA,2021-08-08 20:45:12,2021-08-08 20:45:25,ACK,11882
27,395908029,PEDIDOSYA,2021-08-08 20:46:40,2021-08-08 20:46:43,ACONFIRMAR,11882
28,4840234,WAITRY,2021-08-08 20:51:02,2021-08-08 20:51:07,ACK,11883
29,4840234,WAITRY,2021-08-08 20:52:20,2021-08-08 20:53:05,ACONFIRMAR,11883
30,4840274,WAITRY,2021-08-08 21:06:55,2021-08-08 21:07:05,ACK,11884
31,4840274,WAITRY,2021-08-08 21:07:50,2021-08-08 21:08:05,ACONFIRMAR,11884
32,4840286,WAITRY,2021-08-08 21:10:05,2021-08-08 21:11:08,ACK,11885
33,4840286,WAITRY,2021-08-08 21:11:08,2021-08-08 21:12:04,ACONFIRMAR,11885
34,395963143,PEDIDOSYA,2021-08-08 21:23:05,2021-08-08 21:23:12,ACK,11886
35,4840295,WAITRY,2021-08-08 21:23:06,2021-08-08 21:24:03,ACK,11887
36,395963143,PEDIDOSYA,2021-08-08 21:23:20,2021-08-08 21:23:34,ACONFIRMAR,11886
37,4840295,WAITRY,2021-08-08 21:24:03,2021-08-08 21:25:07,ACONFIRMAR,11887
38,4840324,WAITRY,2021-08-08 21:39:36,2021-08-08 21:40:04,ACK,11888
39,4840324,WAITRY,2021-08-08 21:40:04,2021-08-08 21:41:05,ACONFIRMAR,11888
40,396003410,PEDIDOSYA,2021-08-08 21:49:06,2021-08-08 21:49:13,ACK,11889
41,396003410,PEDIDOSYA,2021-08-08 21:56:40,2021-08-08 21:56:42,ACONFIRMAR,11889
42,4840402,WAITRY,2021-08-08 22:02:36,2021-08-08 22:03:04,ACK,11890
43,4840402,WAITRY,2021-08-08 22:07:30,2021-08-08 22:08:03,ACONFIRMAR,11890
44,396023620,PEDIDOSYA,2021-08-08 22:13:06,2021-08-08 22:13:12,ACK,11891
45,4840430,WAITRY,2021-08-08 22:13:37,2021-08-08 22:14:03,ACK,11892
46,396028994,PEDIDOSYA,2021-08-08 22:15:06,2021-08-08 22:15:12,ACK,11893
47,396023620,PEDIDOSYA,2021-08-08 22:19:50,2021-08-08 22:19:52,ACONFIRMAR,11891
48,4840430,WAITRY,2021-08-08 22:19:50,2021-08-08 22:20:05,ACONFIRMAR,11892
49,396028994,PEDIDOSYA,2021-08-08 22:19:50,2021-08-08 22:19:52,ACONFIRMAR,11893
50,4840466,WAITRY,2021-08-08 22:34:56,2021-08-08 22:35:04,ACK,11894
51,4840466,WAITRY,2021-08-08 22:35:50,2021-08-08 22:36:03,ACONFIRMAR,11894
52,4840062,WAITRY,2021-08-08 23:50:21,2021-08-08 23:51:04,ADESPACHAR,11878
53,4840295,WAITRY,2021-08-08 23:50:21,2021-08-08 23:51:04,ADESPACHAR,11887
54,4840324,WAITRY,2021-08-08 23:50:21,2021-08-08 23:51:04,ADESPACHAR,11888
55,396003410,PEDIDOSYA,2021-08-08 23:50:21,2021-08-08 23:50:24,ADESPACHAR,11889
56,4840402,WAITRY,2021-08-08 23:50:21,2021-08-08 23:51:04,ADESPACHAR,11890
57,396023620,PEDIDOSYA,2021-08-08 23:50:22,2021-08-08 23:50:32,ADESPACHAR,11891
58,4840430,WAITRY,2021-08-08 23:50:22,2021-08-08 23:51:04,ADESPACHAR,11892
59,396028994,PEDIDOSYA,2021-08-08 23:50:22,2021-08-08 23:50:32,ADESPACHAR,11893
60,4840466,WAITRY,2021-08-08 23:50:22,2021-08-08 23:51:04,ADESPACHAR,11894
61,4840091,WAITRY,2021-08-08 23:50:40,2021-08-08 23:51:04,ADESPACHAR,11879
62,4840051,WAITRY,2021-08-08 23:51:30,2021-08-08 23:52:07,ADESPACHAR,11880
63,4840172,WAITRY,2021-08-08 23:51:31,2021-08-08 23:52:07,ADESPACHAR,11881
64,4840234,WAITRY,2021-08-08 23:51:40,2021-08-08 23:52:07,ADESPACHAR,11883
65,4840274,WAITRY,2021-08-08 23:51:50,2021-08-08 23:52:07,ADESPACHAR,11884
66,4840286,WAITRY,2021-08-08 23:52:10,2021-08-08 23:53:03,ADESPACHAR,11885
0,395908029,PEDIDOSYA,2021-08-09 00:00:09,2021-08-09 00:00:12,ADESPACHAR,11882
1,395963143,PEDIDOSYA,2021-08-09 00:00:39,2021-08-09 00:00:42,ADESPACHAR,11886
2,396131861,PEDIDOSYA,2021-08-09 11:39:05,2021-08-09 11:39:13,ACK,11895
3,396131861,PEDIDOSYA,2021-08-09 11:40:23,2021-08-09 11:40:33,ACONFIRMAR,11895
4,396133602,PEDIDOSYA,2021-08-09 11:46:14,2021-08-09 11:46:23,ACK,11896
5,396133602,PEDIDOSYA,2021-08-09 11:50:13,2021-08-09 11:50:23,ACONFIRMAR,11896
6,396145840,PEDIDOSYA,2021-08-09 12:33:04,2021-08-09 12:33:15,ACK,11897
7,396145840,PEDIDOSYA,2021-08-09 12:33:15,2021-08-09 12:33:24,ACONFIRMAR,11897
8,396162483,PEDIDOSYA,2021-08-09 12:53:15,2021-08-09 12:53:27,ACK,11898
9,396162483,PEDIDOSYA,2021-08-09 12:53:33,2021-08-09 12:53:35,ACONFIRMAR,11898
10,56957648,RAPPI,2021-08-09 13:11:15,2021-08-09 13:12:05,ACK,11899
11,56957648,RAPPI,2021-08-09 13:12:04,2021-08-09 13:13:02,ACONFIRMAR,11899
12,396178149,PEDIDOSYA,2021-08-09 13:18:05,2021-08-09 13:18:16,ACK,11900
13,396178149,PEDIDOSYA,2021-08-09 13:18:16,2021-08-09 13:18:26,ACONFIRMAR,11900
14,396195253,PEDIDOSYA,2021-08-09 13:42:15,2021-08-09 13:42:26,ACK,11901
15,396195253,PEDIDOSYA,2021-08-09 13:43:03,2021-08-09 13:43:05,ACONFIRMAR,11901
16,396210660,PEDIDOSYA,2021-08-09 14:10:15,2021-08-09 14:10:24,ACK,11902
17,396210660,PEDIDOSYA,2021-08-09 14:10:34,2021-08-09 14:10:34,ACONFIRMAR,11902
18,396220925,PEDIDOSYA,2021-08-09 14:20:14,2021-08-09 14:20:24,ACK,11903
19,396220925,PEDIDOSYA,2021-08-09 14:20:44,2021-08-09 14:20:46,ACONFIRMAR,11903
20,396220925,PEDIDOSYA,2021-08-09 14:53:44,2021-08-09 14:53:54,ADESPACHAR,11903
21,396195253,PEDIDOSYA,2021-08-09 14:54:54,2021-08-09 14:55:04,ADESPACHAR,11901
22,396178149,PEDIDOSYA,2021-08-09 14:55:04,2021-08-09 14:55:14,ADESPACHAR,11900
23,4848313,WAITRY,2021-08-09 19:03:05,2021-08-09 19:04:04,ACK,11904
24,4848313,WAITRY,2021-08-09 19:04:04,2021-08-09 19:05:04,ACONFIRMAR,11904
25,396359677,PEDIDOSYA,2021-08-09 19:28:12,2021-08-09 19:28:15,ACK,11905
26,396359677,PEDIDOSYA,2021-08-09 19:28:48,2021-08-09 19:28:55,ACONFIRMAR,11905
27,396364468,PEDIDOSYA,2021-08-09 19:35:05,2021-08-09 19:35:15,ACK,11906
28,396364468,PEDIDOSYA,2021-08-09 19:35:58,2021-08-09 19:36:05,ACONFIRMAR,11906
29,4848389,WAITRY,2021-08-09 20:11:56,2021-08-09 20:12:05,ACK,11907
30,4848389,WAITRY,2021-08-09 20:13:18,2021-08-09 20:14:04,ACONFIRMAR,11907
31,396393428,PEDIDOSYA,2021-08-09 20:16:05,2021-08-09 20:16:16,ACK,11908
32,396393428,PEDIDOSYA,2021-08-09 20:17:08,2021-08-09 20:17:16,ACONFIRMAR,11908
33,396396138,PEDIDOSYA,2021-08-09 20:19:05,2021-08-09 20:19:15,ACK,11909
34,396396138,PEDIDOSYA,2021-08-09 20:19:48,2021-08-09 20:19:55,ACONFIRMAR,11909
35,4848415,WAITRY,2021-08-09 20:37:05,2021-08-09 20:38:04,ACK,11910
36,4848415,WAITRY,2021-08-09 20:38:03,2021-08-09 20:39:06,ACONFIRMAR,11910
37,56995910,RAPPI,2021-08-09 20:57:16,2021-08-09 20:58:04,ACK,11911
38,56995910,RAPPI,2021-08-09 20:59:48,2021-08-09 21:00:04,ACONFIRMAR,11911
39,56997536,RAPPI,2021-08-09 21:03:15,2021-08-09 21:04:04,ACK,11912
40,56997536,RAPPI,2021-08-09 21:04:04,2021-08-09 21:05:03,ACONFIRMAR,11912
41,56998488,RAPPI,2021-08-09 21:12:15,2021-08-09 21:13:07,ACK,11913
42,56998488,RAPPI,2021-08-09 21:14:39,2021-08-09 21:15:04,ACONFIRMAR,11913
43,4848468,WAITRY,2021-08-09 21:17:06,2021-08-09 21:18:02,ACK,11914
44,4848468,WAITRY,2021-08-09 21:18:08,2021-08-09 21:19:05,ACONFIRMAR,11914
45,57000668,RAPPI,2021-08-09 21:21:16,2021-08-09 21:22:05,ACK,11915
46,57000668,RAPPI,2021-08-09 21:22:05,2021-08-09 21:23:03,ACONFIRMAR,11915
47,4848483,WAITRY,2021-08-09 21:26:06,2021-08-09 21:27:03,ACK,11916
48,4848483,WAITRY,2021-08-09 21:27:03,2021-08-09 21:28:03,ACONFIRMAR,11916
49,57002917,RAPPI,2021-08-09 21:33:13,2021-08-09 21:34:03,ACK,11917
50,57002917,RAPPI,2021-08-09 21:34:02,2021-08-09 21:35:03,ACONFIRMAR,11917
51,396480383,PEDIDOSYA,2021-08-09 21:41:13,2021-08-09 21:41:17,ACK,11918
52,396480383,PEDIDOSYA,2021-08-09 21:42:26,2021-08-09 21:42:35,ACONFIRMAR,11918
53,4848512,WAITRY,2021-08-09 21:49:23,2021-08-09 21:50:05,ACK,11919
54,4848512,WAITRY,2021-08-09 21:50:56,2021-08-09 21:51:03,ACONFIRMAR,11919
55,57007191,RAPPI,2021-08-09 21:57:13,2021-08-09 21:58:03,ACK,11920
56,57007191,RAPPI,2021-08-09 21:58:02,2021-08-09 21:59:04,ACONFIRMAR,11920
57,396501249,PEDIDOSYA,2021-08-09 22:04:14,2021-08-09 22:04:17,ACK,11921
58,396501249,PEDIDOSYA,2021-08-09 22:10:46,2021-08-09 22:10:55,ACONFIRMAR,11921
59,396506552,PEDIDOSYA,2021-08-09 22:12:14,2021-08-09 22:12:17,ACK,11922
60,396506552,PEDIDOSYA,2021-08-09 22:12:36,2021-08-09 22:12:45,ACONFIRMAR,11922
61,396536307,PEDIDOSYA,2021-08-09 22:46:10,2021-08-09 22:46:16,ACK,11923
62,396536307,PEDIDOSYA,2021-08-09 22:48:06,2021-08-09 22:48:15,ACONFIRMAR,11923
63,4848389,WAITRY,2021-08-09 23:22:07,2021-08-09 23:23:03,ADESPACHAR,11907
0,396599632,PEDIDOSYA,2021-08-10 11:40:09,2021-08-10 11:40:14,ACK,11924
1,396599632,PEDIDOSYA,2021-08-10 11:40:45,2021-08-10 11:40:53,ACONFIRMAR,11924
2,396615819,PEDIDOSYA,2021-08-10 12:23:14,2021-08-10 12:23:16,ACK,11925
3,396615819,PEDIDOSYA,2021-08-10 12:23:25,2021-08-10 12:23:34,ACONFIRMAR,11925
4,396621503,PEDIDOSYA,2021-08-10 12:34:08,2021-08-10 12:34:15,ACK,11926
5,396621503,PEDIDOSYA,2021-08-10 12:34:25,2021-08-10 12:34:34,ACONFIRMAR,11926
6,396626093,PEDIDOSYA,2021-08-10 12:43:27,2021-08-10 12:43:36,ACK,11927
7,396626093,PEDIDOSYA,2021-08-10 12:44:05,2021-08-10 12:44:14,ACONFIRMAR,11927
8,396615819,PEDIDOSYA,2021-08-10 12:57:06,2021-08-10 12:57:15,ADESPACHAR,11925
9,396635662,PEDIDOSYA,2021-08-10 12:58:10,2021-08-10 12:58:15,ACK,11928
10,396635662,PEDIDOSYA,2021-08-10 12:58:35,2021-08-10 12:58:44,ACONFIRMAR,11928
11,396626093,PEDIDOSYA,2021-08-10 12:58:46,2021-08-10 12:58:54,ADESPACHAR,11927
12,396621503,PEDIDOSYA,2021-08-10 13:08:06,2021-08-10 13:08:14,ADESPACHAR,11926
13,4852171,WAITRY,2021-08-10 13:30:08,2021-08-10 13:31:03,ACK,11929
14,4852171,WAITRY,2021-08-10 13:31:03,2021-08-10 13:32:03,ACONFIRMAR,11929
15,57060600,RAPPI,2021-08-10 20:10:10,2021-08-10 20:11:08,ACK,11930
16,57060600,RAPPI,2021-08-10 20:11:07,2021-08-10 20:12:03,ACONFIRMAR,11930
17,57060984,RAPPI,2021-08-10 20:13:11,2021-08-10 20:14:04,ACK,11931
18,57060984,RAPPI,2021-08-10 20:14:03,2021-08-10 20:15:02,ACONFIRMAR,11931
19,4856588,WAITRY,2021-08-10 20:26:15,2021-08-10 20:27:07,ACK,11932
20,4856588,WAITRY,2021-08-10 20:27:07,2021-08-10 20:28:05,ACONFIRMAR,11932
21,4856618,WAITRY,2021-08-10 20:44:25,2021-08-10 20:45:07,ACK,11933
22,4856618,WAITRY,2021-08-10 20:45:07,2021-08-10 20:46:04,ACONFIRMAR,11933
23,57072544,RAPPI,2021-08-10 21:16:13,2021-08-10 21:17:03,ACK,11934
24,57072544,RAPPI,2021-08-10 21:17:02,2021-08-10 21:18:04,ACONFIRMAR,11934
25,57073535,RAPPI,2021-08-10 21:22:13,2021-08-10 21:23:06,ACK,11935
26,4856681,WAITRY,2021-08-10 21:23:03,2021-08-10 21:24:03,ACK,11936
27,57073535,RAPPI,2021-08-10 21:24:08,2021-08-10 21:25:05,ACONFIRMAR,11935
28,4856681,WAITRY,2021-08-10 21:24:08,2021-08-10 21:25:06,ACONFIRMAR,11936
29,57060600,RAPPI,2021-08-10 21:31:29,2021-08-10 21:32:03,ADESPACHAR,11930
30,57072544,RAPPI,2021-08-10 22:02:09,2021-08-10 22:03:03,ADESPACHAR,11934
31,57073535,RAPPI,2021-08-10 22:02:28,2021-08-10 22:03:04,ADESPACHAR,11935
32,396989067,PEDIDOSYA,2021-08-10 22:03:10,2021-08-10 22:03:20,ACK,11937
33,396989067,PEDIDOSYA,2021-08-10 22:03:20,2021-08-10 22:03:29,ACONFIRMAR,11937
34,397027877,PEDIDOSYA,2021-08-10 22:47:07,2021-08-10 22:47:10,ACK,11938
35,397027877,PEDIDOSYA,2021-08-10 22:47:52,2021-08-10 22:47:59,ACONFIRMAR,11938
36,397027877,PEDIDOSYA,2021-08-10 23:10:22,2021-08-10 23:10:29,ADESPACHAR,11938
0,397163264,PEDIDOSYA,2021-08-11 13:53:10,2021-08-11 13:53:20,ACK,11939
1,397163264,PEDIDOSYA,2021-08-11 13:53:49,2021-08-11 13:53:51,ACONFIRMAR,11939
2,57110933,RAPPI,2021-08-11 14:07:03,2021-08-11 14:07:04,ACK,11940
3,57110933,RAPPI,2021-08-11 14:07:19,2021-08-11 14:08:02,ACONFIRMAR,11940
4,397190130,PEDIDOSYA,2021-08-11 14:30:17,2021-08-11 14:30:22,ACK,11941
5,397190130,PEDIDOSYA,2021-08-11 14:30:59,2021-08-11 14:31:01,ACONFIRMAR,11941
6,57113777,RAPPI,2021-08-11 14:39:19,2021-08-11 14:40:03,ACK,11942
7,57113777,RAPPI,2021-08-11 14:40:29,2021-08-11 14:41:02,ACONFIRMAR,11942
8,57110933,RAPPI,2021-08-11 15:39:20,2021-08-11 15:40:03,ADESPACHAR,11940
9,57113777,RAPPI,2021-08-11 15:39:30,2021-08-11 15:40:03,ADESPACHAR,11942
10,397163264,PEDIDOSYA,2021-08-11 15:39:50,2021-08-11 15:39:50,ADESPACHAR,11939
11,397190130,PEDIDOSYA,2021-08-11 15:40:00,2021-08-11 15:40:00,ADESPACHAR,11941
12,57132557,RAPPI,2021-08-11 19:52:11,2021-08-11 19:53:03,ACK,11943
13,57132557,RAPPI,2021-08-11 19:53:02,2021-08-11 19:54:02,ACONFIRMAR,11943
14,397344143,PEDIDOSYA,2021-08-11 20:00:16,2021-08-11 20:00:22,ACK,11944
15,397344143,PEDIDOSYA,2021-08-11 20:00:40,2021-08-11 20:00:42,ACONFIRMAR,11944
16,4864893,WAITRY,2021-08-11 20:05:09,2021-08-11 20:06:03,ACK,11945
17,4864893,WAITRY,2021-08-11 20:06:03,2021-08-11 20:07:04,ACONFIRMAR,11945
18,57136587,RAPPI,2021-08-11 20:19:42,2021-08-11 20:20:04,ACK,11946
19,57136587,RAPPI,2021-08-11 20:20:04,2021-08-11 20:21:04,ACONFIRMAR,11946
20,397365603,PEDIDOSYA,2021-08-11 20:22:29,2021-08-11 20:22:35,ACK,11947
21,397365603,PEDIDOSYA,2021-08-11 20:22:50,2021-08-11 20:22:51,ACONFIRMAR,11947
22,397372864,PEDIDOSYA,2021-08-11 20:29:04,2021-08-11 20:29:11,ACK,11948
23,4864934,WAITRY,2021-08-11 20:29:04,2021-08-11 20:30:03,ACK,11949
24,397372864,PEDIDOSYA,2021-08-11 20:29:30,2021-08-11 20:29:36,ACONFIRMAR,11948
25,4864934,WAITRY,2021-08-11 20:30:03,2021-08-11 20:31:04,ACONFIRMAR,11949
26,397375268,PEDIDOSYA,2021-08-11 20:30:15,2021-08-11 20:30:24,ACK,11950
27,397375268,PEDIDOSYA,2021-08-11 20:32:50,2021-08-11 20:32:55,ACONFIRMAR,11950
28,397398643,PEDIDOSYA,2021-08-11 20:49:11,2021-08-11 20:49:22,ACK,11951
29,397398643,PEDIDOSYA,2021-08-11 20:49:40,2021-08-11 20:49:42,ACONFIRMAR,11951
30,4864995,WAITRY,2021-08-11 20:53:58,2021-08-11 20:54:05,ACK,11952
31,4864995,WAITRY,2021-08-11 20:54:30,2021-08-11 20:55:08,ACONFIRMAR,11952
32,397428528,PEDIDOSYA,2021-08-11 21:13:42,2021-08-11 21:13:51,ACK,11953
33,397431637,PEDIDOSYA,2021-08-11 21:15:26,2021-08-11 21:15:32,ACK,11954
34,397428528,PEDIDOSYA,2021-08-11 21:16:00,2021-08-11 21:16:03,ACONFIRMAR,11953
35,397431637,PEDIDOSYA,2021-08-11 21:16:00,2021-08-11 21:16:04,ACONFIRMAR,11954
36,397454425,PEDIDOSYA,2021-08-11 21:32:08,2021-08-11 21:32:12,ACK,11955
37,397454425,PEDIDOSYA,2021-08-11 21:35:20,2021-08-11 21:35:34,ACONFIRMAR,11955
38,57152880,RAPPI,2021-08-11 21:38:29,2021-08-11 21:39:07,ACK,11956
39,57152880,RAPPI,2021-08-11 21:39:20,2021-08-11 21:40:03,ACONFIRMAR,11956
40,57157245,RAPPI,2021-08-11 22:04:12,2021-08-11 22:05:03,ACK,11957
41,57157245,RAPPI,2021-08-11 22:05:03,2021-08-11 22:06:03,ACONFIRMAR,11957
0,57174653,RAPPI,2021-08-12 11:57:18,2021-08-12 11:58:05,ACK,11958
1,57174653,RAPPI,2021-08-12 11:58:04,2021-08-12 11:59:03,ACONFIRMAR,11958
2,397615345,PEDIDOSYA,2021-08-12 12:33:14,2021-08-12 12:33:18,ACK,11959
3,397615345,PEDIDOSYA,2021-08-12 12:33:28,2021-08-12 12:33:36,ACONFIRMAR,11959
4,397624026,PEDIDOSYA,2021-08-12 12:49:10,2021-08-12 12:49:17,ACK,11960
5,397624627,PEDIDOSYA,2021-08-12 12:49:10,2021-08-12 12:49:19,ACK,11961
6,397624026,PEDIDOSYA,2021-08-12 12:49:47,2021-08-12 12:49:56,ACONFIRMAR,11960
7,397624627,PEDIDOSYA,2021-08-12 12:49:48,2021-08-12 12:49:56,ACONFIRMAR,11961
8,57186566,RAPPI,2021-08-12 13:42:19,2021-08-12 13:43:04,ACK,11962
9,57186566,RAPPI,2021-08-12 13:43:03,2021-08-12 13:44:03,ACONFIRMAR,11962
10,57189723,RAPPI,2021-08-12 14:15:19,2021-08-12 14:16:03,ACK,11963
11,57189723,RAPPI,2021-08-12 14:16:03,2021-08-12 14:17:02,ACONFIRMAR,11963
12,57189723,RAPPI,2021-08-12 15:00:28,2021-08-12 15:01:05,ADESPACHAR,11963
13,57186566,RAPPI,2021-08-12 15:00:58,2021-08-12 15:01:05,ADESPACHAR,11962
14,57174653,RAPPI,2021-08-12 15:01:08,2021-08-12 15:02:05,ADESPACHAR,11958
15,397615345,PEDIDOSYA,2021-08-12 15:01:18,2021-08-12 15:01:27,ADESPACHAR,11959
16,397624026,PEDIDOSYA,2021-08-12 15:01:28,2021-08-12 15:01:36,ADESPACHAR,11960
17,4873645,WAITRY,2021-08-12 19:49:39,2021-08-12 19:50:04,ACK,11964
18,4873645,WAITRY,2021-08-12 19:50:08,2021-08-12 19:51:04,ACONFIRMAR,11964
19,4873680,WAITRY,2021-08-12 20:08:46,2021-08-12 20:09:05,ACK,11965
20,4873680,WAITRY,2021-08-12 20:09:08,2021-08-12 20:10:05,ACONFIRMAR,11965
21,4873706,WAITRY,2021-08-12 20:15:57,2021-08-12 20:16:07,ACK,11966
22,4873706,WAITRY,2021-08-12 20:17:16,2021-08-12 20:18:08,ACONFIRMAR,11966
23,397885674,PEDIDOSYA,2021-08-12 20:27:06,2021-08-12 20:27:13,ACK,11967
24,397885674,PEDIDOSYA,2021-08-12 20:27:26,2021-08-12 20:27:31,ACONFIRMAR,11967
25,397887492,PEDIDOSYA,2021-08-12 20:29:06,2021-08-12 20:29:12,ACK,11968
26,397887492,PEDIDOSYA,2021-08-12 20:32:46,2021-08-12 20:32:51,ACONFIRMAR,11968
27,397896440,PEDIDOSYA,2021-08-12 20:36:12,2021-08-12 20:36:22,ACK,11969
28,397896440,PEDIDOSYA,2021-08-12 20:36:26,2021-08-12 20:36:33,ACONFIRMAR,11969
29,4873762,WAITRY,2021-08-12 20:43:15,2021-08-12 20:44:02,ACK,11970
30,4873762,WAITRY,2021-08-12 20:44:02,2021-08-12 20:45:04,ACONFIRMAR,11970
31,397919864,PEDIDOSYA,2021-08-12 20:54:21,2021-08-12 20:54:34,ACK,11971
32,397919864,PEDIDOSYA,2021-08-12 20:54:59,2021-08-12 20:55:03,ACONFIRMAR,11971
33,397922857,PEDIDOSYA,2021-08-12 20:58:51,2021-08-12 20:59:01,ACK,11972
34,397922857,PEDIDOSYA,2021-08-12 20:59:19,2021-08-12 20:59:31,ACONFIRMAR,11972
35,4873866,WAITRY,2021-08-12 21:14:51,2021-08-12 21:15:08,ACK,11973
36,4873866,WAITRY,2021-08-12 21:15:39,2021-08-12 21:16:04,ACONFIRMAR,11973
37,397963269,PEDIDOSYA,2021-08-12 21:25:12,2021-08-12 21:25:22,ACK,11974
38,397963269,PEDIDOSYA,2021-08-12 21:25:59,2021-08-12 21:26:01,ACONFIRMAR,11974
39,397964790,PEDIDOSYA,2021-08-12 21:26:12,2021-08-12 21:26:24,ACK,11975
40,397964790,PEDIDOSYA,2021-08-12 21:26:29,2021-08-12 21:26:31,ACONFIRMAR,11975
41,4873937,WAITRY,2021-08-12 21:36:45,2021-08-12 21:37:06,ACK,11976
42,4873937,WAITRY,2021-08-12 21:37:06,2021-08-12 21:38:03,ACONFIRMAR,11976
43,4873681,WAITRY,2021-08-12 21:38:15,2021-08-12 21:39:04,ACK,11977
44,4873681,WAITRY,2021-08-12 21:39:04,2021-08-12 21:40:05,ACONFIRMAR,11977
45,397988231,PEDIDOSYA,2021-08-12 21:44:20,2021-08-12 21:44:30,ACK,11978
46,397988231,PEDIDOSYA,2021-08-12 21:44:39,2021-08-12 21:44:44,ACONFIRMAR,11978
47,397990431,PEDIDOSYA,2021-08-12 21:48:11,2021-08-12 21:48:20,ACK,11979
48,397990431,PEDIDOSYA,2021-08-12 21:48:39,2021-08-12 21:48:41,ACONFIRMAR,11979
49,57235455,RAPPI,2021-08-12 21:53:12,2021-08-12 21:54:04,ACK,11980
50,57235455,RAPPI,2021-08-12 21:54:03,2021-08-12 21:55:05,ACONFIRMAR,11980
51,398000918,PEDIDOSYA,2021-08-12 21:55:01,2021-08-12 21:55:10,ACK,11981
52,4873982,WAITRY,2021-08-12 21:55:02,2021-08-12 21:55:06,ACK,11982
53,398000918,PEDIDOSYA,2021-08-12 21:56:59,2021-08-12 21:57:05,ACONFIRMAR,11981
54,4873982,WAITRY,2021-08-12 21:56:59,2021-08-12 21:57:10,ACONFIRMAR,11982
55,4874006,WAITRY,2021-08-12 22:00:42,2021-08-12 22:01:05,ACK,11983
56,4874006,WAITRY,2021-08-12 22:02:19,2021-08-12 22:03:05,ACONFIRMAR,11983
57,398037876,PEDIDOSYA,2021-08-12 22:31:26,2021-08-12 22:31:32,ACK,11984
58,398037876,PEDIDOSYA,2021-08-12 22:36:19,2021-08-12 22:36:24,ACONFIRMAR,11984
59,397885674,PEDIDOSYA,2021-08-12 23:00:00,2021-08-12 23:00:01,ADESPACHAR,11967
60,4873645,WAITRY,2021-08-12 23:00:50,2021-08-12 23:01:04,ADESPACHAR,11964
61,4873706,WAITRY,2021-08-12 23:01:00,2021-08-12 23:01:04,ADESPACHAR,11966
62,4873762,WAITRY,2021-08-12 23:01:10,2021-08-12 23:02:05,ADESPACHAR,11970
63,4873982,WAITRY,2021-08-12 23:01:20,2021-08-12 23:02:05,ADESPACHAR,11982
64,4874101,WAITRY,2021-08-12 23:09:00,2021-08-12 23:09:03,ACK,11985
65,4874101,WAITRY,2021-08-12 23:09:19,2021-08-12 23:10:04,ACONFIRMAR,11985
66,397887492,PEDIDOSYA,2021-08-12 23:43:10,2021-08-12 23:43:11,ADESPACHAR,11968
67,397896440,PEDIDOSYA,2021-08-12 23:44:00,2021-08-12 23:44:01,ADESPACHAR,11969
68,397919864,PEDIDOSYA,2021-08-12 23:44:10,2021-08-12 23:44:11,ADESPACHAR,11971
69,397963269,PEDIDOSYA,2021-08-12 23:45:10,2021-08-12 23:45:10,ADESPACHAR,11974
70,397964790,PEDIDOSYA,2021-08-12 23:45:30,2021-08-12 23:45:30,ADESPACHAR,11975
71,397988231,PEDIDOSYA,2021-08-12 23:45:50,2021-08-12 23:45:50,ADESPACHAR,11978
72,397990431,PEDIDOSYA,2021-08-12 23:46:00,2021-08-12 23:46:00,ADESPACHAR,11979
73,398037876,PEDIDOSYA,2021-08-12 23:46:20,2021-08-12 23:46:21,ADESPACHAR,11984
0,398140930,PEDIDOSYA,2021-08-13 12:30:14,2021-08-13 12:30:22,ACK,11986
1,398140930,PEDIDOSYA,2021-08-13 12:30:33,2021-08-13 12:30:40,ACONFIRMAR,11986
2,398153186,PEDIDOSYA,2021-08-13 12:50:15,2021-08-13 12:50:23,ACK,11987
3,398153186,PEDIDOSYA,2021-08-13 12:50:54,2021-08-13 12:51:00,ACONFIRMAR,11987
4,4877959,WAITRY,2021-08-13 12:51:04,2021-08-13 12:51:09,ACK,11988
5,4877959,WAITRY,2021-08-13 12:51:23,2021-08-13 12:52:03,ACONFIRMAR,11988
6,398160731,PEDIDOSYA,2021-08-13 13:01:14,2021-08-13 13:01:21,ACK,11989
7,398160731,PEDIDOSYA,2021-08-13 13:01:33,2021-08-13 13:01:39,ACONFIRMAR,11989
8,398140930,PEDIDOSYA,2021-08-13 13:27:04,2021-08-13 13:27:09,ADESPACHAR,11986
9,398153186,PEDIDOSYA,2021-08-13 13:27:14,2021-08-13 13:27:20,ADESPACHAR,11987
10,398185177,PEDIDOSYA,2021-08-13 13:32:14,2021-08-13 13:32:23,ACK,11990
11,398185177,PEDIDOSYA,2021-08-13 13:32:24,2021-08-13 13:32:29,ACONFIRMAR,11990
12,398210318,PEDIDOSYA,2021-08-13 14:03:14,2021-08-13 14:03:20,ACK,11991
13,398210318,PEDIDOSYA,2021-08-13 14:03:54,2021-08-13 14:04:00,ARECHAZAR,11991
14,398211765,PEDIDOSYA,2021-08-13 14:05:14,2021-08-13 14:05:20,ACK,11992
15,398211765,PEDIDOSYA,2021-08-13 14:05:24,2021-08-13 14:05:29,ACONFIRMAR,11992
16,57272665,RAPPI,2021-08-13 14:20:15,2021-08-13 14:21:04,ACK,11993
17,57272665,RAPPI,2021-08-13 14:21:03,2021-08-13 14:22:03,ACONFIRMAR,11993
18,398185177,PEDIDOSYA,2021-08-13 15:27:24,2021-08-13 15:27:30,ADESPACHAR,11990
19,398407413,PEDIDOSYA,2021-08-13 19:58:16,2021-08-13 19:58:20,ACK,11994
20,398407413,PEDIDOSYA,2021-08-13 20:00:44,2021-08-13 20:00:49,ACONFIRMAR,11994
21,57299360,RAPPI,2021-08-13 20:07:15,2021-08-13 20:08:10,ACK,11995
22,4884277,WAITRY,2021-08-13 20:07:55,2021-08-13 20:08:11,ACK,11996
23,57299360,RAPPI,2021-08-13 20:08:09,2021-08-13 20:09:03,ACONFIRMAR,11995
24,4884277,WAITRY,2021-08-13 20:08:24,2021-08-13 20:09:05,ACONFIRMAR,11996
25,398426084,PEDIDOSYA,2021-08-13 20:13:06,2021-08-13 20:13:11,ACK,11997
26,398426084,PEDIDOSYA,2021-08-13 20:13:34,2021-08-13 20:13:39,ACONFIRMAR,11997
27,398436697,PEDIDOSYA,2021-08-13 20:21:15,2021-08-13 20:21:21,ACK,11998
28,398436697,PEDIDOSYA,2021-08-13 20:21:34,2021-08-13 20:21:39,ACONFIRMAR,11998
29,4884336,WAITRY,2021-08-13 20:24:26,2021-08-13 20:25:12,ACK,11999
30,4884336,WAITRY,2021-08-13 20:27:54,2021-08-13 20:28:11,ACONFIRMAR,11999
31,398450864,PEDIDOSYA,2021-08-13 20:30:16,2021-08-13 20:30:26,ACK,12000
32,398450864,PEDIDOSYA,2021-08-13 20:30:54,2021-08-13 20:31:01,ACONFIRMAR,12000
33,4884333,WAITRY,2021-08-13 20:33:55,2021-08-13 20:34:08,ACK,12001
34,4884354,WAITRY,2021-08-13 20:33:56,2021-08-13 20:34:08,ACK,12002
35,4884333,WAITRY,2021-08-13 20:34:44,2021-08-13 20:35:08,ACONFIRMAR,12001
36,4884354,WAITRY,2021-08-13 20:34:44,2021-08-13 20:35:09,ACONFIRMAR,12002
37,4884366,WAITRY,2021-08-13 20:34:46,2021-08-13 20:35:09,ACK,12003
38,4884366,WAITRY,2021-08-13 20:35:24,2021-08-13 20:36:07,ACONFIRMAR,12003
39,57307642,RAPPI,2021-08-13 20:37:16,2021-08-13 20:38:07,ACK,12004
40,57307642,RAPPI,2021-08-13 20:38:14,2021-08-13 20:39:13,ACONFIRMAR,12004
41,398485833,PEDIDOSYA,2021-08-13 20:50:16,2021-08-13 20:50:23,ACK,12005
42,398485833,PEDIDOSYA,2021-08-13 20:51:34,2021-08-13 20:51:41,ACONFIRMAR,12005
43,398490053,PEDIDOSYA,2021-08-13 20:53:41,2021-08-13 20:53:48,ACK,12006
44,398490053,PEDIDOSYA,2021-08-13 20:54:04,2021-08-13 20:54:14,ACONFIRMAR,12006
45,57314668,RAPPI,2021-08-13 21:01:16,2021-08-13 21:02:07,ACK,12007
46,57315432,RAPPI,2021-08-13 21:01:16,2021-08-13 21:02:07,ACK,12008
47,57314668,RAPPI,2021-08-13 21:02:06,2021-08-13 21:03:03,ACONFIRMAR,12007
48,57315432,RAPPI,2021-08-13 21:02:07,2021-08-13 21:03:05,ACONFIRMAR,12008
49,4884446,WAITRY,2021-08-13 21:04:16,2021-08-13 21:05:04,ACK,12009
50,4884446,WAITRY,2021-08-13 21:05:04,2021-08-13 21:06:06,ACONFIRMAR,12009
51,4884466,WAITRY,2021-08-13 21:10:26,2021-08-13 21:11:08,ACK,12010
52,4884466,WAITRY,2021-08-13 21:12:14,2021-08-13 21:13:05,ACONFIRMAR,12010
53,4884532,WAITRY,2021-08-13 21:16:36,2021-08-13 21:17:07,ACK,12011
54,4884532,WAITRY,2021-08-13 21:17:34,2021-08-13 21:18:12,ACONFIRMAR,12011
55,398538744,PEDIDOSYA,2021-08-13 21:18:41,2021-08-13 21:18:46,ACK,12012
56,398538744,PEDIDOSYA,2021-08-13 21:19:54,2021-08-13 21:19:56,ACONFIRMAR,12012
57,57321202,RAPPI,2021-08-13 21:21:17,2021-08-13 21:22:05,ACK,12013
58,57321202,RAPPI,2021-08-13 21:22:04,2021-08-13 21:23:05,ACONFIRMAR,12013
59,398567475,PEDIDOSYA,2021-08-13 21:33:16,2021-08-13 21:33:23,ACK,12014
60,398567475,PEDIDOSYA,2021-08-13 21:33:24,2021-08-13 21:33:38,ACONFIRMAR,12014
61,4884586,WAITRY,2021-08-13 21:33:26,2021-08-13 21:34:04,ACK,12015
62,4884586,WAITRY,2021-08-13 21:34:34,2021-08-13 21:35:07,ACONFIRMAR,12015
63,398603508,PEDIDOSYA,2021-08-13 21:53:06,2021-08-13 21:53:10,ACK,12016
64,398603508,PEDIDOSYA,2021-08-13 21:53:34,2021-08-13 21:53:40,ACONFIRMAR,12016
65,57330450,RAPPI,2021-08-13 21:54:16,2021-08-13 21:55:04,ACK,12017
66,57330450,RAPPI,2021-08-13 21:55:04,2021-08-13 21:56:03,ACONFIRMAR,12017
67,398618180,PEDIDOSYA,2021-08-13 22:05:16,2021-08-13 22:05:21,ACK,12018
68,4884706,WAITRY,2021-08-13 22:05:17,2021-08-13 22:06:04,ACK,12019
69,398618180,PEDIDOSYA,2021-08-13 22:05:34,2021-08-13 22:05:40,ACONFIRMAR,12018
70,4884706,WAITRY,2021-08-13 22:06:04,2021-08-13 22:07:03,ACONFIRMAR,12019
71,4884771,WAITRY,2021-08-13 22:26:26,2021-08-13 22:27:05,ACK,12020
72,4884771,WAITRY,2021-08-13 22:27:05,2021-08-13 22:28:03,ACONFIRMAR,12020
73,4884277,WAITRY,2021-08-13 23:11:06,2021-08-13 23:12:04,ADESPACHAR,11996
74,4884446,WAITRY,2021-08-13 23:11:36,2021-08-13 23:12:04,ADESPACHAR,12009
75,4884532,WAITRY,2021-08-13 23:12:06,2021-08-13 23:13:03,ADESPACHAR,12011
76,4884706,WAITRY,2021-08-13 23:12:26,2021-08-13 23:13:03,ADESPACHAR,12019
77,57330450,RAPPI,2021-08-13 23:42:46,2021-08-13 23:43:04,ADESPACHAR,12017
78,398485833,PEDIDOSYA,2021-08-13 23:47:06,2021-08-13 23:47:09,ADESPACHAR,12005
79,398490053,PEDIDOSYA,2021-08-13 23:47:16,2021-08-13 23:47:19,ADESPACHAR,12006
80,398538744,PEDIDOSYA,2021-08-13 23:47:46,2021-08-13 23:47:49,ADESPACHAR,12012
81,398567475,PEDIDOSYA,2021-08-13 23:48:26,2021-08-13 23:48:30,ADESPACHAR,12014
82,57299360,RAPPI,2021-08-13 23:48:46,2021-08-13 23:49:03,ADESPACHAR,11995
83,57314668,RAPPI,2021-08-13 23:49:06,2021-08-13 23:50:03,ADESPACHAR,12007
0,398780494,PEDIDOSYA,2021-08-14 12:00:09,2021-08-14 12:03:15,ACK,12021
1,398780494,PEDIDOSYA,2021-08-14 12:03:15,2021-08-14 12:03:24,ACONFIRMAR,12021
2,57359727,RAPPI,2021-08-14 12:18:18,2021-08-14 12:19:04,ACK,12022
3,57359727,RAPPI,2021-08-14 12:19:04,2021-08-14 12:20:04,ACONFIRMAR,12022
4,398789440,PEDIDOSYA,2021-08-14 12:23:08,2021-08-14 12:23:14,ACK,12023
5,398789440,PEDIDOSYA,2021-08-14 12:24:04,2021-08-14 12:24:14,ACONFIRMAR,12023
6,4888998,WAITRY,2021-08-14 12:42:18,2021-08-14 12:43:02,ACK,12024
7,4888998,WAITRY,2021-08-14 12:43:02,2021-08-14 12:44:03,ACONFIRMAR,12024
8,4889084,WAITRY,2021-08-14 13:16:08,2021-08-14 13:17:04,ACK,12025
9,4889084,WAITRY,2021-08-14 13:17:04,2021-08-14 13:18:04,ACONFIRMAR,12025
10,398890226,PEDIDOSYA,2021-08-14 14:49:08,2021-08-14 14:49:14,ACK,12026
11,398890226,PEDIDOSYA,2021-08-14 14:49:24,2021-08-14 14:49:34,ACONFIRMAR,12026
12,398898585,PEDIDOSYA,2021-08-14 15:01:08,2021-08-14 15:01:14,ACK,12027
13,398898585,PEDIDOSYA,2021-08-14 15:01:44,2021-08-14 15:01:54,ACONFIRMAR,12027
14,57359727,RAPPI,2021-08-14 15:48:25,2021-08-14 15:49:04,ADESPACHAR,12022
15,398780494,PEDIDOSYA,2021-08-14 15:48:35,2021-08-14 15:48:44,ADESPACHAR,12021
16,398789440,PEDIDOSYA,2021-08-14 15:48:45,2021-08-14 15:48:54,ADESPACHAR,12023
17,398898585,PEDIDOSYA,2021-08-14 15:49:05,2021-08-14 15:49:14,ADESPACHAR,12027
18,4895423,WAITRY,2021-08-14 19:28:59,2021-08-14 19:29:05,ACK,12028
19,4895423,WAITRY,2021-08-14 19:29:45,2021-08-14 19:30:09,ACONFIRMAR,12028
20,57396050,RAPPI,2021-08-14 19:36:19,2021-08-14 19:37:06,ACK,12029
21,57396050,RAPPI,2021-08-14 19:37:05,2021-08-14 19:38:03,ACONFIRMAR,12029
22,4895466,WAITRY,2021-08-14 19:44:29,2021-08-14 19:45:08,ACK,12030
23,399060728,PEDIDOSYA,2021-08-14 19:46:09,2021-08-14 19:46:13,ACK,12031
24,4895466,WAITRY,2021-08-14 19:49:35,2021-08-14 19:50:07,ACONFIRMAR,12030
25,399060728,PEDIDOSYA,2021-08-14 19:49:35,2021-08-14 19:49:42,ACONFIRMAR,12031
26,57399677,RAPPI,2021-08-14 20:03:19,2021-08-14 20:04:08,ACK,12032
27,57399677,RAPPI,2021-08-14 20:04:07,2021-08-14 20:05:03,ACONFIRMAR,12032
28,57406286,RAPPI,2021-08-14 20:33:20,2021-08-14 20:34:05,ACK,12033
29,57406286,RAPPI,2021-08-14 20:34:05,2021-08-14 20:35:04,ACONFIRMAR,12033
30,399120917,PEDIDOSYA,2021-08-14 20:35:10,2021-08-14 20:35:14,ACK,12034
31,399120917,PEDIDOSYA,2021-08-14 20:36:25,2021-08-14 20:36:31,ACONFIRMAR,12034
32,4895613,WAITRY,2021-08-14 20:47:49,2021-08-14 20:48:09,ACK,12035
33,4895613,WAITRY,2021-08-14 20:48:15,2021-08-14 20:49:06,ACONFIRMAR,12035
34,4895736,WAITRY,2021-08-14 20:52:20,2021-08-14 20:53:07,ACK,12036
35,4895736,WAITRY,2021-08-14 20:53:07,2021-08-14 20:54:10,ACONFIRMAR,12036
36,399152382,PEDIDOSYA,2021-08-14 20:56:10,2021-08-14 20:56:16,ACK,12037
37,399152382,PEDIDOSYA,2021-08-14 20:57:15,2021-08-14 20:57:29,ACONFIRMAR,12037
38,399169091,PEDIDOSYA,2021-08-14 21:05:10,2021-08-14 21:05:17,ACK,12038
39,399170813,PEDIDOSYA,2021-08-14 21:05:11,2021-08-14 21:05:19,ACK,12039
40,399169091,PEDIDOSYA,2021-08-14 21:06:15,2021-08-14 21:06:28,ACONFIRMAR,12038
41,399170813,PEDIDOSYA,2021-08-14 21:06:15,2021-08-14 21:06:29,ACONFIRMAR,12039
42,399176305,PEDIDOSYA,2021-08-14 21:10:11,2021-08-14 21:10:24,ACK,12040
43,399176305,PEDIDOSYA,2021-08-14 21:11:15,2021-08-14 21:11:22,ACONFIRMAR,12040
44,4895811,WAITRY,2021-08-14 21:15:49,2021-08-14 21:16:07,ACK,12041
45,4895811,WAITRY,2021-08-14 21:16:15,2021-08-14 21:17:06,ACONFIRMAR,12041
46,399204120,PEDIDOSYA,2021-08-14 21:23:10,2021-08-14 21:23:19,ACK,12042
47,399204120,PEDIDOSYA,2021-08-14 21:24:25,2021-08-14 21:24:32,ACONFIRMAR,12042
48,399211417,PEDIDOSYA,2021-08-14 21:27:11,2021-08-14 21:27:24,ACK,12043
49,399211417,PEDIDOSYA,2021-08-14 21:29:25,2021-08-14 21:29:33,ACONFIRMAR,12043
50,4895854,WAITRY,2021-08-14 21:32:49,2021-08-14 21:33:05,ACK,12044
51,4895854,WAITRY,2021-08-14 21:33:05,2021-08-14 21:34:04,ACONFIRMAR,12044
52,399237930,PEDIDOSYA,2021-08-14 21:41:59,2021-08-14 21:42:03,ACK,12045
53,4895951,WAITRY,2021-08-14 21:42:00,2021-08-14 21:42:07,ACK,12046
54,399237930,PEDIDOSYA,2021-08-14 21:42:25,2021-08-14 21:42:32,ACONFIRMAR,12045
55,4895951,WAITRY,2021-08-14 21:42:25,2021-08-14 21:43:06,ACONFIRMAR,12046
56,57426612,RAPPI,2021-08-14 21:45:19,2021-08-14 21:46:06,ACK,12047
57,57426612,RAPPI,2021-08-14 21:46:06,2021-08-14 21:47:03,ACONFIRMAR,12047
58,399243166,PEDIDOSYA,2021-08-14 21:46:11,2021-08-14 21:46:17,ACK,12048
59,399243166,PEDIDOSYA,2021-08-14 21:46:25,2021-08-14 21:46:32,ACONFIRMAR,12048
60,4895997,WAITRY,2021-08-14 21:50:49,2021-08-14 21:51:04,ACK,12049
61,4895997,WAITRY,2021-08-14 21:51:15,2021-08-14 21:52:05,ACONFIRMAR,12049
62,4896043,WAITRY,2021-08-14 22:00:10,2021-08-14 22:01:04,ACK,12050
63,4896043,WAITRY,2021-08-14 22:01:04,2021-08-14 22:02:04,ACONFIRMAR,12050
64,4896126,WAITRY,2021-08-14 22:19:40,2021-08-14 22:20:06,ACK,12051
65,4896126,WAITRY,2021-08-14 22:22:15,2021-08-14 22:23:08,ACONFIRMAR,12051
66,4896149,WAITRY,2021-08-14 22:23:50,2021-08-14 22:24:06,ACK,12052
67,4896143,WAITRY,2021-08-14 22:23:50,2021-08-14 22:24:06,ACK,12053
68,4896149,WAITRY,2021-08-14 22:25:05,2021-08-14 22:25:09,ACONFIRMAR,12052
69,4896143,WAITRY,2021-08-14 22:25:05,2021-08-14 22:25:10,ACONFIRMAR,12053
70,4895423,WAITRY,2021-08-14 22:53:16,2021-08-14 22:54:02,ADESPACHAR,12028
71,57426612,RAPPI,2021-08-14 22:53:16,2021-08-14 22:54:02,ADESPACHAR,12047
72,399243166,PEDIDOSYA,2021-08-14 22:53:16,2021-08-14 22:53:22,ADESPACHAR,12048
73,4896126,WAITRY,2021-08-14 22:53:16,2021-08-14 22:54:02,ADESPACHAR,12051
74,4896149,WAITRY,2021-08-14 22:53:17,2021-08-14 22:54:02,ADESPACHAR,12052
75,4896143,WAITRY,2021-08-14 22:53:17,2021-08-14 22:54:02,ADESPACHAR,12053
76,4895736,WAITRY,2021-08-14 22:53:56,2021-08-14 22:54:04,ADESPACHAR,12036
77,4895951,WAITRY,2021-08-14 22:54:15,2021-08-14 22:55:06,ADESPACHAR,12046
78,4895613,WAITRY,2021-08-14 23:22:36,2021-08-14 23:23:03,ADESPACHAR,12035
79,4895854,WAITRY,2021-08-14 23:22:46,2021-08-14 23:23:03,ADESPACHAR,12044
0,4896416,WAITRY,2021-08-15 00:01:01,2021-08-15 00:01:03,ACK,12054
1,4896416,WAITRY,2021-08-15 00:01:24,2021-08-15 00:02:04,ACONFIRMAR,12054
2,4896445,WAITRY,2021-08-15 00:14:19,2021-08-15 00:15:02,ACK,12055
3,4896445,WAITRY,2021-08-15 00:15:02,2021-08-15 00:16:07,ACONFIRMAR,12055
4,399237930,PEDIDOSYA,2021-08-15 03:09:07,2021-08-15 03:09:18,ADESPACHAR,12045
5,399211417,PEDIDOSYA,2021-08-15 03:09:17,2021-08-15 03:09:27,ADESPACHAR,12043
6,399176305,PEDIDOSYA,2021-08-15 03:10:17,2021-08-15 03:10:27,ADESPACHAR,12040
7,399170813,PEDIDOSYA,2021-08-15 03:11:37,2021-08-15 03:11:47,ADESPACHAR,12039
8,399169091,PEDIDOSYA,2021-08-15 03:12:17,2021-08-15 03:12:27,ADESPACHAR,12038
9,399152382,PEDIDOSYA,2021-08-15 03:12:27,2021-08-15 03:12:37,ADESPACHAR,12037
10,399060728,PEDIDOSYA,2021-08-15 03:13:57,2021-08-15 03:14:07,ADESPACHAR,12031
11,57399677,RAPPI,2021-08-15 03:14:07,2021-08-15 03:15:03,ADESPACHAR,12032
12,399454503,PEDIDOSYA,2021-08-15 12:30:11,2021-08-15 12:30:18,ACK,12056
13,399454503,PEDIDOSYA,2021-08-15 12:31:05,2021-08-15 12:31:07,ACONFIRMAR,12056
14,399472779,PEDIDOSYA,2021-08-15 13:01:11,2021-08-15 13:01:19,ACK,12057
15,399472779,PEDIDOSYA,2021-08-15 13:01:35,2021-08-15 13:01:37,ACONFIRMAR,12057
16,399516481,PEDIDOSYA,2021-08-15 13:57:12,2021-08-15 13:57:18,ACK,12058
17,399516481,PEDIDOSYA,2021-08-15 13:57:45,2021-08-15 13:57:48,ACONFIRMAR,12058
18,57472451,RAPPI,2021-08-15 14:32:12,2021-08-15 14:33:05,ACK,12059
19,57472451,RAPPI,2021-08-15 14:36:29,2021-08-15 14:37:03,ACONFIRMAR,12059
20,57472451,RAPPI,2021-08-15 17:25:31,2021-08-15 17:26:03,ADESPACHAR,12059
21,399516481,PEDIDOSYA,2021-08-15 17:25:42,2021-08-15 17:25:47,ADESPACHAR,12058
22,57497832,RAPPI,2021-08-15 20:05:13,2021-08-15 20:06:04,ACK,12060
23,399781597,PEDIDOSYA,2021-08-15 20:06:13,2021-08-15 20:06:19,ACK,12061
24,4906936,WAITRY,2021-08-15 20:07:03,2021-08-15 20:07:12,ACK,12062
25,57497832,RAPPI,2021-08-15 20:10:01,2021-08-15 20:10:10,ACONFIRMAR,12060
26,399781597,PEDIDOSYA,2021-08-15 20:10:01,2021-08-15 20:10:06,ACONFIRMAR,12061
27,4906936,WAITRY,2021-08-15 20:10:02,2021-08-15 20:10:11,ACONFIRMAR,12062
28,4906950,WAITRY,2021-08-15 20:15:03,2021-08-15 20:15:11,ACK,12063
29,4906950,WAITRY,2021-08-15 20:16:11,2021-08-15 20:17:04,ACONFIRMAR,12063
30,4906986,WAITRY,2021-08-15 20:25:33,2021-08-15 20:26:09,ACK,12064
31,399812349,PEDIDOSYA,2021-08-15 20:30:08,2021-08-15 20:30:17,ACK,12065
32,4906986,WAITRY,2021-08-15 20:32:01,2021-08-15 20:32:13,ACONFIRMAR,12064
33,399812349,PEDIDOSYA,2021-08-15 20:32:01,2021-08-15 20:32:07,ACONFIRMAR,12065
34,4907033,WAITRY,2021-08-15 20:46:43,2021-08-15 20:47:07,ACK,12066
35,57507496,RAPPI,2021-08-15 20:47:13,2021-08-15 20:48:05,ACK,12067
36,4907033,WAITRY,2021-08-15 20:49:11,2021-08-15 20:50:07,ACONFIRMAR,12066
37,57507496,RAPPI,2021-08-15 20:49:11,2021-08-15 20:50:07,ACONFIRMAR,12067
38,399847180,PEDIDOSYA,2021-08-15 20:52:14,2021-08-15 20:52:22,ACK,12068
39,399847180,PEDIDOSYA,2021-08-15 20:54:11,2021-08-15 20:54:18,ACONFIRMAR,12068
40,4907044,WAITRY,2021-08-15 21:04:14,2021-08-15 21:05:04,ACK,12069
41,4907044,WAITRY,2021-08-15 21:05:04,2021-08-15 21:06:05,ACONFIRMAR,12069
42,4907080,WAITRY,2021-08-15 21:05:33,2021-08-15 21:06:05,ACK,12070
43,4907080,WAITRY,2021-08-15 21:07:41,2021-08-15 21:08:09,ACONFIRMAR,12070
44,4907145,WAITRY,2021-08-15 21:23:54,2021-08-15 21:24:05,ACK,12071
45,4907145,WAITRY,2021-08-15 21:24:11,2021-08-15 21:25:06,ACONFIRMAR,12071
46,4907147,WAITRY,2021-08-15 21:27:34,2021-08-15 21:28:06,ACK,12072
47,4907147,WAITRY,2021-08-15 21:28:06,2021-08-15 21:29:06,ACONFIRMAR,12072
48,4907172,WAITRY,2021-08-15 21:32:44,2021-08-15 21:33:06,ACK,12073
49,4907172,WAITRY,2021-08-15 21:34:11,2021-08-15 21:35:07,ACONFIRMAR,12073
50,57519688,RAPPI,2021-08-15 21:38:14,2021-08-15 21:39:06,ACK,12074
51,57519688,RAPPI,2021-08-15 21:41:21,2021-08-15 21:42:03,ACONFIRMAR,12074
52,399947850,PEDIDOSYA,2021-08-15 21:55:14,2021-08-15 21:55:21,ACK,12075
53,399947850,PEDIDOSYA,2021-08-15 21:55:31,2021-08-15 21:55:37,ACONFIRMAR,12075
54,399966175,PEDIDOSYA,2021-08-15 22:07:14,2021-08-15 22:07:21,ACK,12076
55,399966175,PEDIDOSYA,2021-08-15 22:07:31,2021-08-15 22:07:36,ACONFIRMAR,12076
56,57526688,RAPPI,2021-08-15 22:14:14,2021-08-15 22:15:03,ACK,12077
57,57526688,RAPPI,2021-08-15 22:15:03,2021-08-15 22:16:04,ACONFIRMAR,12077
58,400012260,PEDIDOSYA,2021-08-15 22:46:14,2021-08-15 22:46:21,ACK,12078
59,400012260,PEDIDOSYA,2021-08-15 22:46:31,2021-08-15 22:46:36,ACONFIRMAR,12078
60,57532254,RAPPI,2021-08-15 22:47:14,2021-08-15 22:48:04,ACK,12079
61,57532254,RAPPI,2021-08-15 22:48:03,2021-08-15 22:49:02,ACONFIRMAR,12079
62,57534145,RAPPI,2021-08-15 22:59:14,2021-08-15 23:00:03,ACK,12080
63,57534145,RAPPI,2021-08-15 23:00:21,2021-08-15 23:01:07,ACONFIRMAR,12080
64,4906950,WAITRY,2021-08-15 23:08:22,2021-08-15 23:09:03,ADESPACHAR,12063
65,4907044,WAITRY,2021-08-15 23:09:02,2021-08-15 23:09:04,ADESPACHAR,12069
66,4907172,WAITRY,2021-08-15 23:09:32,2021-08-15 23:10:07,ADESPACHAR,12073
