UR;Importe
60732087;0
60732907;0
60732777;0
60732780;0
60732756;0
60732782;0
60732784;0
60732764;0
60732090;0
60732912;0
60732913;0
60732914;0
60732915;818,72
60732916;2127,1
60732918;0
60732796;0
60732758;0
60732786;0
60732800;-675,78
60732760;0
60732762;0
60732091;0
60732798;0
60732788;0
60732773;-294,84
60732791;0
60732793;0
60732795;0
60732775;-615,02
60732874;0
60732095;0
60732870;-0,01
60732869;0
60732897;0
60732871;0
60732867;0
60732866;0
60732875;0
60732864;0
60732898;0
60732902;0
60732876;0
60732862;4437,51
60732900;0
60732903;0
60732904;0
60732877;0
60732860;-0,01
60732878;-0,01
60732901;0
60732879;0
60732859;0
60732880;0
60732857;0
60732881;0
60732856;0
60732882;0
60732854;0
60732883;0
60732884;0
60732852;0
60732851;0
60732885;0
60732098;1746,9
60732886;0
60732849;189,1
60732887;0
60732847;0
60732905;0
60732872;0
60732906;0
60732873;0
60732846;0
60732888;0
60732889;0
60732844;0
60732890;-0,01
60732842;0
60732891;0
60732892;-0,01
60732840;0
60732893;0
60732894;0
60732839;0
60732837;0
60732895;862,36
60732896;0
60732835;0
60732833;0
60732092;0
60732093;0
60732094;0
60732097;0
60732099;0
60732101;0
60732103;0
60732105;0
60732107;0
60732109;0
60732110;0
60732112;0
60732114;0
60732116;2126,99
60732118;0
60732120;0
60732123;0
60732125;456,57
60732127;0
60732129;0
60732131;0
60732133;0
60732136;0
60732137;0
60732139;0
60732142;0
60732145;2990,71
60732148;0
60732150;0
60732152;0
60732154;0
60732156;0
60732159;0
60732160;0
60732162;0
60732163;0
60732165;0
60732168;0
60732170;0
60732171;0
60732173;0
60732176;152,19
60732178;0
60732180;0
60732182;0
60732184;0
60732186;41,06
60732188;0
60732190;0
60732192;0
60732195;0
60732196;434,88
60732198;0
60732200;0
60732202;0
60732204;0
60732206;0
60732208;0
60732210;0
60732212;0
60732214;0
60732216;0
60732217;0
60732219;0
60732222;0
60732223;0
60732225;0
60732227;0
60732230;0
60732232;0
60732234;0
60732236;0
60732238;0
60732240;0
60732242;0
60732244;0
60732246;0
60732248;0
60732250;0
60732252;0
60732254;0
60732256;0
60732258;0
60732260;0
60732262;0
60732265;0
60732827;0
60732267;0
60732269;0
60732271;0
60732273;0
60732275;0
60732278;0
60732280;0
60732282;0
60732284;0
60732286;0
60732288;0
60732290;0
60732831;0
60732291;0
60732293;0
60732801;-8636,55
60732295;0
60732298;0
60732803;0
60732300;0
60732804;0
60732302;103,71
60732806;0
60732304;0
60732306;0
60732807;0
60732308;0
60732310;0
60732312;0
60732809;0
60732314;0
60732811;0
60732316;0
60732318;0
60732320;0
60732322;0
60732324;0
60732326;0
60732328;0
60732330;0
60732333;0
60732335;0
60732337;0
60732339;0
60732341;0
60732343;0
60732345;0
60732347;90119,43
60732349;0
60732351;0
60732353;0
60732356;0
60732358;0
60732360;0
60732363;0
60732365;0
60732367;0
60732369;0
60732371;0
60732373;0
60732377;0
60732379;0
60732381;0
60732384;0
60732387;0
60732389;0
60732391;0
60732393;0
60732396;0
60732400;3791,16
60732402;0
60732404;0
60732406;0
60732409;0
60732411;0
60732414;4904,92
60732416;0
60732418;0
60732421;0
60732423;0
60732426;0
60732428;0
60732431;0
60732433;0
60732435;0
60732437;0
60732439;89,64
60732441;0
60732444;4218,48
60732446;30,46
60732448;0
60732450;0
60732452;0
60732456;0
60732458;0
60732460;0
60732462;0
60732464;0
60732466;0
60732468;0
60732470;0
60732472;0
60732474;0
60732476;0
60732478;0
60732481;0
60732483;0
60732485;0
60732487;0
60732489;0
60732491;0
60732493;0
60732495;0
60732497;0
60732499;1446,16
60732501;0
60732503;0
60732505;0
60732508;0
60732510;0
60732512;0
60732514;0
60732516;0
60732910;0
60732518;0
60732521;0
60732523;6834,56
60732525;0
60732911;0
60732527;0
60732529;0
60732532;0
60732535;0
60732537;0
60732539;0
60732541;19705,26
60732544;286,5
60732547;0
60732551;0
60732553;0
60732555;0
60732557;0
60732559;0
60732561;0
60732563;0
60732566;0
60732568;0
60732571;0
60732574;0
60732577;0
60732579;0
60732581;0
60732585;0
60732588;1948,91
60732592;0
60732595;0
60732598;7555,99
60732601;0
60732603;0
60732605;0
60732608;0
60732612;0
60732615;0
60732618;0
60732620;0
60732623;0
60732625;0
60732627;0
60732629;0
60732631;0
60732633;0
60732635;0
60732637;0
60732639;0
60732641;0
60732643;0
60732645;0
60732647;0
60732649;0
60732651;0
60732653;0
60732655;0
60732657;0
60732659;0
60732661;0
60732664;0
60732666;0
60732668;0
60732670;0
60732673;0
60732675;28,34
60732677;0
60732679;0
60732681;0
60732683;0
60732685;0
60732687;0
60732689;0
60732691;0
60732693;0
60732695;0
60732697;0
60732699;0
60732701;0
60732703;1545,64
60732705;0
60732707;0
60732709;0
60732711;0
60732712;321,51
60732714;0
60732716;0
60732718;0
60732720;0
60732722;0
60732725;0
60732726;0
60732728;0
60732731;49,39
60732732;0
60732734;0
60732736;381,38
60732737;0
60732739;0
60732741;0
60732919;0
60732743;0
60732745;0
60732920;0
60732747;0
60732748;0
60732750;0
60732921;0
60732100;0
60732102;0
60732104;0
60732106;0
60732108;0
60732111;0
60732113;0
60732115;0
60732117;146,62
60732119;0
60732121;0
60732122;353,37
60732124;1641,19
60732126;0
60732128;0
60732130;0
60732132;0
60732134;4221,9
60732135;0
60732138;0
60732140;789,37
60732141;0
60732855;0
60732143;593,05
60732144;0
60732147;0
60732149;0
60732752;0
60732151;0
60732153;0
60732155;0
60732157;0
60732158;0
60732161;0
60732164;0
60732166;0
60732167;410,24
60732169;0
60732172;0
60732174;0
60732175;0
60732177;0
60732179;0
60732181;0
60732183;689,26
60732185;0
60732187;0
60732189;0
60732191;0
60732193;0
60732194;0
60732197;0
60732199;0
60732201;0
60732203;0
60732205;0
60732207;2026,8
60732209;0
60732211;0
60732213;0
60732215;0
60732218;0
60732220;0
60732221;0
60732224;0
60732812;0
60732226;0
60732228;0
60732229;0
60732231;0
60732814;0
60732233;0
60732815;0
60732235;0
60732817;-574,14
60732237;0
60732239;0
60732818;-19720,03
60732241;0
60732820;0
60732243;0
60732245;0
60732247;1920,52
60732249;0
60732251;0
60732253;0
60732822;0
60732255;0
60732257;0
60732259;0
60732261;0
60732263;0
60732264;0
60732266;0
60732268;0
60732824;-1247,25
60732270;0
60732272;0
60732829;0
60732274;0
60732276;0
60732277;0
60732279;0
60732281;0
60732283;0
60732285;0
60732287;0
60732289;0
60732292;0
60732294;0
60732296;0
60732297;0
60732299;0
60732301;0
60732303;0
60732305;0
60732307;0
60732309;0
60732311;0
60732313;0
60732315;0
60732317;0
60732319;-0,01
60732321;0
60732323;0
60732325;0,01
60732327;0
60732329;0,01
60732331;0
60732332;0
60732334;0
60732336;0
60732338;0
60732340;0
60732342;0
60732344;0
60732346;0
60732348;0
60732865;0
60732350;0
60732352;0
60732354;0
60732355;0
60732357;0
60732359;0
60732361;0
60732362;0
60732364;0
60732366;0
60732368;0
60732370;0
60732372;0
60732374;0
60732375;0
60732863;0
60732378;0
60732380;0
60732382;0
60732383;0
60732385;0
60732386;0
60732388;0
60732390;0
60732392;0
60732394;0
60732395;0
60732397;544,92
60732398;0
60732399;0
60732401;0
60732403;0
60732405;0
60732407;0
60732408;471,79
60732410;0
60732412;0
60732413;913,97
60732415;0
60732417;0
60732419;0
60732420;0
60732422;0
60732424;0
60732425;0
60732427;0
60732429;0
60732430;0
60732432;0
60732434;0
60732436;0
60732438;0
60732440;0
60732442;0
60732443;0
60732445;336,13
60732447;0
60732449;0
60732451;0
60732453;0
60732454;0
60732455;0
60732457;0
60732459;0
60732461;0
60732463;0
60732465;0
60732467;0
60732469;0
60732471;0
60732473;0
60732475;0
60732477;0
60732479;0
60732480;0
60732482;0
60732484;0
60732486;0
60732488;0
60732490;0
60732492;0
60732494;0
60732496;0
60732498;0
60732500;0
60732502;0
60732504;0
60732506;0
60732507;0
60732509;0
60732511;0
60732513;0
60732515;0
60732517;0
60732519;0
60732520;177,54
60732522;0
60732524;6388,44
60732526;0
60732528;0
60732530;0
60732531;0
60732533;0
60732534;0
60732536;0
60732538;0
60732540;0
60732542;0
60732543;0
60732545;0
60732546;0
60732548;0
60732549;0
60732550;0
60732552;0
60732554;0
60732556;0
60732558;0
60732560;0
60732562;0
60732564;0
60732565;0
60732567;0
60732569;0
60732570;0
60732572;0
60732573;0
60732575;0
60732576;0
60732578;0
60732580;0
60732582;0
60732583;0
60732584;1549,37
60732586;0
60732587;0
60732589;0
60732590;0
60732591;0
60732593;0
60732594;43,67
60732596;0
60732597;0
60732599;938,53
60732600;0
60732858;0
60732602;0
60732604;0
60732606;0
60732607;0
60732609;0
60732610;0
60732611;0
60732613;0
60732614;0
60732616;0
60732617;0
60732619;0
60732621;0
60732622;0
60732861;0
60732624;0
60732626;0
60732628;0
60732630;2304,54
60732632;0
60732634;0
60732636;0
60732638;0
60732640;0
60732642;212,85
60732644;0
60732646;0
60732648;0
60732650;0
60732652;0
60732654;0
60732656;0
60732658;0
60732660;0
60732663;0
60732665;0
60732667;0
60732669;0
60732671;0
60732672;0
60732674;0
60732676;0
60732678;0
60732680;381,48
60732682;0
60732684;65,92
60732686;0
60732688;0
60732690;0
60732692;0
60732694;0
60732696;0
60732698;0
60732700;0
60732702;0
60732704;0
60732706;0
60732708;0
60732710;0
60732713;0
60732715;0
60732717;27332,43
60732719;0
60732721;0
60732723;0
60732724;0
60732727;0
60732729;0
60732730;0
60732733;0
60732735;0
60732738;0
60732740;0
60732742;0
60732744;0
60732746;0
60732749;0
60732751;0
60732868;0
60732753;0
60732755;3260,34
60732757;0
60732759;0
60732761;0
60732763;0
60732766;0
60732767;0
60732769;0
60732772;0
60732774;0
60732776;0
60732778;0
60732779;0
60732781;0
60732783;0
60732785;42,65
60732787;0
60732790;0
60732792;0
60732794;0
60732797;0
60732799;0
60732802;0
60732805;0
60732808;0
60732810;0
60732813;0
60732816;0
60732819;0
60732821;7271,8
60732823;7173,5
60732825;8824,64
60732826;858,12
60732828;4756,28
60732830;665,73
60732832;382,41
60732834;4223,76
60732836;0
60732838;0
60732841;0
60732908;0
60732765;0
60732768;0
60732770;0
60732771;0
60732909;20592,55
60732843;0
60732845;0
60732848;0
60732850;0
60732853;0
60732971;33534,41
60732957;12088,46
60732972;81695,06
60732976;113581,94
60732974;0
60732973;53743,66
60732958;2748,03
60732980;0
