<mxfile host="www.draw.io" modified="2019-11-20T00:02:53.236Z" agent="Mozilla/5.0 (X11; Ubuntu; Linux x86_64; rv:70.0) Gecko/20100101 Firefox/70.0" etag="6pBQWROVm_ObT6gHJYoI" version="12.2.7" type="gitlab" pages="1">
  <diagram id="zEvs0hLBjUtO8VlmuKmH" name="Page-1">
    <mxGraphModel dx="1422" dy="774" grid="1" gridSize="10" guides="1" tooltips="1" connect="1" arrows="1" fold="1" page="1" pageScale="1" pageWidth="827" pageHeight="1169" math="0" shadow="0">
      <root>
        <mxCell id="0"/>
        <mxCell id="1" parent="0"/>
        <mxCell id="A3KH0nMJNMfAGn7gLO80-1" value="" style="whiteSpace=wrap;html=1;aspect=fixed;" vertex="1" parent="1">
          <mxGeometry x="50" y="40" width="80" height="80" as="geometry"/>
        </mxCell>
        <mxCell id="A3KH0nMJNMfAGn7gLO80-2" value="" style="whiteSpace=wrap;html=1;aspect=fixed;" vertex="1" parent="1">
          <mxGeometry x="50" y="140" width="80" height="80" as="geometry"/>
        </mxCell>
        <mxCell id="A3KH0nMJNMfAGn7gLO80-3" value="" style="whiteSpace=wrap;html=1;aspect=fixed;" vertex="1" parent="1">
          <mxGeometry x="50" y="240" width="80" height="80" as="geometry"/>
        </mxCell>
      </root>
    </mxGraphModel>
  </diagram>
</mxfile>
