{
	"host": {
		"label": "Host",
		"type": "String",
		"required": true,
		"help": "Host(s) to be used for connection. Multiple hosts (cluster) can be specified separated by comma."
	},
	"port": {
		"label": "Port",
		"type": "Number",
		"required": false,
		"help": "(Optional) Port to be used for connection. Default: 9042"
	},
	"user" : {
		"label": "User",
		"type": "String",
		"required": false,
		"help": "(Optional) Username to use for authentication."
	},
	"password" : {
		"label": "Password",
		"type": "Password",
		"required": false,
		"help": "(Optional) Password to use for authentication."
	},
	"keyspace": {
		"label": "Keyspace",
		"type": "String",
		"required": true,
		"help": "Name keyspace to use."
	},
	"schema": {
		"label": "Schema",
		"type": "JSON",
		"required": true,
		"help": "Express Cassandra ORM table schema. Kindly refer to http://express-cassandra.readthedocs.io/en/latest/schema/ for more information."
	},
	"replicationFactor": {
		"label": "Replication Factor",
		"type": "Number",
		"required": false,
		"help": "(Optional) Used for Simple Strategy Replication. Note: Won't be used when Replication Config is supplied. Default: 1"
	},
	"replicationConfig": {
		"label": "Replication Config",
		"type": "JSON",
		"required": false,
		"help": "(Optional) Used for Network Topology Strategy Replication. Should contain Data Center Names as field names and Number of Replicas as values. Example: {\"data_center1\": 3, \"data_center2\": 3}"
	}
}