<?xml version="1.0" encoding="UTF-8" standalone="no"?>
<svg
   xmlns:dc="http://purl.org/dc/elements/1.1/"
   xmlns:cc="http://creativecommons.org/ns#"
   xmlns:rdf="http://www.w3.org/1999/02/22-rdf-syntax-ns#"
   xmlns:svg="http://www.w3.org/2000/svg"
   xmlns="http://www.w3.org/2000/svg"
   viewBox="0 0 175 175"
   height="175"
   width="175"
   version="1.1"
   id="svg2">
  <metadata
     id="metadata8">
    <rdf:RDF>
      <cc:Work
         rdf:about="">
        <dc:format>image/svg+xml</dc:format>
        <dc:type
           rdf:resource="http://purl.org/dc/dcmitype/StillImage" />
        <dc:title></dc:title>
      </cc:Work>
    </rdf:RDF>
  </metadata>
  <defs
     id="defs6" />
  <path
     id="rect4165"
     d="M 131.95898 31.345703 C 130.48706 31.382323 129.39291 32.798683 128.77344 35.619141 C 127.79337 40.081354 116.58348 51.831973 108.79297 56.564453 C 105.31095 58.679667 102.46289 60.859954 102.46289 61.408203 C 102.46289 61.956453 101.81254 62.404297 101.01758 62.404297 C 100.22262 62.404297 98.751737 63.312815 97.748047 64.421875 C 96.145344 66.19285 96.12198 66.515577 97.5625 67.068359 C 98.518047 67.435037 98.979876 68.499856 98.667969 69.619141 C 98.373496 70.67584 98.763773 70.222182 99.535156 68.611328 L 100.93555 65.681641 L 102.14648 68.886719 C 102.81184 70.649445 102.91431 71.818889 102.37305 71.484375 C 101.8318 71.149862 101.38867 71.344342 101.38867 71.917969 C 101.38867 73.449143 98.153054 72.713878 97.021484 70.925781 C 96.48676 70.080811 96.040277 69.896983 96.03125 70.517578 C 95.99411 73.066659 98.911258 74.226562 105.36523 74.226562 C 109.0888 74.226562 112.13477 74.602966 112.13477 75.0625 C 112.13477 75.522031 111.37138 76.985911 110.43945 78.316406 C 109.09575 80.234808 108.94402 81.78498 109.70312 85.808594 C 112.18733 98.9761 109.04009 130.09944 105.36133 128.74414 C 104.65392 128.48351 101.45569 127.40975 98.255859 126.35742 C 93.720216 124.86579 90.498376 122.58153 83.634766 115.99219 C 78.792597 111.34351 74.353818 107.53906 73.769531 107.53906 C 71.702114 107.53906 69.149888 103.5679 69.228516 100.4707 C 69.272356 98.744123 70.153251 95.420219 71.183594 93.085938 C 72.925674 89.139188 73.376086 88.833207 77.626953 88.726562 C 80.33482 88.658623 82.598162 87.979682 83.179688 87.060547 C 84.558616 84.88108 84.429596 80.265532 82.949219 78.785156 C 82.006963 77.842899 82.038158 77.138251 83.080078 75.882812 C 84.117047 74.633342 84.15568 73.862459 83.232422 72.75 C 82.558814 71.938349 82.275177 70.577106 82.601562 69.726562 C 82.962856 68.785044 82.128966 67.61013 80.470703 66.722656 C 78.97267 65.920932 77.333504 63.776224 76.828125 61.955078 C 76.322746 60.133934 74.629917 56.763734 73.066406 54.464844 C 71.502894 52.165954 70.224609 49.904134 70.224609 49.441406 C 70.224609 48.978678 68.460398 48.020055 66.304688 47.308594 C 63.258477 46.303267 61.10639 46.301187 56.648438 47.298828 C 53.493677 48.004832 50.390263 48.257777 49.751953 47.863281 C 47.244603 46.313652 41.236969 48.48894 39.673828 51.511719 C 38.170372 54.419083 35.553064 69.860472 34.185547 83.896484 C 33.277344 93.218166 32.000772 97.055201 28.818359 100.04492 C 25.433531 103.22481 25.483727 103.77261 29.291016 105.34961 C 31.57558 106.29591 33.00359 106.3315 34.59375 105.48047 C 37.442901 103.95566 37.986328 104.01002 37.986328 105.82227 C 37.986328 107.32554 43.189318 109.6875 46.5 109.6875 C 48.05789 109.6875 48.210348 111.68896 47.90625 128.22461 C 47.636071 142.91593 46.137448 162.32691 43.677734 175 L 84.316406 175 C 82.740866 157.51559 83.469337 156.26332 85.498047 153.58203 C 88.038523 149.42164 88.434031 147.85005 87.857422 144.24414 L 87.164062 139.9082 L 94.007812 141.52344 C 108.86054 145.02773 111.79534 145.32125 115.69141 143.69336 C 120.39938 141.72627 120.62281 140.41354 120.47656 115.59961 C 120.35468 94.919189 120.76545 91.943246 123.84961 91.136719 C 125.87149 90.607987 127.56313 84.399131 126.26172 82.285156 C 125.89786 81.694113 125.528 80.969349 125.43945 80.673828 C 124.19118 76.508329 123.46567 75.300781 122.2168 75.300781 C 121.39917 75.300781 120.85223 74.695834 121 73.957031 C 121.15011 73.206436 120.4395 72.753246 119.38867 72.929688 C 117.14126 73.30704 116.85233 71.186037 119.03711 70.347656 C 119.87854 70.024769 124.83597 69.347549 130.05273 68.841797 L 139.53711 67.919922 L 128.54102 68.222656 C 116.5738 68.550585 115.60016 68.158489 113.2832 62.064453 C 111.76065 58.059837 112.71395 56.438358 121.87891 47.435547 C 129.12785 40.314863 129.32812 40.201934 129.32812 43.228516 C 129.32812 47.792568 133.1535 57.967276 136.85156 63.242188 C 138.6247 65.7714 140.07422 68.252953 140.07422 68.757812 C 140.07422 70.256962 145.86096 70.914486 147.45508 69.595703 C 150.9524 66.702436 146.29057 48.608411 139.31445 38.007812 C 136.37046 33.534241 133.85145 31.298617 131.95898 31.345703 z M 131.47852 46.285156 C 133.05296 46.285156 136.79768 51.770055 138.0293 55.880859 C 138.67716 58.043218 139.04077 60.985221 138.83594 62.417969 C 138.46822 64.990116 138.44433 64.983298 136.97656 61.833984 C 133.46616 54.301945 130.63098 46.285156 131.47852 46.285156 z "
     style="fill:#000000;fill-opacity:1;stroke:none;stroke-width:0.40000001;stroke-miterlimit:4;stroke-dasharray:none;stroke-opacity:1" />
</svg>
