<?xml version="1.0" encoding="UTF-8" standalone="no"?>
<svg
   xmlns:dc="http://purl.org/dc/elements/1.1/"
   xmlns:cc="http://creativecommons.org/ns#"
   xmlns:rdf="http://www.w3.org/1999/02/22-rdf-syntax-ns#"
   xmlns:svg="http://www.w3.org/2000/svg"
   xmlns="http://www.w3.org/2000/svg"
   xmlns:sodipodi="http://sodipodi.sourceforge.net/DTD/sodipodi-0.dtd"
   xmlns:inkscape="http://www.inkscape.org/namespaces/inkscape"
   viewBox="0 0 175 175"
   height="175"
   width="175"
   version="1.1"
   id="svg2"
   inkscape:version="0.91 r13725"
   sodipodi:docname="empathy.svg">
  <sodipodi:namedview
     pagecolor="#ffffff"
     bordercolor="#666666"
     borderopacity="1"
     objecttolerance="10"
     gridtolerance="10"
     guidetolerance="10"
     inkscape:pageopacity="0"
     inkscape:pageshadow="2"
     inkscape:window-width="1440"
     inkscape:window-height="837"
     id="namedview6"
     showgrid="false"
     inkscape:zoom="1.8574658"
     inkscape:cx="88.561523"
     inkscape:cy="39.768555"
     inkscape:window-x="0"
     inkscape:window-y="30"
     inkscape:window-maximized="1"
     inkscape:current-layer="svg2" />
  <metadata
     id="metadata8">
    <rdf:RDF>
      <cc:Work
         rdf:about="">
        <dc:format>image/svg+xml</dc:format>
        <dc:type
           rdf:resource="http://purl.org/dc/dcmitype/StillImage" />
        <dc:title></dc:title>
      </cc:Work>
    </rdf:RDF>
  </metadata>
  <defs
     id="defs6" />
  <path
     id="rect4175"
     d="m 175,48.208123 c -10.12608,5.157443 -48.49047,20.940243 -55.56226,22.637473 -8.04702,1.93128 -9.06735,1.92132 -18.39211,-0.20841 -6.562819,-1.4989 -12.011814,-2.002269 -16.257844,-1.49939 -9.946971,1.17808 -25.4145,-1.37754 -33.768071,-5.5788 -8.239439,-4.14386 -10.73808,-3.41619 -7.797975,2.26934 3.88443,7.51167 9.366816,10.37596 22.365389,11.68636 7.737852,0.78005 11.900304,2.01552 19.146624,5.68494 10.236988,5.18382 13.157715,9.055181 14.698632,19.468884 l 0.831705,5.61547 6.17509,-4.43448 c 3.3963,-2.43908 8.676,-5.713073 11.73266,-7.275024 6.87214,-3.51168 29.7465,-10.13959 40.65908,-11.78091 4.46849,-0.67209 10.01564,-1.5421 12.32702,-1.93357 L 175,82.242496 175,48.208123 Z M 0,67.018976 0,95.881707 c 1.0049473,0.18876 1.8891,0.37986 2.3909161,0.5191 1.5271342,0.4237 7.9180949,1.69962 14.2026969,2.83668 8.558152,1.548413 11.34838,2.516983 11.115154,3.857493 -0.292689,1.68234 13.720326,8.65413 22.952022,11.42006 l 3.500502,1.04976 -2.082162,-3.34033 c -3.434607,-5.50841 -6.604904,-7.53107 -14.287605,-9.11791 -4.018684,-0.83004 -7.305898,-1.90304 -7.305898,-2.38512 0,-0.871743 10.98233,1.44983 15.152117,3.20333 1.930092,0.81165 2.037892,0.53289 0.926263,-2.39092 -0.691928,-1.819913 -1.218969,-4.245203 -1.171337,-5.389693 0.04763,-1.14448 1.042892,0.69855 2.211452,4.094853 3.370677,9.79652 11.31641,20.92151 15.271759,21.38123 l 3.317179,0.38595 -6.094038,-12.11861 c -3.351777,-6.66503 -6.106085,-12.738953 -6.121053,-13.496423 -0.01497,-0.75747 -1.176842,-2.83729 -2.581959,-4.6236 -1.73915,-2.21097 -1.971238,-3.02568 -0.729431,-2.54915 1.003294,0.385 2.414456,2.18886 3.137715,4.00802 0.72326,1.81915 1.982656,4.9748 2.798086,7.012583 l 1.482021,3.70505 0.858722,-4.322563 c 0.825004,-4.15667 0.864478,-4.096381 1.02082,1.584303 0.100511,3.65225 1.40272,8.36692 3.411733,12.35017 3.577181,7.09246 4.774781,8.24849 8.577581,8.27655 2.182678,0.0161 2.484882,-0.57884 2.03006,-3.99451 -0.293957,-2.20759 -1.194768,-4.56957 -2.003044,-5.24883 -2.047817,-1.72094 -5.679149,-7.11634 -5.679149,-8.43864 0,-0.60337 1.05047,0.20064 2.334954,1.78692 l 2.334954,2.88299 1.364308,-4.90726 c 1.699782,-6.122613 1.758838,-11.319343 0.140869,-12.319303 -0.679259,-0.41981 -1.217893,-1.42562 -1.196423,-2.23461 0.02147,-0.80898 1.364949,0.0354 2.985269,1.87569 1.767318,2.00727 2.699509,4.28996 2.329165,5.70616 -0.459942,1.75882 0.19577,2.56634 2.572308,3.162803 2.761539,0.6931 3.189818,1.45945 3.189818,5.71582 0,3.95018 0.446003,4.91691 2.271274,4.91691 4.723656,0 6.991049,-12.862803 3.216834,-18.251243 -1.057407,-1.50964 -1.348571,-2.74405 -0.646454,-2.74405 2.855082,0 5.538161,6.54326 5.383903,13.131713 -0.126031,5.38289 0.232114,6.65603 1.910413,6.77328 1.136532,0.0794 -0.952998,0.64583 -4.64482,1.25818 -3.691827,0.61236 -6.847373,1.24541 -7.010651,1.40869 -0.163279,0.16327 0.320918,2.60946 1.074851,5.43408 l 1.370098,5.13497 6.084388,-6.38157 c 7.868413,-8.25334 8.715389,-13.40926 3.689618,-22.436783 -2.896639,-5.20311 -4.75281,-6.83665 -11.798277,-10.37415 -7.841171,-3.93701 -9.434561,-4.25998 -25.607308,-5.19093 C 38.93512,77.421556 30.73331,76.201126 17.409882,72.509006 10.939741,70.716047 4.8335962,68.905886 0,67.018976 Z m 61.768224,23.05044 c 1.27831,-0.0312 2.768452,0.83589 3.932757,2.61283 1.114162,1.700431 1.781537,4.37398 1.482021,5.94159 -0.468467,2.451864 -0.569311,2.499464 -0.713994,0.34542 -0.09251,-1.3772 -1.089212,-3.81862 -2.215312,-5.42635 -1.985302,-2.83444 -2.102109,-2.85135 -3.816975,-0.58278 -1.723276,2.27969 -1.75622,2.27526 -1.333432,-0.11771 0.320355,-1.81322 1.386625,-2.74178 2.664935,-2.773 z M 78.54516,101.30807 c -0.704482,0.0994 -1.465342,1.20736 -2.223031,3.38087 -1.89178,5.42676 -1.72378,12.70698 0.412959,17.82091 1.267047,3.03247 2.577943,4.28203 4.486585,4.28203 2.490767,0 2.625763,-0.39897 1.784986,-5.24882 -0.500469,-2.88686 -1.267824,-8.54023 -1.705867,-12.56244 -0.566211,-5.19907 -1.581497,-7.83824 -2.755632,-7.67255 z"
     style="fill:#000000;fill-opacity:1;stroke:none;stroke-width:0.40000001;stroke-miterlimit:4;stroke-dasharray:none;stroke-opacity:1"
     inkscape:connector-curvature="0" />
</svg>
