\relax 
\providecommand\hyper@newdestlabel[2]{}
\providecommand\HyperFirstAtBeginDocument{\AtBeginDocument}
\HyperFirstAtBeginDocument{\ifx\hyper@anchor\@undefined
\global\let\oldcontentsline\contentsline
\gdef\contentsline#1#2#3#4{\oldcontentsline{#1}{#2}{#3}}
\global\let\oldnewlabel\newlabel
\gdef\newlabel#1#2{\newlabelxx{#1}#2}
\gdef\newlabelxx#1#2#3#4#5#6{\oldnewlabel{#1}{{#2}{#3}}}
\AtEndDocument{\ifx\hyper@anchor\@undefined
\let\contentsline\oldcontentsline
\let\newlabel\oldnewlabel
\fi}
\fi}
\global\let\hyper@last\relax 
\gdef\HyperFirstAtBeginDocument#1{#1}
\providecommand\HyField@AuxAddToFields[1]{}
\providecommand\HyField@AuxAddToCoFields[2]{}
\@writefile{toc}{\boolfalse {citerequest}\boolfalse {citetracker}\boolfalse {pagetracker}\boolfalse {backtracker}\relax }
\@writefile{lof}{\boolfalse {citerequest}\boolfalse {citetracker}\boolfalse {pagetracker}\boolfalse {backtracker}\relax }
\@writefile{lot}{\boolfalse {citerequest}\boolfalse {citetracker}\boolfalse {pagetracker}\boolfalse {backtracker}\relax }
\abx@aux@refcontext{nty/global//global/global}
\abx@aux@cite{liverpool}
\abx@aux@segm{0}{0}{liverpool}
\abx@aux@cite{liverpool}
\abx@aux@segm{0}{0}{liverpool}
\abx@aux@cite{opta}
\abx@aux@segm{0}{0}{opta}
\abx@aux@cite{opta}
\abx@aux@segm{0}{0}{opta}
\abx@aux@cite{deepmind}
\abx@aux@segm{0}{0}{deepmind}
\abx@aux@cite{osd}
\abx@aux@segm{0}{0}{osd}
\@writefile{toc}{\defcounter {refsection}{0}\relax }\@writefile{toc}{\contentsline {chapter}{\numberline {1}Introduction}{6}{chapter.1}\protected@file@percent }
\@writefile{lof}{\defcounter {refsection}{0}\relax }\@writefile{lof}{\addvspace {10\p@ }}
\@writefile{lot}{\defcounter {refsection}{0}\relax }\@writefile{lot}{\addvspace {10\p@ }}
\abx@aux@cite{stephan}
\abx@aux@segm{0}{0}{stephan}
\abx@aux@cite{stephan_code}
\abx@aux@segm{0}{0}{stephan_code}
\abx@aux@cite{baskettrack}
\abx@aux@segm{0}{0}{baskettrack}
\abx@aux@cite{stephan}
\abx@aux@segm{0}{0}{stephan}
\@writefile{toc}{\defcounter {refsection}{0}\relax }\@writefile{toc}{\contentsline {chapter}{\numberline {2}Background}{8}{chapter.2}\protected@file@percent }
\@writefile{lof}{\defcounter {refsection}{0}\relax }\@writefile{lof}{\addvspace {10\p@ }}
\@writefile{lot}{\defcounter {refsection}{0}\relax }\@writefile{lot}{\addvspace {10\p@ }}
\@writefile{toc}{\defcounter {refsection}{0}\relax }\@writefile{toc}{\contentsline {section}{\numberline {2.1}Basketball video analysis}{8}{section.2.1}\protected@file@percent }
\abx@aux@cite{opencv}
\abx@aux@segm{0}{0}{opencv}
\abx@aux@cite{cocodataset}
\abx@aux@segm{0}{0}{cocodataset}
\abx@aux@cite{learn_track_id}
\abx@aux@segm{0}{0}{learn_track_id}
\abx@aux@cite{opencv}
\abx@aux@segm{0}{0}{opencv}
\abx@aux@cite{baskettrack}
\abx@aux@segm{0}{0}{baskettrack}
\abx@aux@cite{baskettrack}
\abx@aux@segm{0}{0}{baskettrack}
\@writefile{toc}{\defcounter {refsection}{0}\relax }\@writefile{toc}{\contentsline {section}{\numberline {2.2}Player tracking and analysis of basketball plays}{9}{section.2.2}\protected@file@percent }
\abx@aux@cite{opencv}
\abx@aux@segm{0}{0}{opencv}
\abx@aux@cite{baskettrack}
\abx@aux@segm{0}{0}{baskettrack}
\abx@aux@cite{learn_track_id}
\abx@aux@segm{0}{0}{learn_track_id}
\abx@aux@cite{learn_track_id}
\abx@aux@segm{0}{0}{learn_track_id}
\abx@aux@cite{learn_track_id}
\abx@aux@segm{0}{0}{learn_track_id}
\@writefile{toc}{\defcounter {refsection}{0}\relax }\@writefile{toc}{\contentsline {section}{\numberline {2.3}Learning to track and identify players from broadcast sports videos}{11}{section.2.3}\protected@file@percent }
\abx@aux@cite{learn_track_id}
\abx@aux@segm{0}{0}{learn_track_id}
\abx@aux@cite{learn_track_id}
\abx@aux@segm{0}{0}{learn_track_id}
\abx@aux@cite{learn_track_id}
\abx@aux@segm{0}{0}{learn_track_id}
\abx@aux@cite{learn_track_id}
\abx@aux@segm{0}{0}{learn_track_id}
\abx@aux@cite{cvpr_2019}
\abx@aux@segm{0}{0}{cvpr_2019}
\@writefile{toc}{\defcounter {refsection}{0}\relax }\@writefile{toc}{\contentsline {section}{\numberline {2.4}Multi-Person 3D Pose Estimation and Tracking in Sports}{12}{section.2.4}\protected@file@percent }
\abx@aux@cite{surreal}
\abx@aux@segm{0}{0}{surreal}
\abx@aux@cite{cvpr_2019}
\abx@aux@segm{0}{0}{cvpr_2019}
\abx@aux@cite{cvpr_2019}
\abx@aux@segm{0}{0}{cvpr_2019}
\abx@aux@cite{cvpr_2019}
\abx@aux@segm{0}{0}{cvpr_2019}
\abx@aux@cite{cvpr_2018}
\abx@aux@segm{0}{0}{cvpr_2018}
\abx@aux@cite{cvpr_2018}
\abx@aux@segm{0}{0}{cvpr_2018}
\@writefile{toc}{\defcounter {refsection}{0}\relax }\@writefile{toc}{\contentsline {section}{\numberline {2.5}Soccer: Who Has The Ball? Generating Visual Analytics and Player Statistics}{13}{section.2.5}\protected@file@percent }
\abx@aux@cite{cvpr_2018}
\abx@aux@segm{0}{0}{cvpr_2018}
\@writefile{toc}{\defcounter {refsection}{0}\relax }\@writefile{toc}{\contentsline {section}{\numberline {2.6}Conclusion}{14}{section.2.6}\protected@file@percent }
\@writefile{toc}{\defcounter {refsection}{0}\relax }\@writefile{toc}{\contentsline {chapter}{\numberline {3}Requirements}{16}{chapter.3}\protected@file@percent }
\@writefile{lof}{\defcounter {refsection}{0}\relax }\@writefile{lof}{\addvspace {10\p@ }}
\@writefile{lot}{\defcounter {refsection}{0}\relax }\@writefile{lot}{\addvspace {10\p@ }}
\@writefile{toc}{\defcounter {refsection}{0}\relax }\@writefile{toc}{\contentsline {section}{\numberline {3.1}Requirements analysis}{16}{section.3.1}\protected@file@percent }
\@writefile{toc}{\defcounter {refsection}{0}\relax }\@writefile{toc}{\contentsline {subsection}{\numberline {3.1.1}Functional}{17}{subsection.3.1.1}\protected@file@percent }
\@writefile{lot}{\defcounter {refsection}{0}\relax }\@writefile{lot}{\contentsline {table}{\numberline {3.1}{\ignorespaces Functional requirements table}}{17}{table.3.1}\protected@file@percent }
\newlabel{tab:func_req}{{3.1}{17}{Functional requirements table}{table.3.1}{}}
\@writefile{toc}{\defcounter {refsection}{0}\relax }\@writefile{toc}{\contentsline {subsection}{\numberline {3.1.2}Non Functional}{18}{subsection.3.1.2}\protected@file@percent }
\@writefile{lot}{\defcounter {refsection}{0}\relax }\@writefile{lot}{\contentsline {table}{\numberline {3.2}{\ignorespaces Non-functional requirements table}}{18}{table.3.2}\protected@file@percent }
\newlabel{tab:non_func_req}{{3.2}{18}{Non-functional requirements table}{table.3.2}{}}
\abx@aux@cite{mlevaluation}
\abx@aux@segm{0}{0}{mlevaluation}
\@writefile{toc}{\defcounter {refsection}{0}\relax }\@writefile{toc}{\contentsline {section}{\numberline {3.2}Evaluation Strategy}{19}{section.3.2}\protected@file@percent }
\@writefile{toc}{\defcounter {refsection}{0}\relax }\@writefile{toc}{\contentsline {subsection}{\numberline {3.2.1}Machine learning evaluation techniques}{19}{subsection.3.2.1}\protected@file@percent }
\@writefile{toc}{\defcounter {refsection}{0}\relax }\@writefile{toc}{\contentsline {subsection}{\numberline {3.2.2}Testing datasets}{19}{subsection.3.2.2}\protected@file@percent }
\@writefile{toc}{\defcounter {refsection}{0}\relax }\@writefile{toc}{\contentsline {subsection}{\numberline {3.2.3}Manual verification}{20}{subsection.3.2.3}\protected@file@percent }
\@writefile{toc}{\defcounter {refsection}{0}\relax }\@writefile{toc}{\contentsline {chapter}{\numberline {4}Project Management}{21}{chapter.4}\protected@file@percent }
\@writefile{lof}{\defcounter {refsection}{0}\relax }\@writefile{lof}{\addvspace {10\p@ }}
\@writefile{lot}{\defcounter {refsection}{0}\relax }\@writefile{lot}{\addvspace {10\p@ }}
\@writefile{toc}{\defcounter {refsection}{0}\relax }\@writefile{toc}{\contentsline {section}{\numberline {4.1}Project Plan}{21}{section.4.1}\protected@file@percent }
\@writefile{toc}{\defcounter {refsection}{0}\relax }\@writefile{toc}{\contentsline {section}{\numberline {4.2}Risks Analysis}{22}{section.4.2}\protected@file@percent }
\@writefile{toc}{\defcounter {refsection}{0}\relax }\@writefile{toc}{\contentsline {subsection}{\numberline {4.2.1}Potential Risks}{23}{subsection.4.2.1}\protected@file@percent }
\@writefile{lot}{\defcounter {refsection}{0}\relax }\@writefile{lot}{\contentsline {table}{\numberline {4.1}{\ignorespaces Potential risks table}}{23}{table.4.1}\protected@file@percent }
\newlabel{tab:pot_risks}{{4.1}{23}{Potential risks table}{table.4.1}{}}
\@writefile{toc}{\defcounter {refsection}{0}\relax }\@writefile{toc}{\contentsline {subsection}{\numberline {4.2.2}Risks Planning}{24}{subsection.4.2.2}\protected@file@percent }
\@writefile{lot}{\defcounter {refsection}{0}\relax }\@writefile{lot}{\contentsline {table}{\numberline {4.2}{\ignorespaces Risks planning table}}{24}{table.4.2}\protected@file@percent }
\newlabel{tab:risks_plan}{{4.2}{24}{Risks planning table}{table.4.2}{}}
\abx@aux@cite{bcs}
\abx@aux@segm{0}{0}{bcs}
\abx@aux@cite{stallman}
\abx@aux@segm{0}{0}{stallman}
\abx@aux@cite{bcs}
\abx@aux@segm{0}{0}{bcs}
\abx@aux@cite{bcs}
\abx@aux@segm{0}{0}{bcs}
\abx@aux@cite{gdpr}
\abx@aux@segm{0}{0}{gdpr}
\@writefile{toc}{\defcounter {refsection}{0}\relax }\@writefile{toc}{\contentsline {section}{\numberline {4.3}Potential issues}{25}{section.4.3}\protected@file@percent }
\@writefile{toc}{\defcounter {refsection}{0}\relax }\@writefile{toc}{\contentsline {subsection}{\numberline {4.3.1}Professional}{25}{subsection.4.3.1}\protected@file@percent }
\abx@aux@cite{iproperty}
\abx@aux@segm{0}{0}{iproperty}
\abx@aux@cite{copyright}
\abx@aux@segm{0}{0}{copyright}
\abx@aux@cite{stallman}
\abx@aux@segm{0}{0}{stallman}
\abx@aux@cite{opta}
\abx@aux@segm{0}{0}{opta}
\@writefile{toc}{\defcounter {refsection}{0}\relax }\@writefile{toc}{\contentsline {subsection}{\numberline {4.3.2}Legal}{26}{subsection.4.3.2}\protected@file@percent }
\@writefile{toc}{\defcounter {refsection}{0}\relax }\@writefile{toc}{\contentsline {subsection}{\numberline {4.3.3}Ethical}{26}{subsection.4.3.3}\protected@file@percent }
\@writefile{toc}{\defcounter {refsection}{0}\relax }\@writefile{toc}{\contentsline {subsection}{\numberline {4.3.4}Social}{26}{subsection.4.3.4}\protected@file@percent }
\abx@aux@read@bbl@mdfivesum{1CA4B7AC6836A89BE920B2BC43AE3EEE}
\abx@aux@refcontextdefaultsdone
\abx@aux@defaultrefcontext{0}{bcs}{nty/global//global/global}
\abx@aux@defaultrefcontext{0}{iproperty}{nty/global//global/global}
\abx@aux@defaultrefcontext{0}{copyright}{nty/global//global/global}
\abx@aux@defaultrefcontext{0}{cvpr_2019}{nty/global//global/global}
\abx@aux@defaultrefcontext{0}{baskettrack}{nty/global//global/global}
\abx@aux@defaultrefcontext{0}{stephan_code}{nty/global//global/global}
\abx@aux@defaultrefcontext{0}{stephan}{nty/global//global/global}
\abx@aux@defaultrefcontext{0}{mlevaluation}{nty/global//global/global}
\abx@aux@defaultrefcontext{0}{liverpool}{nty/global//global/global}
\abx@aux@defaultrefcontext{0}{cocodataset}{nty/global//global/global}
\abx@aux@defaultrefcontext{0}{learn_track_id}{nty/global//global/global}
\abx@aux@defaultrefcontext{0}{opencv}{nty/global//global/global}
\abx@aux@defaultrefcontext{0}{gdpr}{nty/global//global/global}
\abx@aux@defaultrefcontext{0}{stallman}{nty/global//global/global}
\abx@aux@defaultrefcontext{0}{osd}{nty/global//global/global}
\abx@aux@defaultrefcontext{0}{cvpr_2018}{nty/global//global/global}
\abx@aux@defaultrefcontext{0}{opta}{nty/global//global/global}
\abx@aux@defaultrefcontext{0}{deepmind}{nty/global//global/global}
\abx@aux@defaultrefcontext{0}{surreal}{nty/global//global/global}
\gdef \@abspage@last{28}
