com\eafc\vanass\olympic\Country.class
com\eafc\vanass\olympic\Race.class
com\eafc\vanass\olympic\Sprinter.class
com\eafc\vanass\olympic\Character.class
com\eafc\vanass\olympic\Judge.class
com\eafc\vanass\olympic\Athlete.class
com\eafc\vanass\olympic\Launcher.class
com\eafc\vanass\olympic\Competition.class
