name,price,quantity,tax
Table,10.99,55,21
Chair,3.99,200,15
Coffee Beans,16.50,20,21
Encyclopedia,23.00,3,5
Laptop DELL,1645.00,1,21
Lava Lamp,8.80,15,21
Backpack,23.00,3,15
Pencil,0.45,440,21
Big Book Of Knowledge,695.00,1,0
Lego City,10.99,3,21
