{
	"info": {
		"_postman_id": "3c7c5be1-738c-42a6-ab44-34437293f82e",
		"name": "sesson31",
		"schema": "https://schema.getpostman.com/json/collection/v2.1.0/collection.json"
	},
	"item": [
		{
			"name": "HELLO WORLD REQ",
			"request": {
				"method": "GET",
				"header": []
			},
			"response": []
		},
		{
			"name": "Hello from batch 145",
			"request": {
				"method": "GET",
				"header": []
			},
			"response": []
		},
		{
			"name": "NEW USER",
			"request": {
				"method": "GET",
				"header": []
			},
			"response": []
		},
		{
			"name": "REGISTER ROUTE",
			"request": {
				"method": "GET",
				"header": []
			},
			"response": []
		},
		{
			"name": "LOGIN ROUTE",
			"request": {
				"method": "GET",
				"header": []
			},
			"response": []
		},
		{
			"name": "CHANGE PASSWORD",
			"request": {
				"method": "GET",
				"header": []
			},
			"response": []
		},
		{
			"name": "HOME ROUTE",
			"request": {
				"method": "GET",
				"header": []
			},
			"response": []
		},
		{
			"name": "GET USERS",
			"request": {
				"method": "GET",
				"header": []
			},
			"response": []
		},
		{
			"name": "DELETE USER",
			"request": {
				"method": "DELETE",
				"header": [],
				"body": {
					"mode": "raw",
					"raw": "{\r\n\t\"username\": \"Mikasa12\"\t\r\n}",
					"options": {
						"raw": {
							"language": "json"
						}
					}
				},
				"url": {
					"raw": "localhost:4000/delete-user",
					"host": [
						"localhost"
					],
					"port": "4000",
					"path": [
						"delete-user"
					]
				}
			},
			"response": []
		}
	]
}