Prototype

38 jobs for jesusalva/guildskill1 in 3 minutes and 16 seconds (queued for 1 second)
latest
Status Job ID Name Coverage
  Build
passed #527175044
clang-3.9

00:02:49

passed #527175045
clang-6

00:02:51

passed #527175046
clang-7

00:03:02

passed #527175047
clang-8

00:02:46

passed #527175048
clang-8-i386

00:03:13

passed #527175034
gcc-4.8

00:02:29

passed #527175035
gcc-4.9

00:02:37

passed #527175036
gcc-6

00:02:29

passed #527175037
gcc-6-i386

00:02:43

failed #527175038
gcc-7

00:00:37

failed #527175039
gcc-7-i386

00:00:38

passed #527175040
gcc-8

00:02:36

passed #527175041
gcc-8-i386

00:02:57

passed #527175042
gcc-9

00:02:39

passed #527175043
gcc-9-i386

00:02:48

failed #527175032
gcc-snapshot

00:03:06

failed #527175033
gcc-snapshot-i386

00:03:03

 
  Test
skipped #527175062
gcc-4.8-lto
skipped #527175051
gcc-4.8-sanitize
skipped #527175063
gcc-4.9-lto
skipped #527175052
gcc-4.9-sanitize
skipped #527175057
gcc-4.9_lto-sanitize
skipped #527175053
gcc-6-sanitize
skipped #527175064
gcc-6_lto
skipped #527175058
gcc-6_lto-sanitize
skipped #527175054
gcc-7-sanitize
skipped #527175065
gcc-7_lto
skipped #527175059
gcc-7_lto-sanitize
skipped #527175055
gcc-8-sanitize
skipped #527175066
gcc-8_lto
skipped #527175060
gcc-8_lto-sanitize
skipped #527175056
gcc-9-sanitize
skipped #527175067
gcc-9_lto
skipped #527175061
gcc-9_lto-sanitize
skipped #527175050
gcc-snapshot-sanitize
skipped #527175049
gcc-snapshot_lto-sanitize
 
  Legacy
skipped #527175068
gcc-4.8_stable_lto-sanitize
skipped #527175069
gcc-6_unstable_lto-sanitize
 
Name Stage Failure
failed
gcc-snapshot Build
cc1: all warnings being treated as errors
make[1]: *** [Makefile:1002: elogin/libevol_login_la-md5calc.lo] Error 1
make[1]: *** Waiting for unfinished jobs....
make[1]: Leaving directory '/builds/jesusalva/server-code/src/evol/build/src'
make: *** [Makefile:381: all-recursive] Error 1
error 2
Running after_script
Uploading artifacts for failed job
ERROR: Job failed: exit code 1
failed
gcc-snapshot-i386 Build
cc1: all warnings being treated as errors
make[1]: *** [Makefile:1002: elogin/libevol_login_la-md5calc.lo] Error 1
make[1]: *** Waiting for unfinished jobs....
make[1]: Leaving directory '/builds/jesusalva/server-code/src/evol/build/src'
make: *** [Makefile:381: all-recursive] Error 1
error 2
Running after_script
Uploading artifacts for failed job
ERROR: Job failed: exit code 1
failed
gcc-7-i386 Build
./tools/ci/scripts/init.sh: line 81: git: command not found
git clone https:///hercules.git server-code
./tools/ci/scripts/init.sh: line 78: git: command not found
git clone https://gitlab.com/evol/hercules.git server-code
./tools/ci/scripts/init.sh: line 81: git: command not found
error 127
Running after_script
Uploading artifacts for failed job
ERROR: Job failed: exit code 1
failed
gcc-7 Build
./tools/ci/scripts/init.sh: line 81: git: command not found
git clone https:///hercules.git server-code
./tools/ci/scripts/init.sh: line 78: git: command not found
git clone https://gitlab.com/evol/hercules.git server-code
./tools/ci/scripts/init.sh: line 81: git: command not found
error 127
Running after_script
Uploading artifacts for failed job
ERROR: Job failed: exit code 1