<?xml version="1.0" encoding="utf-8"?>
<!-- Generator: Adobe Illustrator 23.0.5, SVG Export Plug-In . SVG Version: 6.00 Build 0)  -->
<svg version="1.1" id="Capa_1" xmlns="http://www.w3.org/2000/svg" xmlns:xlink="http://www.w3.org/1999/xlink" x="0px" y="0px"
	 viewBox="0 0 1000 1000" style="enable-background:new 0 0 1000 1000;" xml:space="preserve">
<style type="text/css">
	.st0{fill:#191919;}
</style>
<g>
	<path class="st0" d="M812.2,178.7L812.2,178.7C598.6,76.6,396.6,73.7,194.8,170l-29.6,16.7l3.5,87.1l56.7-22.9l0.2-0.1
		C404,165.6,577.1,162.2,755,240.4v92.2h79.9v-143L812.2,178.7z"/>
	<path class="st0" d="M602,593.5h124.3c-17.9,40.1-44.4,73.5-87.4,110.5c-28.7,24.6-60.5,47.2-97.3,68.9V239.5l-3.7-0.4
		c-16-1.7-32.3-2.8-48.5-3.1l-2.5-0.1L345,476.3L228.9,288.7l-3.3,1.4c-10.4,4.5-19.8,8.7-28.9,13.1l-28.3,13.5v133
		c0,137,52.9,248.3,157.3,330.9l30.4,24.1V701.5l-1.4-1.2c-65.1-59.6-100.6-136-105.8-227.2l97.6,157.7l115.1-194.9v475.8
		l107.8-62.5c42.2-24.5,80.8-52.1,114.8-82c75.5-66.6,127.9-144,149.6-253.6l0,0H602V593.5z"/>
</g>
</svg>
