%!PS-Adobe-3.0 EPSF-3.0
%%Creator: (MATLAB, The Mathworks, Inc. Version 9.10.0.1739362 \(R2021a\) Update 5. Operating System: Windows 10)
%%Title: (C:/Users/rkurnia/Documents/2. publication/202211 NEMOH MANUAL/figures/Cylinder/addedmass.eps)
%%CreationDate: 2022-11-24T09:50:51
%%Pages: (atend)
%%BoundingBox:     0     0   922   576
%%LanguageLevel: 3
%%EndComments
%%BeginProlog
%%BeginResource: procset (Apache XML Graphics Std ProcSet) 1.2 0
%%Version: 1.2 0
%%Copyright: (Copyright 2001-2003,2010 The Apache Software Foundation. License terms: http://www.apache.org/licenses/LICENSE-2.0)
/bd{bind def}bind def
/ld{load def}bd
/GR/grestore ld
/GS/gsave ld
/RM/rmoveto ld
/C/curveto ld
/t/show ld
/L/lineto ld
/ML/setmiterlimit ld
/CT/concat ld
/f/fill ld
/N/newpath ld
/S/stroke ld
/CC/setcmykcolor ld
/A/ashow ld
/cp/closepath ld
/RC/setrgbcolor ld
/LJ/setlinejoin ld
/GC/setgray ld
/LW/setlinewidth ld
/M/moveto ld
/re {4 2 roll M
1 index 0 rlineto
0 exch rlineto
neg 0 rlineto
cp } bd
/_ctm matrix def
/_tm matrix def
/BT { _ctm currentmatrix pop matrix _tm copy pop 0 0 moveto } bd
/ET { _ctm setmatrix } bd
/iTm { _ctm setmatrix _tm concat } bd
/Tm { _tm astore pop iTm 0 0 moveto } bd
/ux 0.0 def
/uy 0.0 def
/F {
  /Tp exch def
  /Tf exch def
  Tf findfont Tp scalefont setfont
  /cf Tf def  /cs Tp def
} bd
/ULS {currentpoint /uy exch def /ux exch def} bd
/ULE {
  /Tcx currentpoint pop def
  gsave
  newpath
  cf findfont cs scalefont dup
  /FontMatrix get 0 get /Ts exch def /FontInfo get dup
  /UnderlinePosition get Ts mul /To exch def
  /UnderlineThickness get Ts mul /Tt exch def
  ux uy To add moveto  Tcx uy To add lineto
  Tt setlinewidth stroke
  grestore
} bd
/OLE {
  /Tcx currentpoint pop def
  gsave
  newpath
  cf findfont cs scalefont dup
  /FontMatrix get 0 get /Ts exch def /FontInfo get dup
  /UnderlinePosition get Ts mul /To exch def
  /UnderlineThickness get Ts mul /Tt exch def
  ux uy To add cs add moveto Tcx uy To add cs add lineto
  Tt setlinewidth stroke
  grestore
} bd
/SOE {
  /Tcx currentpoint pop def
  gsave
  newpath
  cf findfont cs scalefont dup
  /FontMatrix get 0 get /Ts exch def /FontInfo get dup
  /UnderlinePosition get Ts mul /To exch def
  /UnderlineThickness get Ts mul /Tt exch def
  ux uy To add cs 10 mul 26 idiv add moveto Tcx uy To add cs 10 mul 26 idiv add lineto
  Tt setlinewidth stroke
  grestore
} bd
/QT {
/Y22 exch store
/X22 exch store
/Y21 exch store
/X21 exch store
currentpoint
/Y21 load 2 mul add 3 div exch
/X21 load 2 mul add 3 div exch
/X21 load 2 mul /X22 load add 3 div
/Y21 load 2 mul /Y22 load add 3 div
/X22 load /Y22 load curveto
} bd
/SSPD {
dup length /d exch dict def
{
/v exch def
/k exch def
currentpagedevice k known {
/cpdv currentpagedevice k get def
v cpdv ne {
/upd false def
/nullv v type /nulltype eq def
/nullcpdv cpdv type /nulltype eq def
nullv nullcpdv or
{
/upd true def
} {
/sametype v type cpdv type eq def
sametype {
v type /arraytype eq {
/vlen v length def
/cpdvlen cpdv length def
vlen cpdvlen eq {
0 1 vlen 1 sub {
/i exch def
/obj v i get def
/cpdobj cpdv i get def
obj cpdobj ne {
/upd true def
exit
} if
} for
} {
/upd true def
} ifelse
} {
v type /dicttype eq {
v {
/dv exch def
/dk exch def
/cpddv cpdv dk get def
dv cpddv ne {
/upd true def
exit
} if
} forall
} {
/upd true def
} ifelse
} ifelse
} if
} ifelse
upd true eq {
d k v put
} if
} if
} if
} forall
d length 0 gt {
d setpagedevice
} if
} bd
/RE { % /NewFontName [NewEncodingArray] /FontName RE -
  findfont dup length dict begin
  {
    1 index /FID ne
    {def} {pop pop} ifelse
  } forall
  /Encoding exch def
  /FontName 1 index def
  currentdict definefont pop
  end
} bind def
%%EndResource
%%BeginResource: procset (Apache XML Graphics EPS ProcSet) 1.0 0
%%Version: 1.0 0
%%Copyright: (Copyright 2002-2003 The Apache Software Foundation. License terms: http://www.apache.org/licenses/LICENSE-2.0)
/BeginEPSF { %def
/b4_Inc_state save def         % Save state for cleanup
/dict_count countdictstack def % Count objects on dict stack
/op_count count 1 sub def      % Count objects on operand stack
userdict begin                 % Push userdict on dict stack
/showpage { } def              % Redefine showpage, { } = null proc
0 setgray 0 setlinecap         % Prepare graphics state
1 setlinewidth 0 setlinejoin
10 setmiterlimit [ ] 0 setdash newpath
/languagelevel where           % If level not equal to 1 then
{pop languagelevel             % set strokeadjust and
1 ne                           % overprint to their defaults.
{false setstrokeadjust false setoverprint
} if
} if
} bd
/EndEPSF { %def
count op_count sub {pop} repeat            % Clean up stacks
countdictstack dict_count sub {end} repeat
b4_Inc_state restore
} bd
%%EndResource
%FOPBeginFontDict
%%IncludeResource: font Courier-Oblique
%%IncludeResource: font Courier-BoldOblique
%%IncludeResource: font Courier-Bold
%%IncludeResource: font ZapfDingbats
%%IncludeResource: font Symbol
%%IncludeResource: font Helvetica
%%IncludeResource: font Helvetica-Oblique
%%IncludeResource: font Helvetica-Bold
%%IncludeResource: font Helvetica-BoldOblique
%%IncludeResource: font Times-Roman
%%IncludeResource: font Times-Italic
%%IncludeResource: font Times-Bold
%%IncludeResource: font Times-BoldItalic
%%IncludeResource: font Courier
%FOPEndFontDict
%%BeginResource: encoding WinAnsiEncoding
/WinAnsiEncoding [
/.notdef /.notdef /.notdef /.notdef /.notdef
/.notdef /.notdef /.notdef /.notdef /.notdef
/.notdef /.notdef /.notdef /.notdef /.notdef
/.notdef /.notdef /.notdef /.notdef /.notdef
/.notdef /.notdef /.notdef /.notdef /.notdef
/.notdef /.notdef /.notdef /.notdef /.notdef
/.notdef /.notdef /space /exclam /quotedbl
/numbersign /dollar /percent /ampersand /quotesingle
/parenleft /parenright /asterisk /plus /comma
/hyphen /period /slash /zero /one
/two /three /four /five /six
/seven /eight /nine /colon /semicolon
/less /equal /greater /question /at
/A /B /C /D /E
/F /G /H /I /J
/K /L /M /N /O
/P /Q /R /S /T
/U /V /W /X /Y
/Z /bracketleft /backslash /bracketright /asciicircum
/underscore /quoteleft /a /b /c
/d /e /f /g /h
/i /j /k /l /m
/n /o /p /q /r
/s /t /u /v /w
/x /y /z /braceleft /bar
/braceright /asciitilde /bullet /Euro /bullet
/quotesinglbase /florin /quotedblbase /ellipsis /dagger
/daggerdbl /circumflex /perthousand /Scaron /guilsinglleft
/OE /bullet /Zcaron /bullet /bullet
/quoteleft /quoteright /quotedblleft /quotedblright /bullet
/endash /emdash /asciitilde /trademark /scaron
/guilsinglright /oe /bullet /zcaron /Ydieresis
/space /exclamdown /cent /sterling /currency
/yen /brokenbar /section /dieresis /copyright
/ordfeminine /guillemotleft /logicalnot /sfthyphen /registered
/macron /degree /plusminus /twosuperior /threesuperior
/acute /mu /paragraph /middot /cedilla
/onesuperior /ordmasculine /guillemotright /onequarter /onehalf
/threequarters /questiondown /Agrave /Aacute /Acircumflex
/Atilde /Adieresis /Aring /AE /Ccedilla
/Egrave /Eacute /Ecircumflex /Edieresis /Igrave
/Iacute /Icircumflex /Idieresis /Eth /Ntilde
/Ograve /Oacute /Ocircumflex /Otilde /Odieresis
/multiply /Oslash /Ugrave /Uacute /Ucircumflex
/Udieresis /Yacute /Thorn /germandbls /agrave
/aacute /acircumflex /atilde /adieresis /aring
/ae /ccedilla /egrave /eacute /ecircumflex
/edieresis /igrave /iacute /icircumflex /idieresis
/eth /ntilde /ograve /oacute /ocircumflex
/otilde /odieresis /divide /oslash /ugrave
/uacute /ucircumflex /udieresis /yacute /thorn
/ydieresis
] def
%%EndResource
%FOPBeginFontReencode
/Courier-Oblique findfont
dup length dict begin
  {1 index /FID ne {def} {pop pop} ifelse} forall
  /Encoding WinAnsiEncoding def
  currentdict
end
/Courier-Oblique exch definefont pop
/Courier-BoldOblique findfont
dup length dict begin
  {1 index /FID ne {def} {pop pop} ifelse} forall
  /Encoding WinAnsiEncoding def
  currentdict
end
/Courier-BoldOblique exch definefont pop
/Courier-Bold findfont
dup length dict begin
  {1 index /FID ne {def} {pop pop} ifelse} forall
  /Encoding WinAnsiEncoding def
  currentdict
end
/Courier-Bold exch definefont pop
/Helvetica findfont
dup length dict begin
  {1 index /FID ne {def} {pop pop} ifelse} forall
  /Encoding WinAnsiEncoding def
  currentdict
end
/Helvetica exch definefont pop
/Helvetica-Oblique findfont
dup length dict begin
  {1 index /FID ne {def} {pop pop} ifelse} forall
  /Encoding WinAnsiEncoding def
  currentdict
end
/Helvetica-Oblique exch definefont pop
/Helvetica-Bold findfont
dup length dict begin
  {1 index /FID ne {def} {pop pop} ifelse} forall
  /Encoding WinAnsiEncoding def
  currentdict
end
/Helvetica-Bold exch definefont pop
/Helvetica-BoldOblique findfont
dup length dict begin
  {1 index /FID ne {def} {pop pop} ifelse} forall
  /Encoding WinAnsiEncoding def
  currentdict
end
/Helvetica-BoldOblique exch definefont pop
/Times-Roman findfont
dup length dict begin
  {1 index /FID ne {def} {pop pop} ifelse} forall
  /Encoding WinAnsiEncoding def
  currentdict
end
/Times-Roman exch definefont pop
/Times-Italic findfont
dup length dict begin
  {1 index /FID ne {def} {pop pop} ifelse} forall
  /Encoding WinAnsiEncoding def
  currentdict
end
/Times-Italic exch definefont pop
/Times-Bold findfont
dup length dict begin
  {1 index /FID ne {def} {pop pop} ifelse} forall
  /Encoding WinAnsiEncoding def
  currentdict
end
/Times-Bold exch definefont pop
/Times-BoldItalic findfont
dup length dict begin
  {1 index /FID ne {def} {pop pop} ifelse} forall
  /Encoding WinAnsiEncoding def
  currentdict
end
/Times-BoldItalic exch definefont pop
/Courier findfont
dup length dict begin
  {1 index /FID ne {def} {pop pop} ifelse} forall
  /Encoding WinAnsiEncoding def
  currentdict
end
/Courier exch definefont pop
%FOPEndFontReencode
%%EndProlog
%%Page: 1 1
%%PageBoundingBox: 0 0 922 576
%%BeginPageSetup
[1 0 0 -1 0 576] CT
%%EndPageSetup
GS
[0.6 0 0 0.6 0 0] CT
1 GC
N
0 0 1536 960 re
f
GR
GS
[0.6 0 0 0.6 0 0] CT
1 GC
N
0 0 1536 960 re
f
GR
GS
[0.6 0 0 0.6 0 0] CT
1 GC
N
200 254 M
714 254 L
714 82 L
200 82 L
cp
f
GR
GS
[0.6 0 0 0.6 0 0] CT
0.149 GC
2 setlinecap
1 LJ
0.833 LW
N
200 254 M
714 254 L
S
GR
GS
[0.6 0 0 0.6 0 0] CT
0.149 GC
2 setlinecap
1 LJ
0.833 LW
N
200 82 M
714 82 L
S
GR
GS
[0.6 0 0 0.6 0 0] CT
0.149 GC
2 setlinecap
1 LJ
0.833 LW
N
200 254 M
200 248.86 L
S
GR
GS
[0.6 0 0 0.6 0 0] CT
0.149 GC
2 setlinecap
1 LJ
0.833 LW
N
281.847 254 M
281.847 248.86 L
S
GR
GS
[0.6 0 0 0.6 0 0] CT
0.149 GC
2 setlinecap
1 LJ
0.833 LW
N
363.694 254 M
363.694 248.86 L
S
GR
GS
[0.6 0 0 0.6 0 0] CT
0.149 GC
2 setlinecap
1 LJ
0.833 LW
N
445.541 254 M
445.541 248.86 L
S
GR
GS
[0.6 0 0 0.6 0 0] CT
0.149 GC
2 setlinecap
1 LJ
0.833 LW
N
527.389 254 M
527.389 248.86 L
S
GR
GS
[0.6 0 0 0.6 0 0] CT
0.149 GC
2 setlinecap
1 LJ
0.833 LW
N
609.236 254 M
609.236 248.86 L
S
GR
GS
[0.6 0 0 0.6 0 0] CT
0.149 GC
2 setlinecap
1 LJ
0.833 LW
N
691.083 254 M
691.083 248.86 L
S
GR
GS
[0.6 0 0 0.6 0 0] CT
0.149 GC
2 setlinecap
1 LJ
0.833 LW
N
200 82 M
200 87.14 L
S
GR
GS
[0.6 0 0 0.6 0 0] CT
0.149 GC
2 setlinecap
1 LJ
0.833 LW
N
281.847 82 M
281.847 87.14 L
S
GR
GS
[0.6 0 0 0.6 0 0] CT
0.149 GC
2 setlinecap
1 LJ
0.833 LW
N
363.694 82 M
363.694 87.14 L
S
GR
GS
[0.6 0 0 0.6 0 0] CT
0.149 GC
2 setlinecap
1 LJ
0.833 LW
N
445.541 82 M
445.541 87.14 L
S
GR
GS
[0.6 0 0 0.6 0 0] CT
0.149 GC
2 setlinecap
1 LJ
0.833 LW
N
527.389 82 M
527.389 87.14 L
S
GR
GS
[0.6 0 0 0.6 0 0] CT
0.149 GC
2 setlinecap
1 LJ
0.833 LW
N
609.236 82 M
609.236 87.14 L
S
GR
GS
[0.6 0 0 0.6 0 0] CT
0.149 GC
2 setlinecap
1 LJ
0.833 LW
N
691.083 82 M
691.083 87.14 L
S
GR
GS
[0.6 0 0 0.6 120 157.40001] CT
0.149 GC
/Helvetica-Bold 25 F
GS
[1 0 0 1 0 0] CT
-7 26 moveto 
1 -1 scale
(0) t 
GR
GR
GS
[0.6 0 0 0.6 169.10829 157.40001] CT
0.149 GC
/Helvetica-Bold 25 F
GS
[1 0 0 1 0 0] CT
-7 26 moveto 
1 -1 scale
(1) t 
GR
GR
GS
[0.6 0 0 0.6 218.21657 157.40001] CT
0.149 GC
/Helvetica-Bold 25 F
GS
[1 0 0 1 0 0] CT
-7 26 moveto 
1 -1 scale
(2) t 
GR
GR
GS
[0.6 0 0 0.6 267.32486 157.40001] CT
0.149 GC
/Helvetica-Bold 25 F
GS
[1 0 0 1 0 0] CT
-7 26 moveto 
1 -1 scale
(3) t 
GR
GR
GS
[0.6 0 0 0.6 316.43314 157.40001] CT
0.149 GC
/Helvetica-Bold 25 F
GS
[1 0 0 1 0 0] CT
-7 26 moveto 
1 -1 scale
(4) t 
GR
GR
GS
[0.6 0 0 0.6 365.54141 157.40001] CT
0.149 GC
/Helvetica-Bold 25 F
GS
[1 0 0 1 0 0] CT
-7 26 moveto 
1 -1 scale
(5) t 
GR
GR
GS
[0.6 0 0 0.6 414.64971 157.40001] CT
0.149 GC
/Helvetica-Bold 25 F
GS
[1 0 0 1 0 0] CT
-7 26 moveto 
1 -1 scale
(6) t 
GR
GR
GS
[0.6 0 0 0.6 240.60001 194.4] CT
0.149 GC
N
4.391 0.313 M
2.813 0.313 2.102 -0.852 QT
1.391 -2.016 1.391 -3.688 QT
1.391 -4.797 1.594 -5.859 QT
1.797 -6.922 2.195 -8.008 QT
2.594 -9.094 3.117 -10.047 QT
3.641 -11 4.281 -11.891 QT
4.406 -12.078 4.609 -12.078 QT
5.781 -12.078 5.891 -11.969 QT
6 -11.859 6 -11.703 QT
6 -11.547 5.922 -11.438 QT
3.375 -7.922 3.375 -4.953 QT
3.375 -3.672 3.969 -2.742 QT
4.563 -1.813 4.781 -1.813 QT
5.828 -1.813 6.727 -2.43 QT
7.625 -3.047 8.281 -4 QT
8.281 -4.5 8.445 -5.539 QT
8.609 -6.578 8.977 -7.391 QT
9.344 -8.203 9.844 -8.203 QT
11.484 -8.203 11.484 -7.453 QT
11.484 -7.016 11.305 -6.352 QT
11.125 -5.688 10.898 -5.117 QT
10.672 -4.547 10.344 -3.813 QT
10.672 -1.813 11.344 -1.813 QT
12.313 -1.813 13.289 -2.375 QT
14.266 -2.938 15.016 -3.852 QT
15.766 -4.766 16.195 -5.813 QT
16.625 -6.859 16.625 -7.813 QT
16.625 -8.656 16.359 -9.125 QT
16.094 -9.594 15.656 -10.117 QT
15.219 -10.641 15.219 -10.953 QT
15.219 -11.5 15.688 -11.953 QT
16.156 -12.406 16.688 -12.406 QT
18.359 -12.406 18.648 -11.781 QT
18.938 -11.156 18.938 -10.359 QT
18.938 -9.078 18.43 -7.125 QT
17.922 -5.172 17.266 -3.875 QT
16.359 -2.109 15 -0.898 QT
13.641 0.313 10.938 0.313 QT
9.859 0.313 9.195 -0.336 QT
8.531 -0.984 8.531 -0.984 QT
8.531 -0.984 7.547 -0.336 QT
6.563 0.313 4.391 0.313 QT
cp
f
GR
GS
[0.6 0 0 0.6 252.00001 194.4] CT
0.149 GC
/Helvetica-Bold 27.5 F
GS
[1 0 0 1 0 0] CT
0 0 moveto 
1 -1 scale
( [rad/s]) t 
GR
GR
GS
[0.6 0 0 0.6 0 0] CT
0.149 GC
2 setlinecap
1 LJ
0.833 LW
N
200 254 M
200 82 L
S
GR
GS
[0.6 0 0 0.6 0 0] CT
0.149 GC
2 setlinecap
1 LJ
0.833 LW
N
714 254 M
714 82 L
S
GR
GS
[0.6 0 0 0.6 0 0] CT
0.149 GC
2 setlinecap
1 LJ
0.833 LW
N
200 250.183 M
205.14 250.183 L
S
GR
GS
[0.6 0 0 0.6 0 0] CT
0.149 GC
2 setlinecap
1 LJ
0.833 LW
N
200 217.013 M
205.14 217.013 L
S
GR
GS
[0.6 0 0 0.6 0 0] CT
0.149 GC
2 setlinecap
1 LJ
0.833 LW
N
200 183.843 M
205.14 183.843 L
S
GR
GS
[0.6 0 0 0.6 0 0] CT
0.149 GC
2 setlinecap
1 LJ
0.833 LW
N
200 150.673 M
205.14 150.673 L
S
GR
GS
[0.6 0 0 0.6 0 0] CT
0.149 GC
2 setlinecap
1 LJ
0.833 LW
N
200 117.503 M
205.14 117.503 L
S
GR
GS
[0.6 0 0 0.6 0 0] CT
0.149 GC
2 setlinecap
1 LJ
0.833 LW
N
200 84.333 M
205.14 84.333 L
S
GR
GS
[0.6 0 0 0.6 0 0] CT
0.149 GC
2 setlinecap
1 LJ
0.833 LW
N
714 250.183 M
708.86 250.183 L
S
GR
GS
[0.6 0 0 0.6 0 0] CT
0.149 GC
2 setlinecap
1 LJ
0.833 LW
N
714 217.013 M
708.86 217.013 L
S
GR
GS
[0.6 0 0 0.6 0 0] CT
0.149 GC
2 setlinecap
1 LJ
0.833 LW
N
714 183.843 M
708.86 183.843 L
S
GR
GS
[0.6 0 0 0.6 0 0] CT
0.149 GC
2 setlinecap
1 LJ
0.833 LW
N
714 150.673 M
708.86 150.673 L
S
GR
GS
[0.6 0 0 0.6 0 0] CT
0.149 GC
2 setlinecap
1 LJ
0.833 LW
N
714 117.503 M
708.86 117.503 L
S
GR
GS
[0.6 0 0 0.6 0 0] CT
0.149 GC
2 setlinecap
1 LJ
0.833 LW
N
714 84.333 M
708.86 84.333 L
S
GR
GS
[0.6 0 0 0.6 115.00001 150.10973] CT
0.149 GC
/Helvetica-Bold 25 F
GS
[1 0 0 1 0 0] CT
-35 10 moveto 
1 -1 scale
(0.6) t 
GR
GR
GS
[0.6 0 0 0.6 115.00001 130.20773] CT
0.149 GC
/Helvetica-Bold 25 F
GS
[1 0 0 1 0 0] CT
-35 10 moveto 
1 -1 scale
(0.8) t 
GR
GR
GS
[0.6 0 0 0.6 115.00001 110.30572] CT
0.149 GC
/Helvetica-Bold 25 F
GS
[1 0 0 1 0 0] CT
-14 10 moveto 
1 -1 scale
(1) t 
GR
GR
GS
[0.6 0 0 0.6 115.00001 90.40372] CT
0.149 GC
/Helvetica-Bold 25 F
GS
[1 0 0 1 0 0] CT
-35 10 moveto 
1 -1 scale
(1.2) t 
GR
GR
GS
[0.6 0 0 0.6 115.00001 70.50171] CT
0.149 GC
/Helvetica-Bold 25 F
GS
[1 0 0 1 0 0] CT
-35 10 moveto 
1 -1 scale
(1.4) t 
GR
GR
GS
[0.6 0 0 0.6 115.00001 50.59971] CT
0.149 GC
/Helvetica-Bold 25 F
GS
[1 0 0 1 0 0] CT
-35 10 moveto 
1 -1 scale
(1.6) t 
GR
GR
GS
[0 -0.6 0.6 0 80.4 113.4] CT
0.149 GC
/Helvetica-Bold 27.5 F
GS
[1 0 0 1 0 0] CT
0 0 moveto 
1 -1 scale
(a) t 
GR
GR
GS
[0 -0.6 0.6 0 88.2 103.8] CT
0.149 GC
/Helvetica-Bold 22 F
GS
[1 0 0 1 0 0] CT
0 0 moveto 
1 -1 scale
(11) t 
GR
GR
GS
[0.6 0 0 0.6 120 45.6] CT
0.149 GC
N
3.672 -0.719 M
3.672 -0.922 3.797 -1.078 QT
9 -6.25 L
3.797 -11.453 L
3.672 -11.578 3.672 -11.781 QT
3.672 -11.969 3.82 -12.125 QT
3.969 -12.281 4.172 -12.281 QT
5.344 -12.281 5.547 -12.125 QT
10.219 -7.453 L
14.875 -12.125 L
15.094 -12.281 15.25 -12.281 QT
16.453 -12.281 16.602 -12.133 QT
16.75 -11.984 16.75 -11.781 QT
16.75 -11.578 16.625 -11.453 QT
11.422 -6.25 L
16.625 -1.078 L
16.75 -0.922 16.75 -0.719 QT
16.75 -0.516 16.602 -0.367 QT
16.453 -0.219 15.25 -0.219 QT
15.063 -0.219 14.875 -0.406 QT
10.219 -5.047 L
5.547 -0.406 L
5.375 -0.219 4.172 -0.219 QT
3.969 -0.219 3.82 -0.375 QT
3.672 -0.531 3.672 -0.719 QT
cp
f
GR
GS
[0.6 0 0 0.6 132.60001 45.6] CT
0.149 GC
/Helvetica-Bold 25 F
GS
[1 0 0 1 0 0] CT
0 0 moveto 
1 -1 scale
(10) t 
GR
GR
GS
[0.6 0 0 0.6 149.40001 38.4] CT
0.149 GC
/Helvetica-Bold 20 F
GS
[1 0 0 1 0 0] CT
0 0 moveto 
1 -1 scale
(6) t 
GR
GR
GS
[0.6 0 0 0.6 0 0] CT
0 0 1 RC
1 LJ
3.333 LW
N
205.14 136.428 M
210.28 135.712 L
215.42 134.454 L
220.56 132.548 L
225.7 129.852 L
230.84 126.202 L
235.98 121.458 L
241.12 115.552 L
246.26 108.57 L
251.4 100.84 L
256.54 93.041 L
261.68 86.291 L
266.82 82.145 L
271.96 82.406 L
277.1 88.649 L
282.24 101.554 L
287.38 120.375 L
292.52 143.002 L
297.66 166.646 L
302.8 188.849 L
307.94 207.918 L
313.08 223.184 L
318.22 234.688 L
323.36 242.864 L
328.5 248.313 L
333.64 251.634 L
338.78 253.352 L
343.92 253.9 L
349.06 253.618 L
354.2 252.764 L
359.34 251.53 L
364.48 250.059 L
369.62 248.452 L
374.76 246.781 L
379.9 245.098 L
385.04 243.438 L
390.18 241.823 L
395.32 240.268 L
400.46 238.784 L
405.6 237.372 L
410.74 236.038 L
415.88 234.779 L
421.02 233.595 L
426.16 232.483 L
431.3 231.44 L
436.44 230.465 L
441.58 229.552 L
446.72 228.7 L
451.86 227.905 L
457 227.165 L
462.14 226.477 L
467.28 225.838 L
472.42 225.248 L
477.56 224.702 L
482.7 224.197 L
487.84 223.73 L
492.98 223.289 L
498.12 222.852 L
503.26 222.365 L
508.4 221.704 L
513.54 220.587 L
518.68 218.57 L
523.82 216.046 L
528.96 214.714 L
534.1 214.585 L
539.24 214.814 L
544.38 215.023 L
549.52 215.177 L
554.66 210.989 L
559.8 214.119 L
564.94 214.519 L
570.08 214.614 L
575.22 214.624 L
580.36 214.574 L
585.5 213.188 L
590.64 213.416 L
595.78 213.775 L
600.92 213.755 L
606.06 213.482 L
611.2 213.013 L
616.34 212.372 L
621.48 212.876 L
626.62 212.83 L
631.76 212.668 L
636.9 212.301 L
642.04 211.899 L
647.18 211.906 L
652.32 211.845 L
657.46 211.652 L
662.6 211.432 L
667.74 211.266 L
672.88 211.156 L
678.02 211.056 L
683.16 210.949 L
688.3 210.84 L
693.44 210.746 L
698.58 210.504 L
703.72 210.511 L
708.86 210.502 L
714 210.479 L
S
GR
GS
[0.6 0 0 0.6 0 0] CT
1 0 0 RC
[12 12] 0 setdash
2 LJ
3.333 LW
N
205.14 136.373 M
210.28 135.669 L
215.42 134.43 L
220.56 132.554 L
225.7 129.898 L
230.84 126.305 L
235.98 121.636 L
241.12 115.832 L
246.26 108.988 L
251.4 101.448 L
256.54 93.898 L
261.68 87.454 L
266.82 83.637 L
271.96 84.171 L
277.1 90.503 L
282.24 103.166 L
287.38 121.335 L
292.52 142.943 L
297.66 165.387 L
302.8 186.37 L
307.94 204.415 L
313.08 218.917 L
318.22 229.924 L
323.36 237.843 L
328.5 243.22 L
333.64 246.603 L
338.78 248.477 L
343.92 249.237 L
349.06 249.193 L
354.2 248.591 L
359.34 247.609 L
364.48 246.369 L
369.62 244.971 L
374.76 243.491 L
379.9 241.974 L
385.04 240.455 L
390.18 238.961 L
395.32 237.515 L
400.46 236.131 L
405.6 234.817 L
410.74 233.575 L
415.88 232.405 L
421.02 231.307 L
426.16 230.275 L
431.3 229.303 L
436.44 228.381 L
441.58 227.503 L
446.72 226.666 L
451.86 225.865 L
457 225.101 L
462.14 224.375 L
467.28 223.687 L
472.42 223.04 L
477.56 222.436 L
482.7 221.874 L
487.84 221.352 L
492.98 220.863 L
498.12 220.397 L
503.26 219.95 L
508.4 219.52 L
513.54 219.104 L
518.68 218.701 L
523.82 218.316 L
528.96 217.951 L
534.1 217.608 L
539.24 217.288 L
544.38 216.989 L
549.52 216.707 L
554.66 216.435 L
559.8 216.171 L
564.94 215.911 L
570.08 215.656 L
575.22 215.41 L
580.36 215.178 L
585.5 214.961 L
590.64 214.758 L
595.78 214.565 L
600.92 214.38 L
606.06 214.197 L
611.2 214.013 L
616.34 213.83 L
621.48 213.651 L
626.62 213.477 L
631.76 213.299 L
636.9 213.099 L
642.04 212.885 L
647.18 212.778 L
652.32 212.655 L
657.46 212.497 L
662.6 212.356 L
667.74 212.182 L
672.88 211.888 L
678.02 211.848 L
683.16 211.802 L
688.3 211.68 L
693.44 211.527 L
698.58 211.455 L
703.72 211.337 L
708.86 211.18 L
714 211.011 L
S
GR
GS
[0.6 0 0 0.6 0 0] CT
0 1 0 RC
[12 3 6 3] 0 setdash
2 LJ
3.333 LW
N
205.14 136.326 M
210.28 135.609 L
215.42 134.35 L
220.56 132.442 L
225.7 129.743 L
230.84 126.09 L
235.98 121.341 L
241.12 115.428 L
246.26 108.438 L
251.4 100.702 L
256.54 92.9 L
261.68 86.148 L
266.82 82 L
271.96 82.257 L
277.1 88.491 L
282.24 101.377 L
287.38 120.171 L
292.52 142.768 L
297.66 166.403 L
302.8 188.578 L
307.94 207.653 L
313.08 222.942 L
318.22 234.481 L
323.36 242.706 L
328.5 248.212 L
333.64 251.595 L
338.78 253.383 L
343.92 254 L
349.06 253.788 L
354.2 253.008 L
359.34 251.845 L
364.48 250.438 L
369.62 248.898 L
374.76 247.303 L
379.9 245.708 L
385.04 244.168 L
390.18 242.757 L
395.32 241.619 L
400.46 241.316 L
405.6 216.6 L
410.74 233.367 L
415.88 233.449 L
421.02 232.735 L
426.16 231.873 L
431.3 230.994 L
436.44 230.133 L
441.58 229.305 L
446.72 228.522 L
451.86 227.794 L
457 227.126 L
462.14 226.524 L
467.28 226.05 L
472.42 225.372 L
477.56 217.064 L
482.7 219.999 L
487.84 221.22 L
492.98 221.311 L
498.12 221.153 L
503.26 220.896 L
508.4 220.595 L
513.54 220.303 L
518.68 219.999 L
523.82 219.589 L
528.96 218.523 L
534.1 214.502 L
539.24 215.403 L
544.38 216.578 L
549.52 216.89 L
554.66 216.923 L
559.8 216.835 L
564.94 216.667 L
570.08 216.378 L
575.22 215.676 L
580.36 213.702 L
585.5 212.859 L
590.64 213.928 L
595.78 214.456 L
600.92 214.615 L
606.06 214.594 L
611.2 214.413 L
616.34 213.936 L
621.48 212.791 L
626.62 211.755 L
631.76 212.314 L
636.9 212.884 L
642.04 213.108 L
647.18 213.104 L
652.32 212.873 L
657.46 212.267 L
662.6 211.33 L
667.74 211.179 L
672.88 211.678 L
678.02 211.999 L
683.16 212.062 L
688.3 211.879 L
693.44 211.385 L
698.58 210.738 L
703.72 210.662 L
708.86 211.015 L
714 211.247 L
S
GR
GS
[0.6 0 0 0.6 0 0] CT
1 GC
N
701 184 M
701 94 L
398 94 L
398 184 L
cp
f
GR
GS
[0.6 0 0 0.6 274.07912 66.27258] CT
/Helvetica-Bold 22.5 F
GS
[1 0 0 1 0 0] CT
0 9 moveto 
1 -1 scale
(HYDROSTAR with IRR) t 
GR
GR
GS
[0.6 0 0 0.6 0 0] CT
0 0 1 RC
1 LJ
3.333 LW
N
403.004 110.454 M
453.045 110.454 L
S
GR
GS
[0.6 0 0 0.6 274.07912 83.4] CT
/Helvetica-Bold 22.5 F
GS
[1 0 0 1 0 0] CT
0 9 moveto 
1 -1 scale
(NEMOH with IRR) t 
GR
GR
GS
[0.6 0 0 0.6 0 0] CT
1 0 0 RC
[12 12] 0 setdash
2 LJ
3.333 LW
N
403.004 139 M
453.045 139 L
S
GR
GS
[0.6 0 0 0.6 274.07912 100.52742] CT
/Helvetica-Bold 22.5 F
GS
[1 0 0 1 0 0] CT
0 9 moveto 
1 -1 scale
(NEMOH without IRR) t 
GR
GR
GS
[0.6 0 0 0.6 0 0] CT
0 1 0 RC
[12 3 6 3] 0 setdash
2 LJ
3.333 LW
N
403.004 167.546 M
453.045 167.546 L
S
GR
GS
[0.6 0 0 0.6 0 0] CT
0.149 GC
10.0 ML
0.833 LW
N
398 184 M
398 94 L
701 94 L
701 184 L
cp
S
GR
GS
[0.6 0 0 0.6 0 0] CT
1 GC
N
876 254 M
1390 254 L
1390 82 L
876 82 L
cp
f
GR
GS
[0.6 0 0 0.6 0 0] CT
0.149 GC
2 setlinecap
1 LJ
0.833 LW
N
876 254 M
1390 254 L
S
GR
GS
[0.6 0 0 0.6 0 0] CT
0.149 GC
2 setlinecap
1 LJ
0.833 LW
N
876 82 M
1390 82 L
S
GR
GS
[0.6 0 0 0.6 0 0] CT
0.149 GC
2 setlinecap
1 LJ
0.833 LW
N
876 254 M
876 248.86 L
S
GR
GS
[0.6 0 0 0.6 0 0] CT
0.149 GC
2 setlinecap
1 LJ
0.833 LW
N
957.847 254 M
957.847 248.86 L
S
GR
GS
[0.6 0 0 0.6 0 0] CT
0.149 GC
2 setlinecap
1 LJ
0.833 LW
N
1039.694 254 M
1039.694 248.86 L
S
GR
GS
[0.6 0 0 0.6 0 0] CT
0.149 GC
2 setlinecap
1 LJ
0.833 LW
N
1121.541 254 M
1121.541 248.86 L
S
GR
GS
[0.6 0 0 0.6 0 0] CT
0.149 GC
2 setlinecap
1 LJ
0.833 LW
N
1203.389 254 M
1203.389 248.86 L
S
GR
GS
[0.6 0 0 0.6 0 0] CT
0.149 GC
2 setlinecap
1 LJ
0.833 LW
N
1285.236 254 M
1285.236 248.86 L
S
GR
GS
[0.6 0 0 0.6 0 0] CT
0.149 GC
2 setlinecap
1 LJ
0.833 LW
N
1367.083 254 M
1367.083 248.86 L
S
GR
GS
[0.6 0 0 0.6 0 0] CT
0.149 GC
2 setlinecap
1 LJ
0.833 LW
N
876 82 M
876 87.14 L
S
GR
GS
[0.6 0 0 0.6 0 0] CT
0.149 GC
2 setlinecap
1 LJ
0.833 LW
N
957.847 82 M
957.847 87.14 L
S
GR
GS
[0.6 0 0 0.6 0 0] CT
0.149 GC
2 setlinecap
1 LJ
0.833 LW
N
1039.694 82 M
1039.694 87.14 L
S
GR
GS
[0.6 0 0 0.6 0 0] CT
0.149 GC
2 setlinecap
1 LJ
0.833 LW
N
1121.541 82 M
1121.541 87.14 L
S
GR
GS
[0.6 0 0 0.6 0 0] CT
0.149 GC
2 setlinecap
1 LJ
0.833 LW
N
1203.389 82 M
1203.389 87.14 L
S
GR
GS
[0.6 0 0 0.6 0 0] CT
0.149 GC
2 setlinecap
1 LJ
0.833 LW
N
1285.236 82 M
1285.236 87.14 L
S
GR
GS
[0.6 0 0 0.6 0 0] CT
0.149 GC
2 setlinecap
1 LJ
0.833 LW
N
1367.083 82 M
1367.083 87.14 L
S
GR
GS
[0.6 0 0 0.6 525.60002 157.39999] CT
0.149 GC
/Helvetica-Bold 25 F
GS
[1 0 0 1 0 0] CT
-7 26 moveto 
1 -1 scale
(0) t 
GR
GR
GS
[0.6 0 0 0.6 574.70829 157.39999] CT
0.149 GC
/Helvetica-Bold 25 F
GS
[1 0 0 1 0 0] CT
-7 26 moveto 
1 -1 scale
(1) t 
GR
GR
GS
[0.6 0 0 0.6 623.81655 157.39999] CT
0.149 GC
/Helvetica-Bold 25 F
GS
[1 0 0 1 0 0] CT
-7 26 moveto 
1 -1 scale
(2) t 
GR
GR
GS
[0.6 0 0 0.6 672.92486 157.39999] CT
0.149 GC
/Helvetica-Bold 25 F
GS
[1 0 0 1 0 0] CT
-7 26 moveto 
1 -1 scale
(3) t 
GR
GR
GS
[0.6 0 0 0.6 722.03316 157.39999] CT
0.149 GC
/Helvetica-Bold 25 F
GS
[1 0 0 1 0 0] CT
-7 26 moveto 
1 -1 scale
(4) t 
GR
GR
GS
[0.6 0 0 0.6 771.14146 157.39999] CT
0.149 GC
/Helvetica-Bold 25 F
GS
[1 0 0 1 0 0] CT
-7 26 moveto 
1 -1 scale
(5) t 
GR
GR
GS
[0.6 0 0 0.6 820.24969 157.39999] CT
0.149 GC
/Helvetica-Bold 25 F
GS
[1 0 0 1 0 0] CT
-7 26 moveto 
1 -1 scale
(6) t 
GR
GR
GS
[0.6 0 0 0.6 646.20003 194.4] CT
0.149 GC
N
/f876989070{4.391 0.313 M
2.813 0.313 2.102 -0.852 QT
1.391 -2.016 1.391 -3.688 QT
1.391 -4.797 1.594 -5.859 QT
1.797 -6.922 2.195 -8.008 QT
2.594 -9.094 3.117 -10.047 QT
3.641 -11 4.281 -11.891 QT
4.406 -12.078 4.609 -12.078 QT
5.781 -12.078 5.891 -11.969 QT
6 -11.859 6 -11.703 QT
6 -11.547 5.922 -11.438 QT
3.375 -7.922 3.375 -4.953 QT
3.375 -3.672 3.969 -2.742 QT
4.563 -1.813 4.781 -1.813 QT
5.828 -1.813 6.727 -2.43 QT
7.625 -3.047 8.281 -4 QT
8.281 -4.5 8.445 -5.539 QT
8.609 -6.578 8.977 -7.391 QT
9.344 -8.203 9.844 -8.203 QT
11.484 -8.203 11.484 -7.453 QT
11.484 -7.016 11.305 -6.352 QT
11.125 -5.688 10.898 -5.117 QT
10.672 -4.547 10.344 -3.813 QT
10.672 -1.813 11.344 -1.813 QT
12.313 -1.813 13.289 -2.375 QT
14.266 -2.938 15.016 -3.852 QT
15.766 -4.766 16.195 -5.813 QT
16.625 -6.859 16.625 -7.813 QT
16.625 -8.656 16.359 -9.125 QT
16.094 -9.594 15.656 -10.117 QT
15.219 -10.641 15.219 -10.953 QT
15.219 -11.5 15.688 -11.953 QT
16.156 -12.406 16.688 -12.406 QT
18.359 -12.406 18.648 -11.781 QT
18.938 -11.156 18.938 -10.359 QT
18.938 -9.078 18.43 -7.125 QT
17.922 -5.172 17.266 -3.875 QT
16.359 -2.109 15 -0.898 QT
13.641 0.313 10.938 0.313 QT
9.859 0.313 9.195 -0.336 QT
8.531 -0.984 8.531 -0.984 QT
8.531 -0.984 7.547 -0.336 QT
6.563 0.313 4.391 0.313 QT
cp}def
f876989070
f
GR
GS
[0.6 0 0 0.6 657.60003 194.4] CT
0.149 GC
/Helvetica-Bold 27.5 F
GS
[1 0 0 1 0 0] CT
0 0 moveto 
1 -1 scale
( [rad/s]) t 
GR
GR
GS
[0.6 0 0 0.6 0 0] CT
0.149 GC
2 setlinecap
1 LJ
0.833 LW
N
876 254 M
876 82 L
S
GR
GS
[0.6 0 0 0.6 0 0] CT
0.149 GC
2 setlinecap
1 LJ
0.833 LW
N
1390 254 M
1390 82 L
S
GR
GS
[0.6 0 0 0.6 0 0] CT
0.149 GC
2 setlinecap
1 LJ
0.833 LW
N
876 249.989 M
881.14 249.989 L
S
GR
GS
[0.6 0 0 0.6 0 0] CT
0.149 GC
2 setlinecap
1 LJ
0.833 LW
N
876 216.803 M
881.14 216.803 L
S
GR
GS
[0.6 0 0 0.6 0 0] CT
0.149 GC
2 setlinecap
1 LJ
0.833 LW
N
876 183.617 M
881.14 183.617 L
S
GR
GS
[0.6 0 0 0.6 0 0] CT
0.149 GC
2 setlinecap
1 LJ
0.833 LW
N
876 150.432 M
881.14 150.432 L
S
GR
GS
[0.6 0 0 0.6 0 0] CT
0.149 GC
2 setlinecap
1 LJ
0.833 LW
N
876 117.246 M
881.14 117.246 L
S
GR
GS
[0.6 0 0 0.6 0 0] CT
0.149 GC
2 setlinecap
1 LJ
0.833 LW
N
876 84.06 M
881.14 84.06 L
S
GR
GS
[0.6 0 0 0.6 0 0] CT
0.149 GC
2 setlinecap
1 LJ
0.833 LW
N
1390 249.989 M
1384.86 249.989 L
S
GR
GS
[0.6 0 0 0.6 0 0] CT
0.149 GC
2 setlinecap
1 LJ
0.833 LW
N
1390 216.803 M
1384.86 216.803 L
S
GR
GS
[0.6 0 0 0.6 0 0] CT
0.149 GC
2 setlinecap
1 LJ
0.833 LW
N
1390 183.617 M
1384.86 183.617 L
S
GR
GS
[0.6 0 0 0.6 0 0] CT
0.149 GC
2 setlinecap
1 LJ
0.833 LW
N
1390 150.432 M
1384.86 150.432 L
S
GR
GS
[0.6 0 0 0.6 0 0] CT
0.149 GC
2 setlinecap
1 LJ
0.833 LW
N
1390 117.246 M
1384.86 117.246 L
S
GR
GS
[0.6 0 0 0.6 0 0] CT
0.149 GC
2 setlinecap
1 LJ
0.833 LW
N
1390 84.06 M
1384.86 84.06 L
S
GR
GS
[0.6 0 0 0.6 520.60003 149.99312] CT
0.149 GC
/Helvetica-Bold 25 F
GS
[1 0 0 1 0 0] CT
-35 10 moveto 
1 -1 scale
(0.6) t 
GR
GR
GS
[0.6 0 0 0.6 520.60003 130.08176] CT
0.149 GC
/Helvetica-Bold 25 F
GS
[1 0 0 1 0 0] CT
-35 10 moveto 
1 -1 scale
(0.8) t 
GR
GR
GS
[0.6 0 0 0.6 520.60003 110.17039] CT
0.149 GC
/Helvetica-Bold 25 F
GS
[1 0 0 1 0 0] CT
-14 10 moveto 
1 -1 scale
(1) t 
GR
GR
GS
[0.6 0 0 0.6 520.60003 90.25903] CT
0.149 GC
/Helvetica-Bold 25 F
GS
[1 0 0 1 0 0] CT
-35 10 moveto 
1 -1 scale
(1.2) t 
GR
GR
GS
[0.6 0 0 0.6 520.60003 70.34766] CT
0.149 GC
/Helvetica-Bold 25 F
GS
[1 0 0 1 0 0] CT
-35 10 moveto 
1 -1 scale
(1.4) t 
GR
GR
GS
[0.6 0 0 0.6 520.60003 50.4363] CT
0.149 GC
/Helvetica-Bold 25 F
GS
[1 0 0 1 0 0] CT
-35 10 moveto 
1 -1 scale
(1.6) t 
GR
GR
GS
[0 -0.6 0.6 0 486.00002 113.4] CT
0.149 GC
/Helvetica-Bold 27.5 F
GS
[1 0 0 1 0 0] CT
0 0 moveto 
1 -1 scale
(a) t 
GR
GR
GS
[0 -0.6 0.6 0 493.80002 103.8] CT
0.149 GC
/Helvetica-Bold 22 F
GS
[1 0 0 1 0 0] CT
0 0 moveto 
1 -1 scale
(22) t 
GR
GR
GS
[0.6 0 0 0.6 525.60002 45.6] CT
0.149 GC
N
/f1086612530{3.672 -0.719 M
3.672 -0.922 3.797 -1.078 QT
9 -6.25 L
3.797 -11.453 L
3.672 -11.578 3.672 -11.781 QT
3.672 -11.969 3.82 -12.125 QT
3.969 -12.281 4.172 -12.281 QT
5.344 -12.281 5.547 -12.125 QT
10.219 -7.453 L
14.875 -12.125 L
15.094 -12.281 15.25 -12.281 QT
16.453 -12.281 16.602 -12.133 QT
16.75 -11.984 16.75 -11.781 QT
16.75 -11.578 16.625 -11.453 QT
11.422 -6.25 L
16.625 -1.078 L
16.75 -0.922 16.75 -0.719 QT
16.75 -0.516 16.602 -0.367 QT
16.453 -0.219 15.25 -0.219 QT
15.063 -0.219 14.875 -0.406 QT
10.219 -5.047 L
5.547 -0.406 L
5.375 -0.219 4.172 -0.219 QT
3.969 -0.219 3.82 -0.375 QT
3.672 -0.531 3.672 -0.719 QT
cp}def
f1086612530
f
GR
GS
[0.6 0 0 0.6 538.20002 45.6] CT
0.149 GC
/Helvetica-Bold 25 F
GS
[1 0 0 1 0 0] CT
0 0 moveto 
1 -1 scale
(10) t 
GR
GR
GS
[0.6 0 0 0.6 555.00002 38.4] CT
0.149 GC
/Helvetica-Bold 20 F
GS
[1 0 0 1 0 0] CT
0 0 moveto 
1 -1 scale
(6) t 
GR
GR
GS
[0.6 0 0 0.6 0 0] CT
0 0 1 RC
1 LJ
3.333 LW
N
881.14 136.42 M
886.28 135.704 L
891.42 134.445 L
896.56 132.539 L
901.7 129.842 L
906.84 126.192 L
911.98 121.447 L
917.12 115.541 L
922.26 108.558 L
927.4 100.827 L
932.54 93.027 L
937.68 86.276 L
942.82 82.13 L
947.96 82.391 L
953.1 88.635 L
958.24 101.54 L
963.38 120.362 L
968.52 142.991 L
973.66 166.656 L
978.8 188.844 L
983.94 207.917 L
989.08 223.187 L
994.22 234.688 L
999.36 242.867 L
1004.5 248.317 L
1009.64 251.638 L
1014.78 253.356 L
1019.92 253.905 L
1025.06 253.623 L
1030.2 252.769 L
1035.34 251.536 L
1040.48 250.065 L
1045.62 248.458 L
1050.76 246.788 L
1055.9 245.105 L
1061.04 243.445 L
1066.18 241.83 L
1071.32 240.276 L
1076.46 238.792 L
1081.6 237.38 L
1086.74 236.045 L
1091.88 234.786 L
1097.02 233.601 L
1102.16 232.489 L
1107.3 231.446 L
1112.44 230.469 L
1117.58 229.556 L
1122.72 228.703 L
1127.86 227.908 L
1133 227.167 L
1138.14 226.478 L
1143.28 225.839 L
1148.42 225.247 L
1153.56 224.7 L
1158.7 224.196 L
1163.84 223.728 L
1168.98 223.288 L
1174.12 222.854 L
1179.26 222.372 L
1184.4 221.717 L
1189.54 220.599 L
1194.68 218.597 L
1199.82 216.064 L
1204.96 214.706 L
1210.1 214.631 L
1215.24 214.85 L
1220.38 215.054 L
1225.52 215.214 L
1230.66 210.974 L
1235.8 214.133 L
1240.94 214.531 L
1246.08 214.631 L
1251.22 214.636 L
1256.36 214.591 L
1261.5 213.234 L
1266.64 213.436 L
1271.78 213.785 L
1276.92 213.769 L
1282.06 213.504 L
1287.2 213.026 L
1292.34 212.392 L
1297.48 212.891 L
1302.62 212.846 L
1307.76 212.687 L
1312.9 212.32 L
1318.04 211.914 L
1323.18 211.922 L
1328.32 211.862 L
1333.46 211.669 L
1338.6 211.45 L
1343.74 211.283 L
1348.88 211.172 L
1354.02 211.071 L
1359.16 210.963 L
1364.3 210.854 L
1369.44 210.76 L
1374.58 210.517 L
1379.72 210.524 L
1384.86 210.514 L
1390 210.492 L
S
GR
GS
[0.6 0 0 0.6 0 0] CT
1 0 0 RC
[12 12] 0 setdash
2 LJ
3.333 LW
N
881.14 136.364 M
886.28 135.659 L
891.42 134.42 L
896.56 132.543 L
901.7 129.886 L
906.84 126.29 L
911.98 121.619 L
917.12 115.811 L
922.26 108.963 L
927.4 101.418 L
932.54 93.862 L
937.68 87.409 L
942.82 83.584 L
947.96 84.112 L
953.1 90.443 L
958.24 103.112 L
963.38 121.296 L
968.52 142.93 L
973.66 165.404 L
978.8 186.418 L
983.94 204.489 L
989.08 219.01 L
994.22 230.03 L
999.36 237.957 L
1004.5 243.338 L
1009.64 246.72 L
1014.78 248.593 L
1019.92 249.349 L
1025.06 249.301 L
1030.2 248.695 L
1035.34 247.708 L
1040.48 246.464 L
1045.62 245.063 L
1050.76 243.579 L
1055.9 242.059 L
1061.04 240.537 L
1066.18 239.041 L
1071.32 237.594 L
1076.46 236.207 L
1081.6 234.891 L
1086.74 233.646 L
1091.88 232.475 L
1097.02 231.375 L
1102.16 230.342 L
1107.3 229.368 L
1112.44 228.444 L
1117.58 227.565 L
1122.72 226.725 L
1127.86 225.924 L
1133 225.158 L
1138.14 224.43 L
1143.28 223.741 L
1148.42 223.094 L
1153.56 222.49 L
1158.7 221.927 L
1163.84 221.404 L
1168.98 220.913 L
1174.12 220.447 L
1179.26 220.001 L
1184.4 219.571 L
1189.54 219.155 L
1194.68 218.752 L
1199.82 218.366 L
1204.96 218.001 L
1210.1 217.658 L
1215.24 217.34 L
1220.38 217.043 L
1225.52 216.761 L
1230.66 216.49 L
1235.8 216.226 L
1240.94 215.967 L
1246.08 215.713 L
1251.22 215.468 L
1256.36 215.237 L
1261.5 215.022 L
1266.64 214.82 L
1271.78 214.628 L
1276.92 214.443 L
1282.06 214.259 L
1287.2 214.073 L
1292.34 213.885 L
1297.48 213.698 L
1302.62 213.509 L
1307.76 213.302 L
1312.9 213.047 L
1318.04 212.669 L
1323.18 212.659 L
1328.32 212.412 L
1333.46 212.183 L
1338.6 212.133 L
1343.74 211.986 L
1348.88 211.923 L
1354.02 211.868 L
1359.16 211.829 L
1364.3 211.58 L
1369.44 211.416 L
1374.58 211.366 L
1379.72 211.291 L
1384.86 211.107 L
1390 211.091 L
S
GR
GS
[0.6 0 0 0.6 0 0] CT
0 1 0 RC
[12 3 6 3] 0 setdash
2 LJ
3.333 LW
N
881.14 136.328 M
886.28 135.612 L
891.42 134.352 L
896.56 132.444 L
901.7 129.745 L
906.84 126.092 L
911.98 121.342 L
917.12 115.429 L
922.26 108.438 L
927.4 100.703 L
932.54 92.9 L
937.68 86.148 L
942.82 82 L
947.96 82.256 L
953.1 88.489 L
958.24 101.374 L
963.38 120.167 L
968.52 142.765 L
973.66 166.4 L
978.8 188.577 L
983.94 207.653 L
989.08 222.943 L
994.22 234.481 L
999.36 242.707 L
1004.5 248.213 L
1009.64 251.595 L
1014.78 253.382 L
1019.92 254 L
1025.06 253.788 L
1030.2 253.008 L
1035.34 251.846 L
1040.48 250.44 L
1045.62 248.9 L
1050.76 247.305 L
1055.9 245.71 L
1061.04 244.169 L
1066.18 242.755 L
1071.32 241.613 L
1076.46 241.299 L
1081.6 216.662 L
1086.74 233.416 L
1091.88 233.479 L
1097.02 232.758 L
1102.16 231.894 L
1107.3 231.012 L
1112.44 230.149 L
1117.58 229.316 L
1122.72 228.535 L
1127.86 227.804 L
1133 227.133 L
1138.14 226.525 L
1143.28 226.059 L
1148.42 225.404 L
1153.56 217.085 L
1158.7 220.037 L
1163.84 221.236 L
1168.98 221.336 L
1174.12 221.172 L
1179.26 220.907 L
1184.4 220.606 L
1189.54 220.312 L
1194.68 220.007 L
1199.82 219.599 L
1204.96 218.562 L
1210.1 214.52 L
1215.24 215.436 L
1220.38 216.596 L
1225.52 216.91 L
1230.66 216.938 L
1235.8 216.847 L
1240.94 216.677 L
1246.08 216.389 L
1251.22 215.699 L
1256.36 213.733 L
1261.5 212.88 L
1266.64 213.95 L
1271.78 214.474 L
1276.92 214.631 L
1282.06 214.608 L
1287.2 214.428 L
1292.34 213.956 L
1297.48 212.814 L
1302.62 211.773 L
1307.76 212.334 L
1312.9 212.902 L
1318.04 213.126 L
1323.18 213.121 L
1328.32 212.892 L
1333.46 212.291 L
1338.6 211.346 L
1343.74 211.197 L
1348.88 211.696 L
1354.02 212.017 L
1359.16 212.08 L
1364.3 211.899 L
1369.44 211.407 L
1374.58 210.752 L
1379.72 210.677 L
1384.86 211.033 L
1390 211.265 L
S
GR
GS
[0.6 0 0 0.6 0 0] CT
1 GC
N
200 542 M
714 542 L
714 370 L
200 370 L
cp
f
GR
GS
[0.6 0 0 0.6 0 0] CT
0.149 GC
2 setlinecap
1 LJ
0.833 LW
N
200 542 M
714 542 L
S
GR
GS
[0.6 0 0 0.6 0 0] CT
0.149 GC
2 setlinecap
1 LJ
0.833 LW
N
200 370 M
714 370 L
S
GR
GS
[0.6 0 0 0.6 0 0] CT
0.149 GC
2 setlinecap
1 LJ
0.833 LW
N
200 542 M
200 536.86 L
S
GR
GS
[0.6 0 0 0.6 0 0] CT
0.149 GC
2 setlinecap
1 LJ
0.833 LW
N
281.847 542 M
281.847 536.86 L
S
GR
GS
[0.6 0 0 0.6 0 0] CT
0.149 GC
2 setlinecap
1 LJ
0.833 LW
N
363.694 542 M
363.694 536.86 L
S
GR
GS
[0.6 0 0 0.6 0 0] CT
0.149 GC
2 setlinecap
1 LJ
0.833 LW
N
445.541 542 M
445.541 536.86 L
S
GR
GS
[0.6 0 0 0.6 0 0] CT
0.149 GC
2 setlinecap
1 LJ
0.833 LW
N
527.389 542 M
527.389 536.86 L
S
GR
GS
[0.6 0 0 0.6 0 0] CT
0.149 GC
2 setlinecap
1 LJ
0.833 LW
N
609.236 542 M
609.236 536.86 L
S
GR
GS
[0.6 0 0 0.6 0 0] CT
0.149 GC
2 setlinecap
1 LJ
0.833 LW
N
691.083 542 M
691.083 536.86 L
S
GR
GS
[0.6 0 0 0.6 0 0] CT
0.149 GC
2 setlinecap
1 LJ
0.833 LW
N
200 370 M
200 375.14 L
S
GR
GS
[0.6 0 0 0.6 0 0] CT
0.149 GC
2 setlinecap
1 LJ
0.833 LW
N
281.847 370 M
281.847 375.14 L
S
GR
GS
[0.6 0 0 0.6 0 0] CT
0.149 GC
2 setlinecap
1 LJ
0.833 LW
N
363.694 370 M
363.694 375.14 L
S
GR
GS
[0.6 0 0 0.6 0 0] CT
0.149 GC
2 setlinecap
1 LJ
0.833 LW
N
445.541 370 M
445.541 375.14 L
S
GR
GS
[0.6 0 0 0.6 0 0] CT
0.149 GC
2 setlinecap
1 LJ
0.833 LW
N
527.389 370 M
527.389 375.14 L
S
GR
GS
[0.6 0 0 0.6 0 0] CT
0.149 GC
2 setlinecap
1 LJ
0.833 LW
N
609.236 370 M
609.236 375.14 L
S
GR
GS
[0.6 0 0 0.6 0 0] CT
0.149 GC
2 setlinecap
1 LJ
0.833 LW
N
691.083 370 M
691.083 375.14 L
S
GR
GS
[0.6 0 0 0.6 120 330.20002] CT
0.149 GC
/Helvetica-Bold 25 F
GS
[1 0 0 1 0 0] CT
-7 26 moveto 
1 -1 scale
(0) t 
GR
GR
GS
[0.6 0 0 0.6 169.10829 330.20002] CT
0.149 GC
/Helvetica-Bold 25 F
GS
[1 0 0 1 0 0] CT
-7 26 moveto 
1 -1 scale
(1) t 
GR
GR
GS
[0.6 0 0 0.6 218.21657 330.20002] CT
0.149 GC
/Helvetica-Bold 25 F
GS
[1 0 0 1 0 0] CT
-7 26 moveto 
1 -1 scale
(2) t 
GR
GR
GS
[0.6 0 0 0.6 267.32486 330.20002] CT
0.149 GC
/Helvetica-Bold 25 F
GS
[1 0 0 1 0 0] CT
-7 26 moveto 
1 -1 scale
(3) t 
GR
GR
GS
[0.6 0 0 0.6 316.43314 330.20002] CT
0.149 GC
/Helvetica-Bold 25 F
GS
[1 0 0 1 0 0] CT
-7 26 moveto 
1 -1 scale
(4) t 
GR
GR
GS
[0.6 0 0 0.6 365.54141 330.20002] CT
0.149 GC
/Helvetica-Bold 25 F
GS
[1 0 0 1 0 0] CT
-7 26 moveto 
1 -1 scale
(5) t 
GR
GR
GS
[0.6 0 0 0.6 414.64971 330.20002] CT
0.149 GC
/Helvetica-Bold 25 F
GS
[1 0 0 1 0 0] CT
-7 26 moveto 
1 -1 scale
(6) t 
GR
GR
GS
[0.6 0 0 0.6 240.60001 367.2] CT
0.149 GC
N
f876989070
f
GR
GS
[0.6 0 0 0.6 252.00001 367.2] CT
0.149 GC
/Helvetica-Bold 27.5 F
GS
[1 0 0 1 0 0] CT
0 0 moveto 
1 -1 scale
( [rad/s]) t 
GR
GR
GS
[0.6 0 0 0.6 0 0] CT
0.149 GC
2 setlinecap
1 LJ
0.833 LW
N
200 542 M
200 370 L
S
GR
GS
[0.6 0 0 0.6 0 0] CT
0.149 GC
2 setlinecap
1 LJ
0.833 LW
N
714 542 M
714 370 L
S
GR
GS
[0.6 0 0 0.6 0 0] CT
0.149 GC
2 setlinecap
1 LJ
0.833 LW
N
200 542 M
205.14 542 L
S
GR
GS
[0.6 0 0 0.6 0 0] CT
0.149 GC
2 setlinecap
1 LJ
0.833 LW
N
200 456 M
205.14 456 L
S
GR
GS
[0.6 0 0 0.6 0 0] CT
0.149 GC
2 setlinecap
1 LJ
0.833 LW
N
200 370 M
205.14 370 L
S
GR
GS
[0.6 0 0 0.6 0 0] CT
0.149 GC
2 setlinecap
1 LJ
0.833 LW
N
714 542 M
708.86 542 L
S
GR
GS
[0.6 0 0 0.6 0 0] CT
0.149 GC
2 setlinecap
1 LJ
0.833 LW
N
714 456 M
708.86 456 L
S
GR
GS
[0.6 0 0 0.6 0 0] CT
0.149 GC
2 setlinecap
1 LJ
0.833 LW
N
714 370 M
708.86 370 L
S
GR
GS
[0.6 0 0 0.6 115.00001 325.2] CT
0.149 GC
/Helvetica-Bold 25 F
GS
[1 0 0 1 0 0] CT
-14 10 moveto 
1 -1 scale
(4) t 
GR
GR
GS
[0.6 0 0 0.6 115.00001 273.6] CT
0.149 GC
/Helvetica-Bold 25 F
GS
[1 0 0 1 0 0] CT
-35 10 moveto 
1 -1 scale
(4.5) t 
GR
GR
GS
[0.6 0 0 0.6 115.00001 222] CT
0.149 GC
/Helvetica-Bold 25 F
GS
[1 0 0 1 0 0] CT
-14 10 moveto 
1 -1 scale
(5) t 
GR
GR
GS
[0 -0.6 0.6 0 80.4 286.2] CT
0.149 GC
/Helvetica-Bold 27.5 F
GS
[1 0 0 1 0 0] CT
0 0 moveto 
1 -1 scale
(a) t 
GR
GR
GS
[0 -0.6 0.6 0 88.2 276.6] CT
0.149 GC
/Helvetica-Bold 22 F
GS
[1 0 0 1 0 0] CT
0 0 moveto 
1 -1 scale
(33) t 
GR
GR
GS
[0.6 0 0 0.6 120 218.4] CT
0.149 GC
N
f1086612530
f
GR
GS
[0.6 0 0 0.6 132.60001 218.4] CT
0.149 GC
/Helvetica-Bold 25 F
GS
[1 0 0 1 0 0] CT
0 0 moveto 
1 -1 scale
(10) t 
GR
GR
GS
[0.6 0 0 0.6 149.40001 211.2] CT
0.149 GC
/Helvetica-Bold 20 F
GS
[1 0 0 1 0 0] CT
0 0 moveto 
1 -1 scale
(5) t 
GR
GR
GS
[0.6 0 0 0.6 0 0] CT
0 0 1 RC
1 LJ
3.333 LW
N
205.14 380.587 M
210.28 373.864 L
215.42 371.1 L
220.56 374.945 L
225.7 386.106 L
230.84 403.686 L
235.98 425.653 L
241.12 449.422 L
246.26 472.427 L
251.4 492.565 L
256.54 508.463 L
261.68 519.549 L
266.82 525.969 L
271.96 528.387 L
277.1 527.749 L
282.24 525.055 L
287.38 521.204 L
292.52 516.897 L
297.66 512.623 L
302.8 508.671 L
307.94 505.183 L
313.08 502.195 L
318.22 499.681 L
323.36 497.588 L
328.5 495.85 L
333.64 494.402 L
338.78 493.189 L
343.92 492.163 L
349.06 491.288 L
354.2 490.532 L
359.34 489.875 L
364.48 489.298 L
369.62 488.788 L
374.76 488.333 L
379.9 487.925 L
385.04 487.558 L
390.18 487.246 L
395.32 486.94 L
400.46 486.662 L
405.6 486.408 L
410.74 486.176 L
415.88 485.963 L
421.02 485.766 L
426.16 485.585 L
431.3 485.417 L
436.44 485.261 L
441.58 485.117 L
446.72 484.982 L
451.86 484.857 L
457 484.741 L
462.14 484.632 L
467.28 484.53 L
472.42 484.436 L
477.56 484.35 L
482.7 484.271 L
487.84 484.199 L
492.98 484.135 L
498.12 484.082 L
503.26 484.039 L
508.4 484.002 L
513.54 483.913 L
518.68 483.614 L
523.82 483.38 L
528.96 483.301 L
534.1 483.304 L
539.24 483.519 L
544.38 483.463 L
549.52 483.402 L
554.66 483.35 L
559.8 483.302 L
564.94 483.254 L
570.08 483.178 L
575.22 483.233 L
580.36 483.178 L
585.5 483.139 L
590.64 483.102 L
595.78 483.071 L
600.92 483.05 L
606.06 483.029 L
611.2 482.997 L
616.34 482.971 L
621.48 482.946 L
626.62 482.923 L
631.76 482.902 L
636.9 482.879 L
642.04 482.857 L
647.18 482.836 L
652.32 482.817 L
657.46 482.799 L
662.6 482.781 L
667.74 482.763 L
672.88 482.746 L
678.02 482.73 L
683.16 482.714 L
688.3 482.699 L
693.44 482.684 L
698.58 482.669 L
703.72 482.654 L
708.86 482.641 L
714 482.628 L
S
GR
GS
[0.6 0 0 0.6 0 0] CT
1 0 0 RC
[12 12] 0 setdash
2 LJ
3.333 LW
N
205.14 380.764 M
210.28 374.044 L
215.42 371.468 L
220.56 375.169 L
225.7 386.361 L
230.84 404.113 L
235.98 425.893 L
241.12 449.612 L
246.26 472.553 L
251.4 492.556 L
256.54 508.372 L
261.68 519.517 L
266.82 525.799 L
271.96 528.155 L
277.1 527.84 L
282.24 524.995 L
287.38 521.434 L
292.52 517.092 L
297.66 513.078 L
302.8 509.089 L
307.94 505.769 L
313.08 502.768 L
318.22 500.295 L
323.36 498.195 L
328.5 496.45 L
333.64 494.979 L
338.78 493.743 L
343.92 492.635 L
349.06 491.715 L
354.2 491.037 L
359.34 490.261 L
364.48 489.59 L
369.62 489.138 L
374.76 488.74 L
379.9 488.223 L
385.04 487.8 L
390.18 487.536 L
395.32 487.304 L
400.46 486.939 L
405.6 486.629 L
410.74 486.41 L
415.88 486.312 L
421.02 486.069 L
426.16 485.825 L
431.3 485.628 L
436.44 485.506 L
441.58 485.48 L
446.72 485.34 L
451.86 485.15 L
457 484.987 L
462.14 484.867 L
467.28 484.802 L
472.42 484.804 L
477.56 484.656 L
482.7 484.517 L
487.84 484.399 L
492.98 484.314 L
498.12 484.273 L
503.26 484.284 L
508.4 484.248 L
513.54 484.131 L
518.68 484.029 L
523.82 483.942 L
528.96 483.882 L
534.1 483.855 L
539.24 483.867 L
544.38 483.875 L
549.52 483.783 L
554.66 483.695 L
559.8 483.62 L
564.94 483.56 L
570.08 483.523 L
575.22 483.514 L
580.36 483.537 L
585.5 483.574 L
590.64 483.501 L
595.78 483.426 L
600.92 483.362 L
606.06 483.308 L
611.2 483.269 L
616.34 483.249 L
621.48 483.251 L
626.62 483.278 L
631.76 483.332 L
636.9 483.273 L
642.04 483.21 L
647.18 483.156 L
652.32 483.108 L
657.46 483.071 L
662.6 483.045 L
667.74 483.037 L
672.88 483.044 L
678.02 483.074 L
683.16 483.122 L
688.3 483.1 L
693.44 483.049 L
698.58 483 L
703.72 482.957 L
708.86 482.92 L
714 482.891 L
S
GR
GS
[0.6 0 0 0.6 0 0] CT
0 1 0 RC
[12 3 6 3] 0 setdash
2 LJ
3.333 LW
N
205.14 380.765 M
210.28 374.038 L
215.42 371.449 L
220.56 375.134 L
225.7 386.315 L
230.84 404.071 L
235.98 425.879 L
241.12 449.658 L
246.26 472.685 L
251.4 492.786 L
256.54 508.695 L
261.68 519.905 L
266.82 526.212 L
271.96 528.548 L
277.1 528.173 L
282.24 525.243 L
287.38 521.585 L
292.52 517.152 L
297.66 513.054 L
302.8 509.006 L
307.94 505.641 L
313.08 502.617 L
318.22 500.132 L
323.36 498.03 L
328.5 496.291 L
333.64 494.83 L
338.78 493.607 L
343.92 492.513 L
349.06 491.608 L
354.2 490.951 L
359.34 490.232 L
364.48 489.368 L
369.62 489.015 L
374.76 488.638 L
379.9 488.131 L
385.04 487.717 L
390.18 487.461 L
395.32 487.237 L
400.46 486.876 L
405.6 486.567 L
410.74 486.351 L
415.88 486.261 L
421.02 486.02 L
426.16 485.775 L
431.3 485.578 L
436.44 485.46 L
441.58 485.443 L
446.72 485.321 L
451.86 485.113 L
457 484.95 L
462.14 484.831 L
467.28 484.769 L
472.42 484.778 L
477.56 484.628 L
482.7 484.485 L
487.84 484.364 L
492.98 484.278 L
498.12 484.237 L
503.26 484.252 L
508.4 484.224 L
513.54 484.096 L
518.68 483.989 L
523.82 483.901 L
528.96 483.842 L
534.1 483.818 L
539.24 483.837 L
544.38 483.851 L
549.52 483.758 L
554.66 483.672 L
559.8 483.6 L
564.94 483.536 L
570.08 483.499 L
575.22 483.491 L
580.36 483.517 L
585.5 483.557 L
590.64 483.483 L
595.78 483.408 L
600.92 483.345 L
606.06 483.293 L
611.2 483.251 L
616.34 483.232 L
621.48 483.235 L
626.62 483.266 L
631.76 483.323 L
636.9 483.264 L
642.04 483.202 L
647.18 483.147 L
652.32 483.097 L
657.46 483.057 L
662.6 483.032 L
667.74 483.024 L
672.88 483.034 L
678.02 483.066 L
683.16 483.118 L
688.3 483.095 L
693.44 483.042 L
698.58 482.992 L
703.72 482.949 L
708.86 482.913 L
714 482.885 L
S
GR
GS
[0.6 0 0 0.6 0 0] CT
1 GC
N
876 542 M
1390 542 L
1390 370 L
876 370 L
cp
f
GR
GS
[0.6 0 0 0.6 0 0] CT
0.149 GC
2 setlinecap
1 LJ
0.833 LW
N
876 542 M
1390 542 L
S
GR
GS
[0.6 0 0 0.6 0 0] CT
0.149 GC
2 setlinecap
1 LJ
0.833 LW
N
876 370 M
1390 370 L
S
GR
GS
[0.6 0 0 0.6 0 0] CT
0.149 GC
2 setlinecap
1 LJ
0.833 LW
N
876 542 M
876 536.86 L
S
GR
GS
[0.6 0 0 0.6 0 0] CT
0.149 GC
2 setlinecap
1 LJ
0.833 LW
N
957.847 542 M
957.847 536.86 L
S
GR
GS
[0.6 0 0 0.6 0 0] CT
0.149 GC
2 setlinecap
1 LJ
0.833 LW
N
1039.694 542 M
1039.694 536.86 L
S
GR
GS
[0.6 0 0 0.6 0 0] CT
0.149 GC
2 setlinecap
1 LJ
0.833 LW
N
1121.541 542 M
1121.541 536.86 L
S
GR
GS
[0.6 0 0 0.6 0 0] CT
0.149 GC
2 setlinecap
1 LJ
0.833 LW
N
1203.389 542 M
1203.389 536.86 L
S
GR
GS
[0.6 0 0 0.6 0 0] CT
0.149 GC
2 setlinecap
1 LJ
0.833 LW
N
1285.236 542 M
1285.236 536.86 L
S
GR
GS
[0.6 0 0 0.6 0 0] CT
0.149 GC
2 setlinecap
1 LJ
0.833 LW
N
1367.083 542 M
1367.083 536.86 L
S
GR
GS
[0.6 0 0 0.6 0 0] CT
0.149 GC
2 setlinecap
1 LJ
0.833 LW
N
876 370 M
876 375.14 L
S
GR
GS
[0.6 0 0 0.6 0 0] CT
0.149 GC
2 setlinecap
1 LJ
0.833 LW
N
957.847 370 M
957.847 375.14 L
S
GR
GS
[0.6 0 0 0.6 0 0] CT
0.149 GC
2 setlinecap
1 LJ
0.833 LW
N
1039.694 370 M
1039.694 375.14 L
S
GR
GS
[0.6 0 0 0.6 0 0] CT
0.149 GC
2 setlinecap
1 LJ
0.833 LW
N
1121.541 370 M
1121.541 375.14 L
S
GR
GS
[0.6 0 0 0.6 0 0] CT
0.149 GC
2 setlinecap
1 LJ
0.833 LW
N
1203.389 370 M
1203.389 375.14 L
S
GR
GS
[0.6 0 0 0.6 0 0] CT
0.149 GC
2 setlinecap
1 LJ
0.833 LW
N
1285.236 370 M
1285.236 375.14 L
S
GR
GS
[0.6 0 0 0.6 0 0] CT
0.149 GC
2 setlinecap
1 LJ
0.833 LW
N
1367.083 370 M
1367.083 375.14 L
S
GR
GS
[0.6 0 0 0.6 525.60002 330.19999] CT
0.149 GC
/Helvetica-Bold 25 F
GS
[1 0 0 1 0 0] CT
-7 26 moveto 
1 -1 scale
(0) t 
GR
GR
GS
[0.6 0 0 0.6 574.70829 330.19999] CT
0.149 GC
/Helvetica-Bold 25 F
GS
[1 0 0 1 0 0] CT
-7 26 moveto 
1 -1 scale
(1) t 
GR
GR
GS
[0.6 0 0 0.6 623.81655 330.19999] CT
0.149 GC
/Helvetica-Bold 25 F
GS
[1 0 0 1 0 0] CT
-7 26 moveto 
1 -1 scale
(2) t 
GR
GR
GS
[0.6 0 0 0.6 672.92486 330.19999] CT
0.149 GC
/Helvetica-Bold 25 F
GS
[1 0 0 1 0 0] CT
-7 26 moveto 
1 -1 scale
(3) t 
GR
GR
GS
[0.6 0 0 0.6 722.03316 330.19999] CT
0.149 GC
/Helvetica-Bold 25 F
GS
[1 0 0 1 0 0] CT
-7 26 moveto 
1 -1 scale
(4) t 
GR
GR
GS
[0.6 0 0 0.6 771.14146 330.19999] CT
0.149 GC
/Helvetica-Bold 25 F
GS
[1 0 0 1 0 0] CT
-7 26 moveto 
1 -1 scale
(5) t 
GR
GR
GS
[0.6 0 0 0.6 820.24969 330.19999] CT
0.149 GC
/Helvetica-Bold 25 F
GS
[1 0 0 1 0 0] CT
-7 26 moveto 
1 -1 scale
(6) t 
GR
GR
GS
[0.6 0 0 0.6 646.20003 367.2] CT
0.149 GC
N
f876989070
f
GR
GS
[0.6 0 0 0.6 657.60003 367.2] CT
0.149 GC
/Helvetica-Bold 27.5 F
GS
[1 0 0 1 0 0] CT
0 0 moveto 
1 -1 scale
( [rad/s]) t 
GR
GR
GS
[0.6 0 0 0.6 0 0] CT
0.149 GC
2 setlinecap
1 LJ
0.833 LW
N
876 542 M
876 370 L
S
GR
GS
[0.6 0 0 0.6 0 0] CT
0.149 GC
2 setlinecap
1 LJ
0.833 LW
N
1390 542 M
1390 370 L
S
GR
GS
[0.6 0 0 0.6 0 0] CT
0.149 GC
2 setlinecap
1 LJ
0.833 LW
N
876 542 M
881.14 542 L
S
GR
GS
[0.6 0 0 0.6 0 0] CT
0.149 GC
2 setlinecap
1 LJ
0.833 LW
N
876 482.534 M
881.14 482.534 L
S
GR
GS
[0.6 0 0 0.6 0 0] CT
0.149 GC
2 setlinecap
1 LJ
0.833 LW
N
876 423.067 M
881.14 423.067 L
S
GR
GS
[0.6 0 0 0.6 0 0] CT
0.149 GC
2 setlinecap
1 LJ
0.833 LW
N
1390 542 M
1384.86 542 L
S
GR
GS
[0.6 0 0 0.6 0 0] CT
0.149 GC
2 setlinecap
1 LJ
0.833 LW
N
1390 482.534 M
1384.86 482.534 L
S
GR
GS
[0.6 0 0 0.6 0 0] CT
0.149 GC
2 setlinecap
1 LJ
0.833 LW
N
1390 423.067 M
1384.86 423.067 L
S
GR
GS
[0.6 0 0 0.6 520.60003 325.2] CT
0.149 GC
/Helvetica-Bold 25 F
GS
[1 0 0 1 0 0] CT
-14 10 moveto 
1 -1 scale
(4) t 
GR
GR
GS
[0.6 0 0 0.6 520.60003 289.52016] CT
0.149 GC
/Helvetica-Bold 25 F
GS
[1 0 0 1 0 0] CT
-14 10 moveto 
1 -1 scale
(5) t 
GR
GR
GS
[0.6 0 0 0.6 520.60003 253.84032] CT
0.149 GC
/Helvetica-Bold 25 F
GS
[1 0 0 1 0 0] CT
-14 10 moveto 
1 -1 scale
(6) t 
GR
GR
GS
[0 -0.6 0.6 0 498.60002 286.2] CT
0.149 GC
/Helvetica-Bold 27.5 F
GS
[1 0 0 1 0 0] CT
0 0 moveto 
1 -1 scale
(a) t 
GR
GR
GS
[0 -0.6 0.6 0 506.40002 276.6] CT
0.149 GC
/Helvetica-Bold 22 F
GS
[1 0 0 1 0 0] CT
0 0 moveto 
1 -1 scale
(44) t 
GR
GR
GS
[0.6 0 0 0.6 525.60002 218.4] CT
0.149 GC
N
f1086612530
f
GR
GS
[0.6 0 0 0.6 538.20002 218.4] CT
0.149 GC
/Helvetica-Bold 25 F
GS
[1 0 0 1 0 0] CT
0 0 moveto 
1 -1 scale
(10) t 
GR
GR
GS
[0.6 0 0 0.6 555.00002 211.2] CT
0.149 GC
/Helvetica-Bold 20 F
GS
[1 0 0 1 0 0] CT
0 0 moveto 
1 -1 scale
(7) t 
GR
GR
GS
[0.6 0 0 0.6 0 0] CT
0 0 1 RC
1 LJ
3.333 LW
N
881.14 410.926 M
886.28 410.272 L
891.42 409.109 L
896.56 407.318 L
901.7 404.75 L
906.84 401.256 L
911.98 396.751 L
917.12 391.285 L
922.26 385.13 L
927.4 378.867 L
932.54 373.453 L
937.68 370.22 L
942.82 370.748 L
947.96 376.516 L
953.1 388.333 L
958.24 405.765 L
963.38 426.935 L
968.52 449.013 L
973.66 469.188 L
978.8 485.527 L
983.94 497.284 L
989.08 504.669 L
994.22 508.426 L
999.36 509.467 L
1004.5 508.637 L
1009.64 506.626 L
1014.78 503.948 L
1019.92 500.963 L
1025.06 497.91 L
1030.2 494.936 L
1035.34 492.127 L
1040.48 489.527 L
1045.62 487.153 L
1050.76 485.001 L
1055.9 483.063 L
1061.04 481.323 L
1066.18 479.762 L
1071.32 478.361 L
1076.46 477.104 L
1081.6 475.974 L
1086.74 474.956 L
1091.88 474.037 L
1097.02 473.207 L
1102.16 472.455 L
1107.3 471.772 L
1112.44 471.15 L
1117.58 470.582 L
1122.72 470.064 L
1127.86 469.589 L
1133 469.154 L
1138.14 468.756 L
1143.28 468.39 L
1148.42 468.054 L
1153.56 467.747 L
1158.7 467.467 L
1163.84 467.212 L
1168.98 466.982 L
1174.12 466.775 L
1179.26 466.586 L
1184.4 466.397 L
1189.54 466.156 L
1194.68 465.744 L
1199.82 465.112 L
1204.96 464.566 L
1210.1 464.276 L
1215.24 464.083 L
1220.38 463.849 L
1225.52 463.354 L
1230.66 463.471 L
1235.8 464.289 L
1240.94 464.028 L
1246.08 463.851 L
1251.22 463.695 L
1256.36 463.489 L
1261.5 463.002 L
1266.64 463.613 L
1271.78 463.449 L
1276.92 463.315 L
1282.06 463.184 L
1287.2 463.099 L
1292.34 463.088 L
1297.48 463.042 L
1302.62 462.957 L
1307.76 462.876 L
1312.9 462.791 L
1318.04 462.723 L
1323.18 462.682 L
1328.32 462.626 L
1333.46 462.565 L
1338.6 462.508 L
1343.74 462.459 L
1348.88 462.415 L
1354.02 462.373 L
1359.16 462.333 L
1364.3 462.293 L
1369.44 462.256 L
1374.58 462.196 L
1379.72 462.169 L
1384.86 462.136 L
1390 462.097 L
S
GR
GS
[0.6 0 0 0.6 0 0] CT
1 0 0 RC
[12 12] 0 setdash
2 LJ
3.333 LW
N
881.14 410.777 M
886.28 410.128 L
891.42 408.97 L
896.56 407.191 L
901.7 404.636 L
906.84 401.163 L
911.98 396.686 L
917.12 391.26 L
922.26 385.165 L
927.4 378.996 L
932.54 373.701 L
937.68 370.608 L
942.82 371.266 L
947.96 377.063 L
953.1 388.746 L
958.24 405.789 L
963.38 426.317 L
968.52 447.631 L
973.66 467.064 L
978.8 482.865 L
983.94 494.344 L
989.08 501.686 L
994.22 505.625 L
999.36 506.956 L
1004.5 506.497 L
1009.64 504.882 L
1014.78 502.592 L
1019.92 499.964 L
1025.06 497.216 L
1030.2 494.516 L
1035.34 491.929 L
1040.48 489.476 L
1045.62 487.2 L
1050.76 485.127 L
1055.9 483.217 L
1061.04 481.471 L
1066.18 479.894 L
1071.32 478.487 L
1076.46 477.222 L
1081.6 476.091 L
1086.74 475.084 L
1091.88 474.184 L
1097.02 473.379 L
1102.16 472.648 L
1107.3 471.978 L
1112.44 471.359 L
1117.58 470.782 L
1122.72 470.243 L
1127.86 469.735 L
1133 469.259 L
1138.14 468.818 L
1143.28 468.41 L
1148.42 468.036 L
1153.56 467.694 L
1158.7 467.379 L
1163.84 467.09 L
1168.98 466.821 L
1174.12 466.567 L
1179.26 466.327 L
1184.4 466.098 L
1189.54 465.878 L
1194.68 465.669 L
1199.82 465.47 L
1204.96 465.284 L
1210.1 465.11 L
1215.24 464.948 L
1220.38 464.797 L
1225.52 464.653 L
1230.66 464.514 L
1235.8 464.381 L
1240.94 464.253 L
1246.08 464.13 L
1251.22 464.012 L
1256.36 463.9 L
1261.5 463.796 L
1266.64 463.696 L
1271.78 463.6 L
1276.92 463.508 L
1282.06 463.418 L
1287.2 463.331 L
1292.34 463.246 L
1297.48 463.164 L
1302.62 463.085 L
1307.76 463.008 L
1312.9 462.935 L
1318.04 462.862 L
1323.18 462.817 L
1328.32 462.754 L
1333.46 462.714 L
1338.6 462.653 L
1343.74 462.604 L
1348.88 462.555 L
1354.02 462.508 L
1359.16 462.457 L
1364.3 462.403 L
1369.44 462.361 L
1374.58 462.323 L
1379.72 462.278 L
1384.86 462.242 L
1390 462.198 L
S
GR
GS
[0.6 0 0 0.6 0 0] CT
0 1 0 RC
[12 3 6 3] 0 setdash
2 LJ
3.333 LW
N
881.14 410.773 M
886.28 410.12 L
891.42 408.954 L
896.56 407.161 L
901.7 404.587 L
906.84 401.088 L
911.98 396.574 L
917.12 391.096 L
922.26 384.928 L
927.4 378.66 L
932.54 373.238 L
937.68 370 L
942.82 370.53 L
947.96 376.282 L
953.1 388.093 L
958.24 405.516 L
963.38 426.669 L
968.52 448.752 L
973.66 468.925 L
978.8 485.291 L
983.94 497.083 L
989.08 504.494 L
994.22 508.309 L
999.36 509.392 L
1004.5 508.618 L
1009.64 506.672 L
1014.78 504.062 L
1019.92 501.137 L
1025.06 498.134 L
1030.2 495.222 L
1035.34 492.45 L
1040.48 489.85 L
1045.62 487.461 L
1050.76 485.301 L
1055.9 483.325 L
1061.04 481.534 L
1066.18 479.935 L
1071.32 478.535 L
1076.46 477.326 L
1081.6 470.891 L
1086.74 474.52 L
1091.88 473.823 L
1097.02 473.08 L
1102.16 472.38 L
1107.3 471.732 L
1112.44 471.129 L
1117.58 470.566 L
1122.72 470.041 L
1127.86 469.546 L
1133 469.081 L
1138.14 468.645 L
1143.28 468.24 L
1148.42 467.793 L
1153.56 466.673 L
1158.7 466.978 L
1163.84 466.847 L
1168.98 466.631 L
1174.12 466.406 L
1179.26 466.182 L
1184.4 465.967 L
1189.54 465.758 L
1194.68 465.554 L
1199.82 465.343 L
1204.96 465.085 L
1210.1 464.676 L
1215.24 464.695 L
1220.38 464.653 L
1225.52 464.55 L
1230.66 464.432 L
1235.8 464.311 L
1240.94 464.187 L
1246.08 464.058 L
1251.22 463.906 L
1256.36 463.693 L
1261.5 463.598 L
1266.64 463.594 L
1271.78 463.544 L
1276.92 463.473 L
1282.06 463.393 L
1287.2 463.306 L
1292.34 463.204 L
1297.48 463.072 L
1302.62 462.969 L
1307.76 462.955 L
1312.9 462.931 L
1318.04 462.885 L
1323.18 462.827 L
1328.32 462.758 L
1333.46 462.672 L
1338.6 462.578 L
1343.74 462.536 L
1348.88 462.522 L
1354.02 462.496 L
1359.16 462.455 L
1364.3 462.402 L
1369.44 462.336 L
1374.58 462.267 L
1379.72 462.234 L
1384.86 462.22 L
1390 462.197 L
S
GR
GS
[0.6 0 0 0.6 0 0] CT
1 GC
N
200 829 M
714 829 L
714 658 L
200 658 L
cp
f
GR
GS
[0.6 0 0 0.6 0 0] CT
0.149 GC
2 setlinecap
1 LJ
0.833 LW
N
200 829 M
714 829 L
S
GR
GS
[0.6 0 0 0.6 0 0] CT
0.149 GC
2 setlinecap
1 LJ
0.833 LW
N
200 658 M
714 658 L
S
GR
GS
[0.6 0 0 0.6 0 0] CT
0.149 GC
2 setlinecap
1 LJ
0.833 LW
N
200 829 M
200 823.86 L
S
GR
GS
[0.6 0 0 0.6 0 0] CT
0.149 GC
2 setlinecap
1 LJ
0.833 LW
N
281.847 829 M
281.847 823.86 L
S
GR
GS
[0.6 0 0 0.6 0 0] CT
0.149 GC
2 setlinecap
1 LJ
0.833 LW
N
363.694 829 M
363.694 823.86 L
S
GR
GS
[0.6 0 0 0.6 0 0] CT
0.149 GC
2 setlinecap
1 LJ
0.833 LW
N
445.541 829 M
445.541 823.86 L
S
GR
GS
[0.6 0 0 0.6 0 0] CT
0.149 GC
2 setlinecap
1 LJ
0.833 LW
N
527.389 829 M
527.389 823.86 L
S
GR
GS
[0.6 0 0 0.6 0 0] CT
0.149 GC
2 setlinecap
1 LJ
0.833 LW
N
609.236 829 M
609.236 823.86 L
S
GR
GS
[0.6 0 0 0.6 0 0] CT
0.149 GC
2 setlinecap
1 LJ
0.833 LW
N
691.083 829 M
691.083 823.86 L
S
GR
GS
[0.6 0 0 0.6 0 0] CT
0.149 GC
2 setlinecap
1 LJ
0.833 LW
N
200 658 M
200 663.14 L
S
GR
GS
[0.6 0 0 0.6 0 0] CT
0.149 GC
2 setlinecap
1 LJ
0.833 LW
N
281.847 658 M
281.847 663.14 L
S
GR
GS
[0.6 0 0 0.6 0 0] CT
0.149 GC
2 setlinecap
1 LJ
0.833 LW
N
363.694 658 M
363.694 663.14 L
S
GR
GS
[0.6 0 0 0.6 0 0] CT
0.149 GC
2 setlinecap
1 LJ
0.833 LW
N
445.541 658 M
445.541 663.14 L
S
GR
GS
[0.6 0 0 0.6 0 0] CT
0.149 GC
2 setlinecap
1 LJ
0.833 LW
N
527.389 658 M
527.389 663.14 L
S
GR
GS
[0.6 0 0 0.6 0 0] CT
0.149 GC
2 setlinecap
1 LJ
0.833 LW
N
609.236 658 M
609.236 663.14 L
S
GR
GS
[0.6 0 0 0.6 0 0] CT
0.149 GC
2 setlinecap
1 LJ
0.833 LW
N
691.083 658 M
691.083 663.14 L
S
GR
GS
[0.6 0 0 0.6 120 502.39999] CT
0.149 GC
/Helvetica-Bold 25 F
GS
[1 0 0 1 0 0] CT
-7 26 moveto 
1 -1 scale
(0) t 
GR
GR
GS
[0.6 0 0 0.6 169.10829 502.39999] CT
0.149 GC
/Helvetica-Bold 25 F
GS
[1 0 0 1 0 0] CT
-7 26 moveto 
1 -1 scale
(1) t 
GR
GR
GS
[0.6 0 0 0.6 218.21657 502.39999] CT
0.149 GC
/Helvetica-Bold 25 F
GS
[1 0 0 1 0 0] CT
-7 26 moveto 
1 -1 scale
(2) t 
GR
GR
GS
[0.6 0 0 0.6 267.32486 502.39999] CT
0.149 GC
/Helvetica-Bold 25 F
GS
[1 0 0 1 0 0] CT
-7 26 moveto 
1 -1 scale
(3) t 
GR
GR
GS
[0.6 0 0 0.6 316.43314 502.39999] CT
0.149 GC
/Helvetica-Bold 25 F
GS
[1 0 0 1 0 0] CT
-7 26 moveto 
1 -1 scale
(4) t 
GR
GR
GS
[0.6 0 0 0.6 365.54141 502.39999] CT
0.149 GC
/Helvetica-Bold 25 F
GS
[1 0 0 1 0 0] CT
-7 26 moveto 
1 -1 scale
(5) t 
GR
GR
GS
[0.6 0 0 0.6 414.64971 502.39999] CT
0.149 GC
/Helvetica-Bold 25 F
GS
[1 0 0 1 0 0] CT
-7 26 moveto 
1 -1 scale
(6) t 
GR
GR
GS
[0.6 0 0 0.6 240.60001 539.4] CT
0.149 GC
N
f876989070
f
GR
GS
[0.6 0 0 0.6 252.00001 539.4] CT
0.149 GC
/Helvetica-Bold 27.5 F
GS
[1 0 0 1 0 0] CT
0 0 moveto 
1 -1 scale
( [rad/s]) t 
GR
GR
GS
[0.6 0 0 0.6 0 0] CT
0.149 GC
2 setlinecap
1 LJ
0.833 LW
N
200 829 M
200 658 L
S
GR
GS
[0.6 0 0 0.6 0 0] CT
0.149 GC
2 setlinecap
1 LJ
0.833 LW
N
714 829 M
714 658 L
S
GR
GS
[0.6 0 0 0.6 0 0] CT
0.149 GC
2 setlinecap
1 LJ
0.833 LW
N
200 829 M
205.14 829 L
S
GR
GS
[0.6 0 0 0.6 0 0] CT
0.149 GC
2 setlinecap
1 LJ
0.833 LW
N
200 770.071 M
205.14 770.071 L
S
GR
GS
[0.6 0 0 0.6 0 0] CT
0.149 GC
2 setlinecap
1 LJ
0.833 LW
N
200 711.141 M
205.14 711.141 L
S
GR
GS
[0.6 0 0 0.6 0 0] CT
0.149 GC
2 setlinecap
1 LJ
0.833 LW
N
714 829 M
708.86 829 L
S
GR
GS
[0.6 0 0 0.6 0 0] CT
0.149 GC
2 setlinecap
1 LJ
0.833 LW
N
714 770.071 M
708.86 770.071 L
S
GR
GS
[0.6 0 0 0.6 0 0] CT
0.149 GC
2 setlinecap
1 LJ
0.833 LW
N
714 711.141 M
708.86 711.141 L
S
GR
GS
[0.6 0 0 0.6 115.00001 497.4] CT
0.149 GC
/Helvetica-Bold 25 F
GS
[1 0 0 1 0 0] CT
-14 10 moveto 
1 -1 scale
(4) t 
GR
GR
GS
[0.6 0 0 0.6 115.00001 462.04241] CT
0.149 GC
/Helvetica-Bold 25 F
GS
[1 0 0 1 0 0] CT
-14 10 moveto 
1 -1 scale
(5) t 
GR
GR
GS
[0.6 0 0 0.6 115.00001 426.68481] CT
0.149 GC
/Helvetica-Bold 25 F
GS
[1 0 0 1 0 0] CT
-14 10 moveto 
1 -1 scale
(6) t 
GR
GR
GS
[0 -0.6 0.6 0 93 458.4] CT
0.149 GC
/Helvetica-Bold 27.5 F
GS
[1 0 0 1 0 0] CT
0 0 moveto 
1 -1 scale
(a) t 
GR
GR
GS
[0 -0.6 0.6 0 100.8 448.8] CT
0.149 GC
/Helvetica-Bold 22 F
GS
[1 0 0 1 0 0] CT
0 0 moveto 
1 -1 scale
(55) t 
GR
GR
GS
[0.6 0 0 0.6 120 391.2] CT
0.149 GC
N
f1086612530
f
GR
GS
[0.6 0 0 0.6 132.60001 391.2] CT
0.149 GC
/Helvetica-Bold 25 F
GS
[1 0 0 1 0 0] CT
0 0 moveto 
1 -1 scale
(10) t 
GR
GR
GS
[0.6 0 0 0.6 149.40001 384] CT
0.149 GC
/Helvetica-Bold 20 F
GS
[1 0 0 1 0 0] CT
0 0 moveto 
1 -1 scale
(7) t 
GR
GR
GS
[0.6 0 0 0.6 0 0] CT
0 0 1 RC
1 LJ
3.333 LW
N
205.14 698.576 M
210.28 697.928 L
215.42 696.776 L
220.56 695.003 L
225.7 692.46 L
230.84 689 L
235.98 684.538 L
241.12 679.123 L
246.26 673.026 L
251.4 666.82 L
256.54 661.453 L
261.68 658.244 L
266.82 658.759 L
271.96 664.462 L
277.1 676.16 L
282.24 693.423 L
287.38 714.393 L
292.52 736.266 L
297.66 756.245 L
302.8 772.454 L
307.94 784.11 L
313.08 791.434 L
318.22 795.165 L
323.36 796.202 L
328.5 795.385 L
333.64 793.396 L
338.78 790.745 L
343.92 787.789 L
349.06 784.764 L
354.2 781.817 L
359.34 779.034 L
364.48 776.458 L
369.62 774.104 L
374.76 771.972 L
379.9 770.052 L
385.04 768.326 L
390.18 766.78 L
395.32 765.391 L
400.46 764.145 L
405.6 763.025 L
410.74 762.016 L
415.88 761.106 L
421.02 760.283 L
426.16 759.538 L
431.3 758.861 L
436.44 758.245 L
441.58 757.683 L
446.72 757.169 L
451.86 756.699 L
457 756.268 L
462.14 755.873 L
467.28 755.511 L
472.42 755.179 L
477.56 754.874 L
482.7 754.597 L
487.84 754.345 L
492.98 754.117 L
498.12 753.912 L
503.26 753.724 L
508.4 753.535 L
513.54 753.295 L
518.68 752.884 L
523.82 752.257 L
528.96 751.724 L
534.1 751.424 L
539.24 751.23 L
544.38 750.999 L
549.52 750.502 L
554.66 750.655 L
559.8 751.442 L
564.94 751.184 L
570.08 751.009 L
575.22 750.854 L
580.36 750.646 L
585.5 750.165 L
590.64 750.772 L
595.78 750.61 L
600.92 750.477 L
606.06 750.346 L
611.2 750.263 L
616.34 750.252 L
621.48 750.207 L
626.62 750.123 L
631.76 750.042 L
636.9 749.958 L
642.04 749.891 L
647.18 749.85 L
652.32 749.794 L
657.46 749.734 L
662.6 749.677 L
667.74 749.629 L
672.88 749.585 L
678.02 749.544 L
683.16 749.504 L
688.3 749.464 L
693.44 749.428 L
698.58 749.369 L
703.72 749.341 L
708.86 749.309 L
714 749.271 L
S
GR
GS
[0.6 0 0 0.6 0 0] CT
1 0 0 RC
[12 12] 0 setdash
2 LJ
3.333 LW
N
205.14 698.414 M
210.28 697.771 L
215.42 696.625 L
220.56 694.863 L
225.7 692.332 L
230.84 688.893 L
235.98 684.459 L
241.12 679.085 L
246.26 673.047 L
251.4 666.935 L
256.54 661.687 L
261.68 658.619 L
266.82 659.265 L
271.96 664.998 L
277.1 676.561 L
282.24 693.431 L
287.38 713.753 L
292.52 734.856 L
297.66 754.101 L
302.8 769.754 L
307.94 781.132 L
313.08 788.416 L
318.22 792.332 L
323.36 793.664 L
328.5 793.222 L
333.64 791.635 L
338.78 789.376 L
343.92 786.78 L
349.06 784.064 L
354.2 781.395 L
359.34 778.836 L
364.48 776.407 L
369.62 774.154 L
374.76 772.102 L
379.9 770.211 L
385.04 768.482 L
390.18 766.919 L
395.32 765.526 L
400.46 764.272 L
405.6 763.152 L
410.74 762.154 L
415.88 761.263 L
421.02 760.465 L
426.16 759.741 L
431.3 759.078 L
436.44 758.465 L
441.58 757.892 L
446.72 757.359 L
451.86 756.854 L
457 756.385 L
462.14 755.948 L
467.28 755.543 L
472.42 755.172 L
477.56 754.833 L
482.7 754.521 L
487.84 754.235 L
492.98 753.969 L
498.12 753.717 L
503.26 753.479 L
508.4 753.252 L
513.54 753.034 L
518.68 752.826 L
523.82 752.63 L
528.96 752.446 L
534.1 752.273 L
539.24 752.112 L
544.38 751.962 L
549.52 751.819 L
554.66 751.682 L
559.8 751.55 L
564.94 751.423 L
570.08 751.302 L
575.22 751.185 L
580.36 751.075 L
585.5 750.971 L
590.64 750.872 L
595.78 750.778 L
600.92 750.687 L
606.06 750.599 L
611.2 750.514 L
616.34 750.431 L
621.48 750.351 L
626.62 750.274 L
631.76 750.2 L
636.9 750.13 L
642.04 750.059 L
647.18 750.008 L
652.32 749.943 L
657.46 749.886 L
662.6 749.826 L
667.74 749.767 L
672.88 749.715 L
678.02 749.679 L
683.16 749.633 L
688.3 749.585 L
693.44 749.537 L
698.58 749.496 L
703.72 749.453 L
708.86 749.409 L
714 749.37 L
S
GR
GS
[0.6 0 0 0.6 0 0] CT
0 1 0 RC
[12 3 6 3] 0 setdash
2 LJ
3.333 LW
N
205.14 698.409 M
210.28 697.761 L
215.42 696.606 L
220.56 694.831 L
225.7 692.281 L
230.84 688.816 L
235.98 684.344 L
241.12 678.917 L
246.26 672.805 L
251.4 666.592 L
256.54 661.215 L
261.68 658 L
266.82 658.516 L
271.96 664.205 L
277.1 675.899 L
282.24 693.157 L
287.38 714.113 L
292.52 735.998 L
297.66 755.993 L
302.8 772.219 L
307.94 783.915 L
313.08 791.268 L
318.22 795.059 L
323.36 796.139 L
328.5 795.377 L
333.64 793.452 L
338.78 790.868 L
343.92 787.969 L
349.06 784.993 L
354.2 782.108 L
359.34 779.361 L
364.48 776.782 L
369.62 774.414 L
374.76 772.273 L
379.9 770.314 L
385.04 768.538 L
390.18 766.953 L
395.32 765.565 L
400.46 764.367 L
405.6 757.957 L
410.74 761.575 L
415.88 760.888 L
421.02 760.153 L
426.16 759.46 L
431.3 758.817 L
436.44 758.22 L
441.58 757.663 L
446.72 757.142 L
451.86 756.652 L
457 756.192 L
462.14 755.759 L
467.28 755.357 L
472.42 754.911 L
477.56 753.801 L
482.7 754.104 L
487.84 753.975 L
492.98 753.76 L
498.12 753.538 L
503.26 753.318 L
508.4 753.103 L
513.54 752.897 L
518.68 752.695 L
523.82 752.486 L
528.96 752.226 L
534.1 751.822 L
539.24 751.841 L
544.38 751.801 L
549.52 751.698 L
554.66 751.582 L
559.8 751.462 L
564.94 751.34 L
570.08 751.212 L
575.22 751.06 L
580.36 750.848 L
585.5 750.755 L
590.64 750.751 L
595.78 750.702 L
600.92 750.631 L
606.06 750.552 L
611.2 750.466 L
616.34 750.364 L
621.48 750.233 L
626.62 750.131 L
631.76 750.118 L
636.9 750.094 L
642.04 750.048 L
647.18 749.991 L
652.32 749.923 L
657.46 749.837 L
662.6 749.744 L
667.74 749.702 L
672.88 749.689 L
678.02 749.662 L
683.16 749.622 L
688.3 749.57 L
693.44 749.504 L
698.58 749.436 L
703.72 749.403 L
708.86 749.389 L
714 749.366 L
S
GR
GS
[0.6 0 0 0.6 0 0] CT
1 GC
N
876 829 M
1390 829 L
1390 658 L
876 658 L
cp
f
GR
GS
[0.6 0 0 0.6 0 0] CT
0.149 GC
2 setlinecap
1 LJ
0.833 LW
N
876 829 M
1390 829 L
S
GR
GS
[0.6 0 0 0.6 0 0] CT
0.149 GC
2 setlinecap
1 LJ
0.833 LW
N
876 658 M
1390 658 L
S
GR
GS
[0.6 0 0 0.6 0 0] CT
0.149 GC
2 setlinecap
1 LJ
0.833 LW
N
876 829 M
876 823.86 L
S
GR
GS
[0.6 0 0 0.6 0 0] CT
0.149 GC
2 setlinecap
1 LJ
0.833 LW
N
957.847 829 M
957.847 823.86 L
S
GR
GS
[0.6 0 0 0.6 0 0] CT
0.149 GC
2 setlinecap
1 LJ
0.833 LW
N
1039.694 829 M
1039.694 823.86 L
S
GR
GS
[0.6 0 0 0.6 0 0] CT
0.149 GC
2 setlinecap
1 LJ
0.833 LW
N
1121.541 829 M
1121.541 823.86 L
S
GR
GS
[0.6 0 0 0.6 0 0] CT
0.149 GC
2 setlinecap
1 LJ
0.833 LW
N
1203.389 829 M
1203.389 823.86 L
S
GR
GS
[0.6 0 0 0.6 0 0] CT
0.149 GC
2 setlinecap
1 LJ
0.833 LW
N
1285.236 829 M
1285.236 823.86 L
S
GR
GS
[0.6 0 0 0.6 0 0] CT
0.149 GC
2 setlinecap
1 LJ
0.833 LW
N
1367.083 829 M
1367.083 823.86 L
S
GR
GS
[0.6 0 0 0.6 0 0] CT
0.149 GC
2 setlinecap
1 LJ
0.833 LW
N
876 658 M
876 663.14 L
S
GR
GS
[0.6 0 0 0.6 0 0] CT
0.149 GC
2 setlinecap
1 LJ
0.833 LW
N
957.847 658 M
957.847 663.14 L
S
GR
GS
[0.6 0 0 0.6 0 0] CT
0.149 GC
2 setlinecap
1 LJ
0.833 LW
N
1039.694 658 M
1039.694 663.14 L
S
GR
GS
[0.6 0 0 0.6 0 0] CT
0.149 GC
2 setlinecap
1 LJ
0.833 LW
N
1121.541 658 M
1121.541 663.14 L
S
GR
GS
[0.6 0 0 0.6 0 0] CT
0.149 GC
2 setlinecap
1 LJ
0.833 LW
N
1203.389 658 M
1203.389 663.14 L
S
GR
GS
[0.6 0 0 0.6 0 0] CT
0.149 GC
2 setlinecap
1 LJ
0.833 LW
N
1285.236 658 M
1285.236 663.14 L
S
GR
GS
[0.6 0 0 0.6 0 0] CT
0.149 GC
2 setlinecap
1 LJ
0.833 LW
N
1367.083 658 M
1367.083 663.14 L
S
GR
GS
[0.6 0 0 0.6 525.60002 502.39988] CT
0.149 GC
/Helvetica-Bold 25 F
GS
[1 0 0 1 0 0] CT
-7 26 moveto 
1 -1 scale
(0) t 
GR
GR
GS
[0.6 0 0 0.6 574.70829 502.39988] CT
0.149 GC
/Helvetica-Bold 25 F
GS
[1 0 0 1 0 0] CT
-7 26 moveto 
1 -1 scale
(1) t 
GR
GR
GS
[0.6 0 0 0.6 623.81655 502.39988] CT
0.149 GC
/Helvetica-Bold 25 F
GS
[1 0 0 1 0 0] CT
-7 26 moveto 
1 -1 scale
(2) t 
GR
GR
GS
[0.6 0 0 0.6 672.92486 502.39988] CT
0.149 GC
/Helvetica-Bold 25 F
GS
[1 0 0 1 0 0] CT
-7 26 moveto 
1 -1 scale
(3) t 
GR
GR
GS
[0.6 0 0 0.6 722.03316 502.39988] CT
0.149 GC
/Helvetica-Bold 25 F
GS
[1 0 0 1 0 0] CT
-7 26 moveto 
1 -1 scale
(4) t 
GR
GR
GS
[0.6 0 0 0.6 771.14146 502.39988] CT
0.149 GC
/Helvetica-Bold 25 F
GS
[1 0 0 1 0 0] CT
-7 26 moveto 
1 -1 scale
(5) t 
GR
GR
GS
[0.6 0 0 0.6 820.24969 502.39988] CT
0.149 GC
/Helvetica-Bold 25 F
GS
[1 0 0 1 0 0] CT
-7 26 moveto 
1 -1 scale
(6) t 
GR
GR
GS
[0.6 0 0 0.6 646.20003 539.4] CT
0.149 GC
N
f876989070
f
GR
GS
[0.6 0 0 0.6 657.60003 539.4] CT
0.149 GC
/Helvetica-Bold 27.5 F
GS
[1 0 0 1 0 0] CT
0 0 moveto 
1 -1 scale
( [rad/s]) t 
GR
GR
GS
[0.6 0 0 0.6 0 0] CT
0.149 GC
2 setlinecap
1 LJ
0.833 LW
N
876 829 M
876 658 L
S
GR
GS
[0.6 0 0 0.6 0 0] CT
0.149 GC
2 setlinecap
1 LJ
0.833 LW
N
1390 829 M
1390 658 L
S
GR
GS
[0.6 0 0 0.6 0 0] CT
0.149 GC
2 setlinecap
1 LJ
0.833 LW
N
876 773.866 M
881.14 773.866 L
S
GR
GS
[0.6 0 0 0.6 0 0] CT
0.149 GC
2 setlinecap
1 LJ
0.833 LW
N
876 715.933 M
881.14 715.933 L
S
GR
GS
[0.6 0 0 0.6 0 0] CT
0.149 GC
2 setlinecap
1 LJ
0.833 LW
N
876 658 M
881.14 658 L
S
GR
GS
[0.6 0 0 0.6 0 0] CT
0.149 GC
2 setlinecap
1 LJ
0.833 LW
N
1390 773.866 M
1384.86 773.866 L
S
GR
GS
[0.6 0 0 0.6 0 0] CT
0.149 GC
2 setlinecap
1 LJ
0.833 LW
N
1390 715.933 M
1384.86 715.933 L
S
GR
GS
[0.6 0 0 0.6 0 0] CT
0.149 GC
2 setlinecap
1 LJ
0.833 LW
N
1390 658 M
1384.86 658 L
S
GR
GS
[0.6 0 0 0.6 520.60003 464.31973] CT
0.149 GC
/Helvetica-Bold 25 F
GS
[1 0 0 1 0 0] CT
-42 10 moveto 
1 -1 scale
(660) t 
GR
GR
GS
[0.6 0 0 0.6 520.60003 429.55986] CT
0.149 GC
/Helvetica-Bold 25 F
GS
[1 0 0 1 0 0] CT
-42 10 moveto 
1 -1 scale
(670) t 
GR
GR
GS
[0.6 0 0 0.6 520.60003 394.8] CT
0.149 GC
/Helvetica-Bold 25 F
GS
[1 0 0 1 0 0] CT
-42 10 moveto 
1 -1 scale
(680) t 
GR
GR
GS
[0 -0.6 0.6 0 481.80002 458.4] CT
0.149 GC
/Helvetica-Bold 27.5 F
GS
[1 0 0 1 0 0] CT
0 0 moveto 
1 -1 scale
(a) t 
GR
GR
GS
[0 -0.6 0.6 0 489.60002 448.8] CT
0.149 GC
/Helvetica-Bold 22 F
GS
[1 0 0 1 0 0] CT
0 0 moveto 
1 -1 scale
(66) t 
GR
GR
GS
[0.6 0 0 0.6 0 0] CT
0 0 1 RC
1 LJ
3.333 LW
N
881.14 715.497 M
886.28 715.252 L
891.42 714.831 L
896.56 714.213 L
901.7 713.365 L
906.84 712.251 L
911.98 710.83 L
917.12 709.067 L
922.26 706.944 L
927.4 704.473 L
932.54 701.718 L
937.68 698.81 L
942.82 695.972 L
947.96 693.509 L
953.1 691.772 L
958.24 691.065 L
963.38 691.536 L
968.52 693.109 L
973.66 694.902 L
978.8 698.4 L
983.94 701.423 L
989.08 704.33 L
994.22 706.946 L
999.36 709.258 L
1004.5 711.149 L
1009.64 712.605 L
1014.78 713.684 L
1019.92 714.574 L
1025.06 715.66 L
1030.2 717.504 L
1035.34 720.648 L
1040.48 725.316 L
1045.62 731.208 L
1050.76 737.657 L
1055.9 744.078 L
1061.04 750.299 L
1066.18 756.517 L
1071.32 762.942 L
1076.46 769.528 L
1081.6 775.864 L
1086.74 781.686 L
1091.88 786.795 L
1097.02 791.167 L
1102.16 794.831 L
1107.3 797.818 L
1112.44 800.181 L
1117.58 801.999 L
1122.72 803.364 L
1127.86 804.389 L
1133 805.19 L
1138.14 805.839 L
1143.28 806.395 L
1148.42 806.906 L
1153.56 807.335 L
1158.7 807.674 L
1163.84 807.888 L
1168.98 807.99 L
1174.12 807.935 L
1179.26 807.609 L
1184.4 806.604 L
1189.54 803.655 L
1194.68 798.973 L
1199.82 798.714 L
1204.96 800.273 L
1210.1 800.261 L
1215.24 793.907 L
1220.38 792.729 L
1225.52 791.768 L
1230.66 789.615 L
1235.8 784.357 L
1240.94 785.024 L
1246.08 787.819 L
1251.22 787.882 L
1256.36 790.875 L
1261.5 788.049 L
1266.64 788.268 L
1271.78 785.875 L
1276.92 787.633 L
1282.06 787.863 L
1287.2 786.53 L
1292.34 786.953 L
1297.48 785.344 L
1302.62 786.482 L
1307.76 786.272 L
1312.9 786.338 L
1318.04 785.964 L
1323.18 785.372 L
1328.32 784.744 L
1333.46 784.254 L
1338.6 783.832 L
1343.74 783.352 L
1348.88 782.775 L
1354.02 782.099 L
1359.16 781.378 L
1364.3 780.695 L
1369.44 780.127 L
1374.58 780.016 L
1379.72 780.314 L
1384.86 779.256 L
1390 779.142 L
S
GR
GS
[0.6 0 0 0.6 0 0] CT
1 0 0 RC
[12 12] 0 setdash
2 LJ
3.333 LW
N
881.14 737.428 M
886.28 737.203 L
891.42 736.904 L
896.56 736.265 L
901.7 735.505 L
906.84 734.564 L
911.98 733.205 L
917.12 731.56 L
922.26 729.595 L
927.4 727.257 L
932.54 724.717 L
937.68 722.094 L
942.82 719.377 L
947.96 716.974 L
953.1 715.354 L
958.24 714.53 L
963.38 714.947 L
968.52 716.163 L
973.66 718.262 L
978.8 720.606 L
983.94 723.326 L
989.08 725.771 L
994.22 728.091 L
999.36 730.215 L
1004.5 731.759 L
1009.64 733.22 L
1014.78 734.435 L
1019.92 735.278 L
1025.06 736.586 L
1030.2 738.651 L
1035.34 741.403 L
1040.48 745.317 L
1045.62 750.443 L
1050.76 755.931 L
1055.9 761.196 L
1061.04 766.406 L
1066.18 771.791 L
1071.32 777.179 L
1076.46 782.381 L
1081.6 787.387 L
1086.74 792.16 L
1091.88 796.53 L
1097.02 800.422 L
1102.16 803.809 L
1107.3 806.632 L
1112.44 808.844 L
1117.58 810.507 L
1122.72 811.876 L
1127.86 813.049 L
1133 814.002 L
1138.14 814.67 L
1143.28 815.134 L
1148.42 815.467 L
1153.56 815.854 L
1158.7 816.187 L
1163.84 816.413 L
1168.98 816.44 L
1174.12 816.325 L
1179.26 816.11 L
1184.4 815.826 L
1189.54 815.488 L
1194.68 815.098 L
1199.82 814.675 L
1204.96 814.195 L
1210.1 813.702 L
1215.24 813.21 L
1220.38 812.76 L
1225.52 812.382 L
1230.66 812.079 L
1235.8 811.84 L
1240.94 811.643 L
1246.08 811.471 L
1251.22 811.325 L
1256.36 811.187 L
1261.5 811.052 L
1266.64 810.932 L
1271.78 810.815 L
1276.92 810.712 L
1282.06 810.613 L
1287.2 810.488 L
1292.34 810.347 L
1297.48 810.201 L
1302.62 810.035 L
1307.76 809.827 L
1312.9 809.533 L
1318.04 808.712 L
1323.18 808.946 L
1328.32 808.044 L
1333.46 807.149 L
1338.6 806.3 L
1343.74 805.506 L
1348.88 805.81 L
1354.02 805.994 L
1359.16 806.063 L
1364.3 805.932 L
1369.44 804.477 L
1374.58 804.863 L
1379.72 804.45 L
1384.86 804.332 L
1390 804.437 L
S
GR
GS
[0.6 0 0 0.6 0 0] CT
0 1 0 RC
[12 3 6 3] 0 setdash
2 LJ
3.333 LW
N
881.14 737.361 M
886.28 737.124 L
891.42 736.807 L
896.56 736.136 L
901.7 735.335 L
906.84 734.345 L
911.98 732.924 L
917.12 731.194 L
922.26 729.131 L
927.4 726.669 L
932.54 723.983 L
937.68 721.186 L
942.82 718.285 L
947.96 715.691 L
953.1 713.891 L
958.24 712.936 L
963.38 713.284 L
968.52 714.523 L
973.66 716.711 L
978.8 719.196 L
983.94 722.063 L
989.08 724.651 L
994.22 727.079 L
999.36 729.26 L
1004.5 730.809 L
1009.64 732.194 L
1014.78 733.224 L
1019.92 733.79 L
1025.06 734.768 L
1030.2 736.51 L
1035.34 738.646 L
1040.48 746.672 L
1045.62 751.266 L
1050.76 757.634 L
1055.9 763.91 L
1061.04 770.14 L
1066.18 776.724 L
1071.32 783.706 L
1076.46 791.332 L
1081.6 790.641 L
1086.74 800.969 L
1091.88 807.111 L
1097.02 812.177 L
1102.16 816.456 L
1107.3 820.099 L
1112.44 822.868 L
1117.58 825.981 L
1122.72 819.267 L
1127.86 825.103 L
1133 828.186 L
1138.14 829 L
1143.28 821.41 L
1148.42 826.88 L
1153.56 825.289 L
1158.7 828.655 L
1163.84 822.44 L
1168.98 818.123 L
1174.12 822.583 L
1179.26 824.443 L
1184.4 820.951 L
1189.54 820.965 L
1194.68 822.581 L
1199.82 821.917 L
1204.96 817.491 L
1210.1 816.316 L
1215.24 817.65 L
1220.38 817.117 L
1225.52 811.301 L
1230.66 813.224 L
1235.8 813.782 L
1240.94 814.59 L
1246.08 815.238 L
1251.22 814.314 L
1256.36 811.889 L
1261.5 812.645 L
1266.64 813.933 L
1271.78 811.971 L
1276.92 811.092 L
1282.06 811.665 L
1287.2 812.398 L
1292.34 811.712 L
1297.48 809.449 L
1302.62 808.572 L
1307.76 809.336 L
1312.9 808.477 L
1318.04 807.339 L
1323.18 807.787 L
1328.32 808.404 L
1333.46 807.564 L
1338.6 805.865 L
1343.74 805.961 L
1348.88 806.116 L
1354.02 805.275 L
1359.16 805.144 L
1364.3 805.424 L
1369.44 804.868 L
1374.58 803.866 L
1379.72 804.043 L
1384.86 804.209 L
1390 803.773 L
S
GR
%%Trailer
%%Pages: 1
%%EOF
