<?xml version="1.0" encoding="UTF-8"?>
<!-- Generator: Adobe Illustrator 22.0.1, SVG Export Plug-In . SVG Version: 6.00 Build 0)  -->
<svg xmlns="http://www.w3.org/2000/svg" xmlns:xlink="http://www.w3.org/1999/xlink" id="Layer_1" x="0px" y="0px" viewBox="0 0 161.7 47.2" style="enable-background:new 0 0 161.7 47.2;" xml:space="preserve">
<style type="text/css">
	.st0{fill:#F3A1DC;}
	.st1{fill:#606060;}
	.st2{fill:#FFFFFF;}
</style>
<g>
	<g>
		<g>
			<path class="st2" d="M87,41.2c-0.2,0-0.3-0.1-0.4-0.2c-0.1-0.1-0.2-0.2-0.4-0.5s-0.3-0.6-0.5-1l-3.5-7.8c-0.2,0-0.3,0-0.5,0     c-0.1,0-0.3,0-0.4,0.1l-3.2,7.8c-0.2,0.6-0.4,1-0.6,1.2c-0.2,0.2-0.4,0.3-0.6,0.4c0,0.1-0.1,0.3-0.1,0.4c0-0.3-0.1-0.6-0.1-0.9     c-0.4,0-0.7-0.1-0.9-0.3c-0.2-0.1-0.3-0.4-0.5-0.8c-0.1-0.4-0.2-1-0.3-1.8l-0.7-6.8c0-0.3,0-0.6,0-0.7c0-0.6,0.1-1.1,0.3-1.3     c0.2-0.2,0.6-0.4,1.1-0.4c0.1-0.3,0.2-0.8,0.2-1.3c-0.6,0-1.4,0.1-2.4,0.1c-1,0-1.8,0-2.5-0.1l-4,10.5l-4.6-10.5     c-0.5,0-1.3,0.1-2.4,0.1c-1.1,0-1.9,0-2.4-0.1c0,0.6,0.1,1,0.2,1.3c0.5,0,0.9,0.1,1.1,0.3s0.3,0.6,0.3,1.2c0,0.1,0,0.4,0,0.8     l-0.6,6.4c-0.1,0.9-0.2,1.6-0.3,2.1c-0.1,0.5-0.3,0.8-0.6,1c-0.2,0.2-0.5,0.3-0.9,0.3c-0.1,0.4-0.2,0.8-0.2,1.3     c1,0,1.8-0.1,2.5-0.1c1,0,1.8,0,2.3,0.1c0-0.6,0-1-0.1-1.3c-0.5,0-0.9-0.2-1.1-0.5c-0.2-0.3-0.3-0.8-0.3-1.5c0-0.4,0-0.9,0.1-1.4     l0.6-5.8l4.8,10.7c0.6,0,1-0.1,1.3-0.2l4.3-10.6l0.7,6.6c0.1,0.7,0.1,1.1,0.1,1.2c0,0.5-0.1,0.8-0.3,1c-0.2,0.2-0.5,0.3-1.1,0.4     c-0.1,0.5-0.2,0.9-0.2,1.3c1.2,0,2.2-0.1,3-0.1c1.7,0,2.8,0,3.5,0.1c0,0,0,0,0,0c0,0,0,0,0,0c0,0,0,0,0,0c0,0,0,0,0,0     c0.3,0,0.7,0,1.3,0c0.7,0,1.3,0,1.6,0c0-0.4,0-0.7-0.1-0.9c-0.5-0.1-0.7-0.3-0.7-0.7c0-0.2,0.1-0.4,0.2-0.7l0.2-0.5     c1.1-0.1,2.4-0.1,3.7-0.1l0.3,0.8c0.1,0.3,0.2,0.5,0.2,0.7c0,0.1-0.1,0.3-0.2,0.3c-0.1,0.1-0.3,0.1-0.5,0.2     c-0.1,0.2-0.1,0.5-0.1,0.9c0.5,0,1.2,0,2.2,0c0.9,0,1.6,0,2.1,0C87.2,41.8,87.1,41.4,87,41.2z M79.7,38.3l0.8-1.9     c0.2-0.6,0.5-1.3,0.7-1.9c0.2,0.7,0.4,1.3,0.7,1.9l0.8,1.9L79.7,38.3z"></path>
			<path class="st2" d="M95.5,34.4c-0.3,0.1-0.7,0.2-1.2,0.2c-0.1-0.7-0.3-1.2-0.5-1.5c-0.3-0.3-0.7-0.5-1.2-0.5l-0.5,0l0,6.9     c0,0.4,0,0.7,0.1,0.9c0.1,0.2,0.2,0.3,0.4,0.4c0.2,0.1,0.5,0.1,0.9,0.2c0.1,0.2,0.1,0.5,0.1,0.9c-0.6,0-1.4,0-2.5,0     c-1.3,0-2.2,0-2.8,0c0-0.4,0-0.7,0.1-0.9c0.4,0,0.7-0.1,0.9-0.2c0.2-0.1,0.3-0.2,0.4-0.4c0.1-0.2,0.1-0.5,0.1-0.9l0-6.9l-0.3,0     c-0.6,0-1,0.1-1.3,0.4c-0.3,0.3-0.5,0.8-0.6,1.5c-0.5,0-0.9-0.1-1.2-0.2c0.1-0.4,0.2-0.9,0.2-1.4c0.1-0.5,0.1-0.9,0.1-1.3     c0.7,0,2.2,0,4.4,0c1.8,0,3.3,0,4.3,0C95.2,32.5,95.3,33.4,95.5,34.4z"></path>
			<path class="st2" d="M104.4,39.6c-0.2,0.6-0.4,1.5-0.5,2.5c-1,0-2.2,0-3.6,0c-1.5,0-2.9,0-4.3,0c0-0.4,0-0.7,0.1-0.9     c0.3,0,0.5-0.1,0.6-0.2c0.1-0.1,0.2-0.2,0.3-0.5c0.1-0.2,0.1-0.5,0.1-1l0-5.3c0-0.4,0-0.7-0.1-0.9c-0.1-0.2-0.2-0.3-0.3-0.4     c-0.1-0.1-0.4-0.1-0.7-0.2c-0.1-0.2-0.1-0.5-0.1-0.9c0.8,0,1.9,0,3.4,0c2.1,0,3.5,0,4.2,0c0,0.4,0.1,0.9,0.1,1.4     c0.1,0.5,0.1,0.9,0.2,1.2c-0.3,0.2-0.7,0.2-1.2,0.2c-0.1-0.6-0.3-1-0.6-1.4c-0.3-0.3-0.9-0.5-1.7-0.5l-1,0l0,3.8l0.4,0     c0.5,0,0.9-0.1,1.1-0.2c0.2-0.2,0.3-0.5,0.3-0.9c0.3-0.1,0.7-0.2,1.1-0.2c0,0.7-0.1,1.2-0.1,1.7c0,0.6,0,1.1,0.1,1.8     c-0.5,0-0.8,0-1-0.1c0-0.5-0.2-0.8-0.4-0.9c-0.2-0.2-0.6-0.2-1.1-0.2l-0.4,0l0,2.1c0,0.4,0,0.8,0.1,1c0.1,0.2,0.2,0.4,0.4,0.5     c0.2,0.1,0.4,0.1,0.8,0.1l0.2,0c0.5,0,0.9-0.1,1.2-0.2c0.3-0.1,0.5-0.3,0.7-0.6c0.2-0.3,0.3-0.7,0.5-1.2     C103.8,39.2,104.2,39.4,104.4,39.6z"></path>
			<path class="st2" d="M126.8,33.3c-0.1-0.2-0.2-0.3-0.3-0.4c-0.1-0.1-0.4-0.1-0.6-0.2c-0.1-0.2-0.1-0.5-0.1-0.9c0.5,0,1.3,0,2.3,0     c0.9,0,1.6,0,2.2,0c0,0.2,0,0.3,0,0.5c0,0.2,0,0.3-0.1,0.4c-0.3,0-0.5,0.1-0.6,0.2c-0.1,0.1-0.2,0.2-0.3,0.4     c-0.1,0.2-0.1,0.5-0.1,0.9l0,5.4c0,0.4,0,0.7,0.1,0.9c0.1,0.2,0.2,0.4,0.3,0.4c0.1,0.1,0.4,0.1,0.6,0.2c0.1,0.2,0.1,0.5,0.1,0.9     c-0.5,0-1.2,0-2.2,0c-1,0-1.8,0-2.4,0c0-0.4,0-0.7,0.1-0.9c0.3,0,0.5-0.1,0.6-0.2c0.1-0.1,0.2-0.2,0.3-0.4     c0.1-0.2,0.1-0.5,0.1-0.9l0-5.4C126.9,33.8,126.9,33.5,126.8,33.3z"></path>
			<path class="st2" d="M139.9,32.8c1,0.7,1.5,2,1.5,3.9c0,1.5-0.3,2.6-1,3.4c-0.7,0.8-1.4,1.3-2.2,1.6c-0.8,0.3-1.6,0.4-2.4,0.4     c-1.5,0-2.9,0-4.3,0c0-0.4,0-0.7,0.1-0.9c0.3,0,0.5-0.1,0.6-0.2c0.1-0.1,0.2-0.2,0.3-0.5c0.1-0.2,0.1-0.5,0.1-1l0-5.3     c0-0.4,0-0.7-0.1-0.9c-0.1-0.2-0.2-0.3-0.3-0.4c-0.1-0.1-0.4-0.1-0.7-0.2c-0.1-0.2-0.1-0.6-0.1-0.9c0.6,0,1.5,0,2.7,0     c0.3,0,0.6,0,0.7,0l0.9,0C137.5,31.8,138.9,32.1,139.9,32.8z M138.2,40.2c0.5-0.6,0.8-1.7,0.8-3.3c0-1.5-0.3-2.6-0.9-3.3     c-0.6-0.7-1.4-1-2.4-1c-0.3,0-0.6,0-0.8,0.1l0,6.7c0,0.4,0,0.8,0.1,1c0.1,0.2,0.2,0.4,0.4,0.5c0.2,0.1,0.4,0.1,0.8,0.1     C137,41.1,137.7,40.8,138.2,40.2z"></path>
			<path class="st2" d="M160.2,32.8c-1-0.7-2.4-1-4.1-1l-0.9,0c-0.2,0-0.4,0-0.7,0c-1.2,0-2.1,0-2.7,0c0,0.4,0,0.7,0.1,0.9     c0.3,0,0.5,0.1,0.7,0.2c0.1,0.1,0.2,0.2,0.3,0.4c0.1,0.2,0.1,0.5,0.1,0.9l0,5.3c0,0.4,0,0.8-0.1,1c-0.1,0.2-0.2,0.4-0.3,0.5     c-0.1,0.1-0.4,0.1-0.6,0.2c-0.1,0-0.2,0-0.2,0c-0.2,0-0.2,0-0.3-0.1c-0.1-0.1-0.3-0.3-0.5-0.5s-0.3-0.6-0.5-1l-3.5-7.8     c-0.2,0-0.3,0-0.5,0c-0.1,0-0.3,0-0.4,0.1l-3.2,7.8c-0.2,0.6-0.4,1-0.6,1.2c-0.2,0.2-0.4,0.3-0.6,0.4c-0.1,0.3-0.1,0.6-0.1,0.9     c0.3,0,0.7,0,1.4,0c0.7,0,1.3,0,1.6,0c0-0.4,0-0.7-0.1-0.9c-0.5-0.1-0.7-0.3-0.7-0.7c0-0.2,0.1-0.4,0.2-0.7l0.2-0.5     c1.1-0.1,2.4-0.1,3.7-0.1L148,40c0.1,0.3,0.2,0.5,0.2,0.7c0,0.1-0.1,0.3-0.2,0.3c-0.1,0.1-0.3,0.1-0.5,0.2     c-0.1,0.2-0.1,0.5-0.1,0.9c0.5,0,1.2,0,2.2,0c0.9,0,1.6,0,2.1,0c1.4,0,2.9,0,4.3,0c0.8,0,1.6-0.1,2.4-0.4     c0.8-0.3,1.6-0.8,2.2-1.6c0.7-0.8,1-1.9,1-3.4C161.7,34.8,161.2,33.5,160.2,32.8z M144.3,38.3l0.8-1.9c0.2-0.6,0.5-1.3,0.7-1.9     c0.2,0.7,0.4,1.3,0.7,1.9l0.8,1.9L144.3,38.3z M158.5,40.2c-0.5,0.6-1.2,0.9-2.1,0.9c-0.3,0-0.6,0-0.8-0.1     c-0.2-0.1-0.3-0.3-0.4-0.5c-0.1-0.2-0.1-0.6-0.1-1l0-6.7c0.2-0.1,0.5-0.1,0.8-0.1c1,0,1.8,0.3,2.4,1c0.6,0.7,0.9,1.8,0.9,3.3     C159.3,38.5,159,39.6,158.5,40.2z"></path>
			<path class="st2" d="M123.4,31.8c-0.7,0-1.3,0-1.7,0c0,0.3,0,0.7,0.1,0.9c0.3,0,0.6,0.1,0.8,0.2c0.2,0.1,0.3,0.3,0.3,0.6     c0.1,0.3,0.1,0.7,0.1,1.3l0,3.6l-4.9-6.7c-0.2,0-0.7,0-1.4,0c-0.7,0-1.3,0-1.6,0c0,0.4,0,0.7,0.1,0.9c0.3,0,0.5,0.1,0.6,0.1     c0.1,0.1,0.3,0.2,0.4,0.3l0.2,0.2l0,5.6c0,0.6,0,1-0.1,1.3c-0.1,0.3-0.2,0.5-0.3,0.7c-0.2,0.1-0.4,0.2-0.7,0.2l-0.1,0     c-0.4,0-0.7-0.1-0.9-0.3c-0.2-0.2-0.4-0.5-0.7-0.9c-0.4-0.8-0.7-1.3-1-1.6s-0.5-0.6-0.9-0.8c0.7-0.2,1.3-0.5,1.7-1     c0.4-0.5,0.6-1.2,0.6-2c0-0.8-0.3-1.5-0.9-2c-0.6-0.5-1.5-0.8-2.7-0.8c-0.5,0-1.1,0-1.8,0c-0.6,0-0.9,0-1.1,0c-0.6,0-1.3,0-2.2,0     c0,0.4,0,0.7,0.1,0.9c0.3,0,0.5,0.1,0.7,0.2c0.1,0.1,0.2,0.2,0.3,0.4c0.1,0.2,0.1,0.5,0.1,0.9l0,5.4c0,0.4,0,0.7-0.1,0.9     c-0.1,0.2-0.2,0.4-0.3,0.4c-0.1,0.1-0.4,0.1-0.6,0.2c-0.1,0.2-0.1,0.6-0.1,0.9c0.6,0,1.3,0,2.1,0c0.9,0,1.7,0,2.3,0     c0-0.5,0-0.8-0.1-0.9c-0.2,0-0.4-0.1-0.5-0.2s-0.2-0.2-0.3-0.5c-0.1-0.2-0.1-0.6-0.1-1l0-1.7l0.4,0l0.4,0     c0.3,0.3,0.6,0.6,0.8,0.9c0.2,0.3,0.4,0.7,0.7,1.3l0.2,0.4c0.3,0.7,0.6,1.3,0.9,1.9c0.6-0.1,1.6-0.1,2.9-0.1l0.1,0c0,0,0,0,0,0     c0.4,0,1,0,1.8,0c0.7,0,1.3,0,1.7,0c0-0.4,0-0.7-0.1-0.9c-0.3,0-0.5-0.1-0.7-0.2c-0.2-0.1-0.3-0.3-0.3-0.6     c-0.1-0.3-0.1-0.7-0.1-1.3l0-4.3l5.7,7.5c0.4,0,0.8,0,1.1-0.1l0-7.2c0-0.6,0-1,0.1-1.3c0.1-0.3,0.1-0.5,0.3-0.6     c0.1-0.1,0.3-0.2,0.6-0.2c0.1-0.2,0.1-0.6,0.1-0.9C124.6,31.7,124.1,31.8,123.4,31.8z M110.9,36.3c-0.4,0.4-1,0.5-1.6,0.5     c-0.2,0-0.3,0-0.6-0.1l0-4c0.3-0.1,0.5-0.1,0.9-0.1c0.6,0,1.1,0.2,1.5,0.5c0.3,0.4,0.5,0.9,0.5,1.5     C111.6,35.4,111.3,35.9,110.9,36.3z"></path>
		</g>
		<g>
			<path class="st2" d="M69.2,8.8c-0.4,0.2-1,0.3-1.7,0.3c-0.1-1-0.4-1.6-0.7-2.1c-0.4-0.4-0.9-0.7-1.7-0.7l-0.8,0l0,9.9     c0,0.6,0.1,1.1,0.2,1.3c0.1,0.3,0.3,0.5,0.5,0.6c0.3,0.1,0.7,0.2,1.2,0.2c0.1,0.3,0.2,0.7,0.2,1.3c-0.8,0-2-0.1-3.6-0.1     c-1.8,0-3.2,0-4.1,0.1c0-0.5,0.1-1,0.2-1.3c0.6,0,1-0.1,1.3-0.2c0.3-0.1,0.5-0.3,0.6-0.6c0.1-0.3,0.2-0.7,0.2-1.3l0-9.9l-0.5,0     c-0.9,0-1.5,0.2-1.8,0.6c-0.4,0.4-0.7,1.1-0.9,2.1C57,9.1,56.4,9,56,8.8c0.1-0.6,0.2-1.3,0.3-2c0.1-0.7,0.1-1.3,0.1-1.9     c1,0,3.1,0.1,6.2,0.1c2.6,0,4.6,0,6.2-0.1C68.9,6.1,69,7.3,69.2,8.8z"></path>
			<path class="st2" d="M91.1,10.9c-0.1-0.2-0.2-0.3-0.3-0.4c-0.1-0.1-0.4-0.1-0.6-0.2c-0.1-0.2-0.1-0.5-0.1-0.9c0.5,0,1.3,0,2.3,0     c0.9,0,1.6,0,2.2,0c0,0.2,0,0.3,0,0.5c0,0.2,0,0.3-0.1,0.4c-0.3,0-0.5,0.1-0.6,0.2c-0.1,0.1-0.2,0.2-0.3,0.4     c-0.1,0.2-0.1,0.5-0.1,0.9l0,5.4c0,0.4,0,0.7,0.1,0.9c0.1,0.2,0.2,0.4,0.3,0.4c0.1,0.1,0.4,0.1,0.6,0.2c0.1,0.2,0.1,0.5,0.1,0.9     c-0.5,0-1.2,0-2.2,0c-1,0-1.8,0-2.4,0c0-0.4,0-0.7,0.1-0.9c0.3,0,0.5-0.1,0.6-0.2c0.1-0.1,0.2-0.2,0.3-0.4     c0.1-0.2,0.1-0.5,0.1-0.9l0-5.4C91.2,11.4,91.2,11.1,91.1,10.9z"></path>
			<path class="st2" d="M97.5,19.6c-0.6-0.2-1.1-0.4-1.7-0.7c0.1-0.6,0.2-1.4,0.2-2.4c0.4-0.1,0.8-0.2,1.4-0.2     c0.1,0.9,0.2,1.5,0.5,1.9c0.3,0.4,0.8,0.5,1.4,0.5c0.6,0,1-0.1,1.3-0.4c0.3-0.2,0.4-0.5,0.4-0.9c0-0.3-0.1-0.5-0.3-0.7     c-0.2-0.2-0.4-0.4-0.6-0.5c-0.3-0.1-0.6-0.3-1.1-0.5c-0.6-0.3-1.2-0.6-1.6-0.8c-0.4-0.3-0.7-0.6-1-1c-0.3-0.4-0.4-1-0.4-1.6     c0-1,0.3-1.7,0.9-2.2c0.6-0.5,1.5-0.8,2.5-0.8c0.5,0,1.1,0.1,1.6,0.2c0.5,0.1,1,0.3,1.2,0.5c0,1,0,1.7,0.1,2.2     c-0.2,0.1-0.4,0.1-0.6,0.2c-0.2,0-0.5,0.1-0.7,0.1c-0.1-0.8-0.4-1.4-0.6-1.7c-0.3-0.3-0.7-0.5-1.1-0.5c-0.4,0-0.8,0.1-1,0.3     c-0.3,0.2-0.4,0.5-0.4,0.9c0,0.3,0.1,0.6,0.3,0.8c0.2,0.2,0.4,0.4,0.7,0.6c0.3,0.2,0.7,0.4,1.1,0.6c0.6,0.3,1.2,0.6,1.6,0.8     c0.4,0.3,0.7,0.6,1,1c0.3,0.4,0.4,0.9,0.4,1.6c0,0.9-0.3,1.6-1,2.2c-0.7,0.6-1.6,0.8-2.8,0.8C98.6,19.8,98,19.7,97.5,19.6z"></path>
			<path class="st2" d="M117.8,19.7c-0.4,0-1.2,0-2.5,0c-0.6,0-1.3,0-2.1,0c0-0.3,0-0.6,0.1-0.9c0.4,0,0.6-0.1,0.8-0.3     c0.1-0.1,0.2-0.4,0.2-0.7c0-0.1,0-0.4-0.1-0.9l-0.5-4.6l-3,7.4c-0.2,0.1-0.5,0.1-0.9,0.1l-3.4-7.5l-0.4,4.1c0,0.4-0.1,0.7-0.1,1     c0,0.5,0.1,0.9,0.2,1c0.2,0.2,0.4,0.3,0.8,0.3c0.1,0.2,0.1,0.5,0.1,0.9c-0.4,0-0.9,0-1.6,0c-0.5,0-1,0-1.7,0c0-0.4,0-0.7,0.1-0.9     c0.3,0,0.5-0.1,0.7-0.2c0.2-0.1,0.3-0.4,0.4-0.7c0.1-0.3,0.2-0.8,0.2-1.5l0.4-4.4c0-0.3,0-0.4,0-0.5c0-0.4-0.1-0.7-0.2-0.8     c-0.2-0.2-0.4-0.2-0.8-0.2c-0.1-0.2-0.1-0.5-0.1-0.9c0.4,0,1,0,1.7,0c0.7,0,1.3,0,1.7,0l3.2,7.4l2.8-7.4c0.5,0,1,0,1.7,0     c0.7,0,1.2,0,1.7,0c0,0.4,0,0.7-0.1,0.9c-0.4,0-0.6,0.1-0.8,0.3c-0.2,0.2-0.2,0.5-0.2,0.9c0,0.1,0,0.3,0,0.5l0.5,4.8     c0.1,0.6,0.1,1,0.2,1.3c0.1,0.3,0.2,0.5,0.3,0.6c0.1,0.1,0.3,0.2,0.6,0.2C117.8,19,117.8,19.3,117.8,19.7z"></path>
			<path class="st2" d="M120.8,19.1c-0.8-0.5-1.4-1.1-1.8-1.9c-0.4-0.8-0.6-1.7-0.6-2.8c0-1,0.2-2,0.7-2.7c0.4-0.8,1-1.4,1.8-1.8     c0.8-0.4,1.7-0.6,2.6-0.6c1,0,1.9,0.2,2.7,0.6c0.8,0.4,1.4,1,1.8,1.8c0.4,0.8,0.7,1.7,0.7,2.7c0,1-0.2,2-0.6,2.8     c-0.4,0.8-1,1.5-1.8,1.9c-0.8,0.5-1.7,0.7-2.7,0.7C122.5,19.8,121.6,19.6,120.8,19.1z M125.6,17.7c0.4-0.7,0.7-1.7,0.7-3     c0-0.8-0.1-1.6-0.4-2.3c-0.2-0.7-0.6-1.2-1.1-1.6c-0.5-0.4-1-0.6-1.5-0.6c-0.7,0-1.3,0.3-1.8,1c-0.4,0.7-0.7,1.6-0.7,2.8     c0,0.8,0.1,1.6,0.3,2.4c0.2,0.7,0.6,1.3,1,1.7c0.4,0.4,1,0.6,1.6,0.6C124.5,18.8,125.1,18.4,125.6,17.7z"></path>
			<path class="st2" d="M88.3,18.5c-0.2-0.2-0.4-0.5-0.7-0.9c-0.4-0.8-0.7-1.3-1-1.6c-0.2-0.3-0.5-0.6-0.9-0.8     c0.7-0.2,1.3-0.5,1.7-1c0.4-0.5,0.6-1.2,0.6-2c0-0.8-0.3-1.5-0.9-2c-0.6-0.5-1.5-0.8-2.7-0.8c-0.5,0-1.1,0-1.8,0     c-0.6,0-0.9,0-1.1,0c-0.6,0-1.3,0-2.2,0c-0.4,0-0.9,0-1.5,0c-0.7,0-1.2,0-1.6,0c0,0.3,0,0.6,0.1,0.9c0.3,0,0.5,0.1,0.6,0.2     c0.1,0.1,0.2,0.3,0.3,0.6c0.1,0.3,0.1,0.7,0.1,1.2l0,3.2c0,0.8,0,1.3-0.1,1.7c-0.1,0.4-0.2,0.7-0.4,0.9c-0.2,0.2-0.4,0.4-0.7,0.5     c-0.3,0.1-0.5,0.2-0.8,0.2c-0.7,0-1.3-0.2-1.6-0.7c-0.3-0.5-0.5-1.2-0.5-2.2l0-4c0-0.4,0-0.8,0.1-1c0.1-0.2,0.1-0.3,0.3-0.4     c0.1-0.1,0.3-0.1,0.7-0.2c0.1-0.2,0.1-0.5,0.1-0.9c-0.5,0-1.3,0-2.5,0c-0.9,0-1.5,0-1.9,0c0,0.4,0,0.7,0.1,0.9     c0.3,0,0.5,0.1,0.6,0.2c0.1,0.1,0.2,0.2,0.3,0.4c0.1,0.2,0.1,0.5,0.1,0.9l0,4.2c0,0.9,0.1,1.6,0.4,2.1c0.2,0.5,0.6,0.9,1.2,1.2     c0.6,0.3,1.3,0.4,2.3,0.4c1.1,0,2-0.3,2.6-0.8c0.3-0.3,0.6-0.8,0.7-1.3c0.1-0.5,0.2-1.2,0.2-2.2l0-3.3c0-0.5,0-0.9,0.1-1.1     c0.1-0.3,0.1-0.4,0.3-0.6c0.1-0.1,0.3-0.2,0.6-0.2c0,0,0.1,0,0.3,0c0.2,0,0.4,0.1,0.5,0.1c0.1,0.1,0.2,0.2,0.3,0.4     c0.1,0.2,0.1,0.5,0.1,0.9l0,5.4c0,0.4,0,0.7-0.1,0.9c-0.1,0.2-0.2,0.4-0.3,0.4c-0.1,0.1-0.4,0.1-0.6,0.2     c-0.1,0.2-0.1,0.6-0.1,0.9c0.6,0,1.3,0,2.1,0c0.9,0,1.7,0,2.3,0c0-0.5,0-0.8-0.1-0.9c-0.2,0-0.4-0.1-0.5-0.2     c-0.1-0.1-0.2-0.2-0.3-0.5c-0.1-0.2-0.1-0.6-0.1-1l0-1.7l0.4,0l0.4,0c0.3,0.3,0.6,0.6,0.8,0.9c0.2,0.3,0.4,0.7,0.7,1.3l0.2,0.4     c0.3,0.7,0.6,1.3,0.9,1.9c0.6-0.1,1.6-0.1,2.9-0.1c0.1-0.3,0.1-0.6,0.1-0.9C88.8,18.7,88.5,18.6,88.3,18.5z M85.1,13.9     c-0.4,0.4-1,0.5-1.6,0.5c-0.2,0-0.3,0-0.6-0.1l0-4c0.3-0.1,0.5-0.1,0.9-0.1c0.6,0,1.1,0.2,1.5,0.5c0.3,0.4,0.5,0.9,0.5,1.5     C85.7,13,85.5,13.5,85.1,13.9z"></path>
		</g>
	</g>
	<g>
		<path class="st2" d="M37.3,33c-0.2-1.6-0.6-3.4-1.3-5.4c-0.1-0.3-0.4-1.2-0.4-1.2l0.7-1.4c0.4-0.8,0.4-1.7,0-2.5    c-2.8-6.2-5.7-11.2-8.4-14.8c-2.3-2.9-5.6-5.5-5.8-5.6c-2.2-1.7-5.1-2.4-8.2-1.9c-0.7,0.1-1.4,0.3-2,0.5C11.6,0.7,11,1,10.9,1    l-0.3,0.2C10.3,1.4,10,1.6,9.7,1.8c-1.2,0.9-2.2,1.8-3,2.9C5.9,5.8,5.3,7.1,5,8.5C5,8.7,5,8.9,5,9.1c-0.1,2.7,0.9,5.4,1.6,6.8    c0,0.1,0.1,0.3,0.2,0.4C7,16.5,7,16.8,7,17c-0.1,0.4-0.2,0.9-0.3,1.3c-0.1,0.2,0,0.5,0.1,0.7C7.1,19.5,7.7,20.4,9,21    c0,0,0.7,0.9,0.8,1c-1.1,0.6-3,1.7-3.6,2.2c-0.6,0.5-0.8,0.6-1.2,1.1c0,0-0.5,0.4-1.1,1.1c-0.6,0.8-1.4,1.6-2,2.6    c-1.9,3-2.3,6.8-1,10c1.1,2.8,3.6,4.9,7.7,6.4c2.9,1.1,6.3,1.7,10.1,1.7l0.3,0c3.9,0,7.4-0.7,10.3-2c1.7-0.7,3.3-1.7,4.6-2.9    c2.3-2,3.5-4.1,3.6-6.6C37.5,34.8,37.4,33.9,37.3,33z"></path>
		<path class="st0" d="M36.3,33.1c-0.2-1.8-0.7-3.6-1.3-5.3c-0.1-0.3-0.2-0.6-0.3-0.9l-0.1-0.2c-0.1-0.1-0.1-0.3-0.2-0.4l0.9-1.8    c0.2-0.5,0.3-1.1,0-1.6c-2.8-6.1-5.6-11.1-8.3-14.6c-2.2-2.9-5.4-5.3-5.6-5.5c-2-1.5-4.6-2.2-7.4-1.7c-0.6,0.1-1.3,0.3-1.9,0.4    c-0.2,0.1-1,0.5-1,0.5c-0.3,0.2-0.5,0.3-0.8,0.5C9.2,3.4,8.2,4.3,7.5,5.3C6.8,6.3,6.3,7.5,6,8.6c-0.1,0.5-0.3,3.6,1.3,5.9    c0.2,0.4,1.1,1.9,0.9,2.5c-0.1,0.4-0.3,0.8-0.4,1.1c-0.1,0.2,0,0.4,0.1,0.5c0.2,0.3,0.7,0.9,1.7,1.2l1,1.1c0.1,0.1,0.6,1,1.1,1.4    C9.9,23,8.1,24,6.8,25c-0.4,0.3-0.7,0.6-1.2,1c0,0,0,0,0,0c-0.3,0.3-0.7,0.7-1,1c0,0,0,0,0,0c-0.6,0.7-1.3,1.5-1.9,2.4    c-1.7,2.7-2.1,6.1-0.9,9.1c1.2,3,4.3,4.7,7.2,5.9c2.8,1.1,6.1,1.6,9.7,1.6c0.1,0,0.2,0,0.3,0c3.8,0,7.1-0.7,10-1.9    c1.6-0.7,3.1-1.6,4.4-2.7c1.8-1.6,3.1-3.4,3.2-5.9C36.5,34.8,36.4,34,36.3,33.1z M31.7,39.9c-1.1,0.9-2.4,1.7-3.8,2.4    c-2.6,1.1-5.6,1.7-9.1,1.7c-3.5,0-6.6-0.5-9.2-1.5c-1.5-0.6-2.8-1.3-3.9-2.2c-7-5.4,1.1-14.3,7-16.2c0.9-0.3,1.8-0.5,2.7-0.6    c0.7-0.1,1.7-0.2,2.7-0.2l0.6,0l0.4-0.5c0.1-0.1,0.1-0.2,0.2-0.3c0.1-0.1,0.3-0.3,0.4-0.4c0.3-0.2,0.5-0.4,0.8-0.5    c0.6-0.3,1.2-0.5,1.8-0.5c1.3-0.1,3,0.4,3.8,1.6c0.9,1.3,0.7,2.7,0.2,4.1c-0.1,0.1-0.1,0.3-0.2,0.4c-0.4,0.3-0.8,0.9-1.6,0.9    c0,0-0.4,0.9-1.4,1.1c-0.4,0-0.9,0-1,0c-0.2,0-0.4-0.1-0.4-0.1l-1.2-0.3c0,0.6-0.4,1-0.6,1.5c-0.1,0.4-0.3,0.7-0.4,0.9    c0,0,0,0,0,0.1c0,0.1-0.1,0.1-0.1,0.2c-0.1,0.2-0.1,0.3-0.1,0.3c0.2,0.1,0.4,0.4,0.5,0.7c0,0,0,0,0,0.1c0.1,0.6,1.2,1.4,1.3,1.4    c0.1,0,0.3,0,0.4,0c0.3,0,0.6,0.1,0.8,0.3c0.1,0.1,0.3,0.2,0.3,0.3c0.1,0.1,0.1,0.2,0.1,0.2c0,0,0,0,0,0c0,0,0,0,0,0c0,0,0,0,0,0    c0,0,0,0,0,0c0,0.2-0.2,1-2.1,0.5c-1.2-0.3-2.3-0.7-3.1-1.2c0,0,0,0,0,0h0c-0.3-0.1-0.5-0.4-0.8-0.7c-0.6-0.7-1.1-1.6-1.3-2    c0-0.1-0.1-0.2-0.1-0.2c-0.1,0.9,0.5,2.3,0.6,2.6c0,0,0,0,0,0.1c0,0,0,0,0,0h0c-2,1.3-3.1,2.4-3.1,2.4c0.2-0.1,4.1-1.3,4.1-1.3    c0.3,0.3,0.7,0.5,1,0.7c0,0,3.6,1.8,5.4-0.1c0.1-0.1,0.1-0.2,0.2-0.3c0.1-0.1,0.1-0.3,0.1-0.5c0-0.4-0.2-0.6-0.4-0.8    c-0.2-0.2-0.3-0.3-0.5-0.4c-0.3-0.3-0.8-0.5-1.2-0.6c-0.2,0-0.5-0.1-0.7-0.1c0,0-0.1,0-0.1,0c0,0,0,0,0-0.1    c-0.1-0.2-0.2-0.4-0.3-0.6c-0.1-0.1-0.2-0.2-0.3-0.3c0.1-0.1,0.1-0.1,0.2-0.2c0.3-0.5,0.6-0.9,0.8-1.3c0.1,0,0.1,0.1,0.2,0.1    c0.3,0.1,0.7,0.2,1,0.2c0.4,0,0.9-0.1,1.1-0.2c4.6-0.8,5.3-5.6,4.3-8c-1.4-3.1-5.1-3.9-8-2.6c-0.4,0.2-0.8,0.4-1.2,0.7    c-0.1,0.1-0.6,0.5-0.6,0.6c0,0-1.8,0-2.6,0.1c-0.5,0.1-1.1,0.2-1.5,0c-0.5-0.3-1.3-0.8-1.5-1.3l-0.9-1.4l-0.4,0    c-0.3,0-0.5-0.2-0.7-0.3c-0.1-0.1-0.3-0.3-0.3-0.3c0.3-0.5,0.3-1.1,0.3-1.4c0-0.5-0.1-1-0.3-1.6c-0.2-0.4-0.4-0.9-0.6-1.4    c-0.2-0.4-0.5-0.8-0.7-1.2c-0.2-0.4-0.4-1.5-0.4-1.6l0,0c2.2,2.3,4.5,4.3,7.1,6l0.9,0.7l-0.1-0.1l0.8,0.5L12.2,13    c-1.5-1.5-2.7-3.3-3.6-5.2c0.2-0.8,0.2-0.4,0.7-1.2c0.6-0.8,1.4-1.5,2.3-2.2C11.8,4.2,12,4.1,12.2,4c0,0,0.5-0.2,0.6-0.3    c0.5-0.2,1-0.3,1.5-0.4c2.2-0.4,4.5,0,5.9,1.2c0.2,0.1,2.9,2.4,5,5.1c2.6,3.4,5.3,8.1,8,14.1l-3.9,8.1l-0.1,0.2l0.1-0.2    c0,0,3.3-3.9,3.3-3.9c0.5,1.3,0.8,2.6,1.1,3.8C34.5,35,34.4,37.6,31.7,39.9z"></path>
	</g>
</g>
</svg>
