<?xml version="1.0" encoding="UTF-8"?>
<svg xmlns="http://www.w3.org/2000/svg" viewBox="0 0 492.47 153.69">
  <defs>
    <style>.cls-1{fill:#fa3645;}</style>
  </defs>
  <title>Recurso 1</title>
  <g id="Capa_2">
    <g id="Layer_1">
      <path class="cls-1" d="M259.55,38.61a10,10,0,1,1-10-10A10,10,0,0,1,259.55,38.61ZM218.32,58.77v2.46s-4.77-6.15-14.92-6.15c-16.77,0-29.85,12.77-29.85,30.46,0,17.54,12.92,30.46,29.85,30.46,10.31,0,14.92-6.31,14.92-6.31v2.62a2.1,2.1,0,0,0,2.15,2.15h12.46V56.61H220.47A2.2,2.2,0,0,0,218.32,58.77Zm0,37.08a15.29,15.29,0,0,1-12.46,6.31c-9.85,0-17.38-6.15-17.38-16.62S196,68.92,205.86,68.92a15.71,15.71,0,0,1,12.46,6.31Zm23.85-39.23h14.77v57.85H242.16Zm220.61-1.54c-10.15,0-14.92,6.15-14.92,6.15V28.77H433.08v85.69h12.46a2.2,2.2,0,0,0,2.15-2.15v-2.62h0s4.77,6.31,14.92,6.31c16.77,0,29.85-12.92,29.85-30.46S479.39,55.08,462.78,55.08ZM460.31,102a15.07,15.07,0,0,1-12.46-6.31V75.08a16.69,16.69,0,0,1,12.46-6.31c9.85,0,17.38,6.15,17.38,16.62S470.16,102,460.31,102ZM425.39,80.15v34.46H410.62V81.84c0-9.54-3.08-13.38-11.38-13.38a16.51,16.51,0,0,0-12,5.69v40.31H372.47V56.61h11.69a2.2,2.2,0,0,1,2.15,2.15v2.46c4.31-4.46,10-6.15,15.69-6.15q9.69,0,16.15,5.54C423.39,64.92,425.39,70.46,425.39,80.15ZM336.62,55.08c-10.15,0-14.92,6.15-14.92,6.15V28.77H306.93v85.69h12.46a2.2,2.2,0,0,0,2.15-2.15v-2.62h0s4.77,6.31,14.92,6.31c16.77,0,29.85-12.92,29.85-30.46C366.47,68,353.39,55.08,336.62,55.08ZM334.16,102a15.07,15.07,0,0,1-12.46-6.31V75.08a16.69,16.69,0,0,1,12.46-6.31c9.85,0,17.38,6.15,17.38,16.62S344,102,334.16,102Zm-40-46.92a23.55,23.55,0,0,1,6.77.77V69.54s-12.31-4.15-20,4.62v40.46H266.16v-58h12.46a2.2,2.2,0,0,1,2.15,2.15v2.46A20.21,20.21,0,0,1,294.16,55.08ZM140.78,109.23c-.77-1.85-1.54-3.85-2.31-5.54-1.23-2.77-2.46-5.38-3.54-7.85l-.15-.15c-10.62-23.08-22-46.46-34-69.54l-.46-.92c-1.23-2.31-2.46-4.77-3.69-7.23a44.22,44.22,0,0,0-5.54-8.46A24.85,24.85,0,0,0,71.55,0,25.82,25.82,0,0,0,51.86,9.23a53,53,0,0,0-5.54,8.46c-1.23,2.46-2.46,4.92-3.69,7.23l-.46.92c-11.85,23.08-23.38,46.46-34,69.54L8,95.69c-1.08,2.46-2.31,5.08-3.54,7.85q-1.15,2.54-2.31,5.54A34.56,34.56,0,0,0,.32,125.69a32.7,32.7,0,0,0,20,25.54,31.59,31.59,0,0,0,12.46,2.46,35,35,0,0,0,4-.31,40.65,40.65,0,0,0,15.38-5.23c6.31-3.54,12.31-8.62,19.08-16,6.77,7.38,12.92,12.46,19.08,16a40.65,40.65,0,0,0,15.38,5.23,35,35,0,0,0,4,.31,31.06,31.06,0,0,0,12.46-2.46,32.63,32.63,0,0,0,20-25.54C143.4,120.31,142.78,114.92,140.78,109.23Zm-69.38,8C63.09,106.77,57.7,96.92,55.86,88.61a24.82,24.82,0,0,1-.46-9.38,14.93,14.93,0,0,1,2.46-6.46A16.33,16.33,0,0,1,71.4,66c5.69,0,10.77,2.46,13.54,6.77a14.93,14.93,0,0,1,2.46,6.46,24.7,24.7,0,0,1-.46,9.38C85.09,96.77,79.7,106.61,71.4,117.23Zm61.38,7.23a22.86,22.86,0,0,1-14,18A23.29,23.29,0,0,1,107.09,144a30.25,30.25,0,0,1-11.69-4c-5.54-3.08-11.08-7.85-17.54-14.92,10.15-12.46,16.31-23.85,18.62-34A38.56,38.56,0,0,0,97.24,78a25,25,0,0,0-4.15-10.46C88.32,60.61,80.32,56.61,71.4,56.61A26.32,26.32,0,0,0,49.7,67.54,25,25,0,0,0,45.55,78a31.94,31.94,0,0,0,.77,13.08c2.31,10.15,8.62,21.69,18.62,34.15-6.31,7.08-12,11.85-17.54,14.92a30.25,30.25,0,0,1-11.69,4A24.61,24.61,0,0,1,24,142.61a22.86,22.86,0,0,1-14-18,25.47,25.47,0,0,1,1.38-12c.46-1.54,1.23-3.08,2-4.92,1.08-2.46,2.31-5.08,3.54-7.69l.15-.31c10.62-22.92,22-46.31,33.85-69.08l.46-.92c1.23-2.31,2.46-4.77,3.69-7.08a33.79,33.79,0,0,1,4.31-6.77,16.15,16.15,0,0,1,24.62,0,33.79,33.79,0,0,1,4.31,6.77c1.23,2.31,2.46,4.77,3.69,7.08l.46.92c11.69,22.92,23.08,46.31,33.69,69.23V100c1.23,2.46,2.31,5.23,3.54,7.69.77,1.85,1.54,3.38,2,4.92A26,26,0,0,1,132.78,124.46Z"></path>
    </g>
  </g>
</svg>
