<?xml version="1.0" encoding="UTF-8"?>
<svg xmlns="http://www.w3.org/2000/svg" viewBox="0 0 578.84 120.86">
  <title>Recurso 1</title>
  <g id="Capa_2">
    <g id="Capa_1-2">
      <g id="Boostrap3-grid-system-layouts">
        <g id="Artboard-8-Copy">
          <path id="logo" d="M91,2.89V69.55q.12,16.61-7.81,24.11t-25.09,7.5Q41,101.17,33,93.66T25.21,69.55V.06H3Q0-.06,0,2.89V70.66q.37,27.55,16.11,39.05t41.94,11.13q26.2.37,42-11.13t16.17-39.05V.06H94q-3-.12-3,2.83ZM413.53,19.37a3.75,3.75,0,0,0,2.09-.49,3.71,3.71,0,0,0,1.23-1.48l6.4-16q.49-1.35-1-1.35H332.72q-6.15,0-8.86,2T321.15,8.3V111.74a6.55,6.55,0,0,0,2,5.29q2,1.72,6.83,1.72h83.52a3.75,3.75,0,0,0,2.09-.49,3.71,3.71,0,0,0,1.23-1.48l6.4-15.87q.49-1.48-1-1.48H346v-21q-.12-5.41,3.32-8t11.44-2.58h33.09a3.75,3.75,0,0,0,2.09-.49,3.71,3.71,0,0,0,1.23-1.48l6.15-15.25q.49-1.48-1-1.48H346V19.37ZM255.84,56.15a23.23,23.23,0,0,0,10.52-10.58,35,35,0,0,0,3.26-15.37Q269,11,256.15,5.23T226.07.06H175.52q-6.27,0-9,2T164,8.3V111.74a6.55,6.55,0,0,0,2,5.29q2,1.72,6.83,1.72h62.24q18,.12,28.9-7.56t11.32-25.28A36.58,36.58,0,0,0,270.54,67Q265.8,59,255.84,56.15Zm-67.4-37.27h39.48q9.59,0,13.22,3.75t3.51,11.5q.12,7.75-3.51,11.56t-13.22,3.81H188.44Zm44,81.06h-44v-22q-.12-5.41,3.38-8t11.5-2.58h29.15q10.33,0,14.21,4.06t3.63,12.3q.25,8.12-3.63,12.18t-14.21,4.06Zm346.12,16.73L551.9,71a31.05,31.05,0,0,0,17-10.15q6.77-7.81,7-24.29-.25-21.16-12.67-29T528.41.06h-50.8q-6.15,0-8.86,2T466,8.3V115.93q0,2.83,3,2.83h21.65V84.07q-.12-5.41,3.38-8t11.5-2.58h22l24,43.3a3.71,3.71,0,0,0,1.23,1.48,3.75,3.75,0,0,0,2.09.49h22.63q1.11-.12,1.29-.8a1.6,1.6,0,0,0-.18-1.29ZM532.1,55H490.65V19.12H532.1q11.32,0,15.19,4.49t3.63,13.47q.25,9.1-3.63,13.53T532.1,55Z"></path>
        </g>
      </g>
    </g>
  </g>
</svg>
