<?xml version="1.0" encoding="UTF-8"?>
<svg xmlns="http://www.w3.org/2000/svg" viewBox="0 0 1440 47.25">
  <defs>
    <style>.cls-1{fill:#f3a1dc;}</style>
  </defs>
  <title>Recurso 2</title>
  <g id="Capa_2">
    <g id="Capa_1-2">
      <path class="cls-1" d="M1440,0q-60.88,0-110.44,10.4c-47,9.87-95.22,33.73-141.48,33.73-55.29,0-97.21-18.46-143.56-33.73Q1013.1.06,959.6,0H959Q898.56.05,849.32,10.4c-47,9.87-95.08,33.73-141.28,33.73-55.21,0-97.07-18.46-143.35-33.73Q533.44.1,480.3,0h-1Q419.09.09,370,10.4c-47,9.87-95.08,33.73-141.28,33.73-55.21,0-97.07-18.46-143.35-33.73Q53.85,0,0,0V47.25H1440V0Z"></path>
    </g>
  </g>
</svg>
