<?xml version="1.0" encoding="UTF-8"?>
<!-- Generator: Adobe Illustrator 20.1.0, SVG Export Plug-In . SVG Version: 6.00 Build 0)  -->
<svg xmlns="http://www.w3.org/2000/svg" xmlns:xlink="http://www.w3.org/1999/xlink" id="Capa_1" x="0px" y="0px" viewBox="0 0 612 612" style="enable-background:new 0 0 612 612;" xml:space="preserve">
<style type="text/css">
	.st0{fill:#333333;}
</style>
<g>
	<g>
		<path class="st0" d="M374.8,173.5L256,167.2c-1.4-0.1-2.8,0.2-4,0.9l-65.5,35.3c-2,1.1-3.4,3-3.8,5.2c-0.4,2.2,0.2,4.5,1.6,6.3    l33.7,40.7c0.3-0.2,0.7-0.5,1-0.7L374.8,173.5z"></path>
		<path class="st0" d="M609.2,131.3c-0.1-0.1-0.1-0.3-0.2-0.4c-4.7-8.8-15.3-19.3-39.2-19.3c-25.1,0-52.4,11.4-53.6,11.9    c-66.2,26.4-378,190.4-378,190.4l-74.6-40.2c-2.2-1.2-4.9-1.2-7.1,0L4.1,301.2c-2.2,1.2-3.7,3.3-4,5.8c-0.3,2.5,0.7,4.9,2.6,6.6    l128.4,111c2.3,2,5.7,2.4,8.4,1l125.4-65.4l19,133.7c0.3,2.4,1.9,4.6,4.1,5.7c1.1,0.5,2.2,0.8,3.4,0.8c1.2,0,2.5-0.3,3.6-0.9    c13.3-7.2,21.7-11.7,29.7-16.1c8.2-4.5,16.7-9.1,30.4-16.5c1.5-0.8,2.6-2,3.3-3.6l89.3-198.6l91.8-47.9    C582.2,195.1,623.1,161.2,609.2,131.3z"></path>
	</g>
</g>
</svg>
