2021-10-21 10:16:49.931 ERROR 13904 --- [main] com.example.demo.controlador             : un mensaje de error
2021-10-21 10:16:49.945 ERROR 13904 --- [main] com.example.demo.controlador             : un mensaje de error
2021-10-21 10:16:49.945 ERROR 13904 --- [main] com.example.demo.controlador             : un mensaje de error
2021-10-21 10:16:49.945 ERROR 13904 --- [main] com.example.demo.controlador             : un mensaje de error
2021-10-21 10:16:49.945 ERROR 13904 --- [main] com.example.demo.controlador             : un mensaje de error
2021-10-21 10:16:49.945 ERROR 13904 --- [main] com.example.demo.controlador             : un mensaje de error
2021-10-21 10:16:49.945 ERROR 13904 --- [main] com.example.demo.controlador             : un mensaje de error
2021-10-21 10:16:49.945 ERROR 13904 --- [main] com.example.demo.controlador             : un mensaje de error
2021-10-21 10:16:49.945 ERROR 13904 --- [main] com.example.demo.controlador             : un mensaje de error
2021-10-21 10:16:49.945 ERROR 13904 --- [main] com.example.demo.controlador             : un mensaje de error
2021-10-21 10:16:49.945 ERROR 13904 --- [main] com.example.demo.controlador             : un mensaje de error
2021-10-21 10:16:49.945 ERROR 13904 --- [main] com.example.demo.controlador             : un mensaje de error
2021-10-21 10:16:49.945 ERROR 13904 --- [main] com.example.demo.controlador             : un mensaje de error
2021-10-21 10:16:49.945 ERROR 13904 --- [main] com.example.demo.controlador             : un mensaje de error
2021-10-21 10:16:49.945 ERROR 13904 --- [main] com.example.demo.controlador             : un mensaje de error
2021-10-21 10:16:49.945 ERROR 13904 --- [main] com.example.demo.controlador             : un mensaje de error
2021-10-21 10:16:49.945 ERROR 13904 --- [main] com.example.demo.controlador             : un mensaje de error
2021-10-21 10:16:49.945 ERROR 13904 --- [main] com.example.demo.controlador             : un mensaje de error
2021-10-21 10:16:49.945 ERROR 13904 --- [main] com.example.demo.controlador             : un mensaje de error
2021-10-21 10:16:49.945 ERROR 13904 --- [main] com.example.demo.controlador             : un mensaje de error
2021-10-21 10:16:49.945 ERROR 13904 --- [main] com.example.demo.controlador             : un mensaje de error
2021-10-21 10:16:49.945 ERROR 13904 --- [main] com.example.demo.controlador             : un mensaje de error
2021-10-21 10:16:49.945 ERROR 13904 --- [main] com.example.demo.controlador             : un mensaje de error
2021-10-21 10:16:49.945 ERROR 13904 --- [main] com.example.demo.controlador             : un mensaje de error
2021-10-21 10:16:49.945 ERROR 13904 --- [main] com.example.demo.controlador             : un mensaje de error
2021-10-21 10:16:49.945 ERROR 13904 --- [main] com.example.demo.controlador             : un mensaje de error
2021-10-21 10:16:49.945 ERROR 13904 --- [main] com.example.demo.controlador             : un mensaje de error
2021-10-21 10:16:49.945 ERROR 13904 --- [main] com.example.demo.controlador             : un mensaje de error
2021-10-21 10:16:49.945 ERROR 13904 --- [main] com.example.demo.controlador             : un mensaje de error
2021-10-21 10:16:49.945 ERROR 13904 --- [main] com.example.demo.controlador             : un mensaje de error
2021-10-21 10:16:49.945 ERROR 13904 --- [main] com.example.demo.controlador             : un mensaje de error
2021-10-21 10:16:49.945 ERROR 13904 --- [main] com.example.demo.controlador             : un mensaje de error
2021-10-21 10:16:49.945 ERROR 13904 --- [main] com.example.demo.controlador             : un mensaje de error
2021-10-21 10:16:49.945 ERROR 13904 --- [main] com.example.demo.controlador             : un mensaje de error
2021-10-21 10:16:49.945 ERROR 13904 --- [main] com.example.demo.controlador             : un mensaje de error
2021-10-21 10:16:49.945 ERROR 13904 --- [main] com.example.demo.controlador             : un mensaje de error
2021-10-21 10:16:49.945 ERROR 13904 --- [main] com.example.demo.controlador             : un mensaje de error
2021-10-21 10:16:49.945 ERROR 13904 --- [main] com.example.demo.controlador             : un mensaje de error
2021-10-21 10:16:49.945 ERROR 13904 --- [main] com.example.demo.controlador             : un mensaje de error
2021-10-21 10:16:49.945 ERROR 13904 --- [main] com.example.demo.controlador             : un mensaje de error
2021-10-21 10:16:49.945 ERROR 13904 --- [main] com.example.demo.controlador             : un mensaje de error
2021-10-21 10:16:49.945 ERROR 13904 --- [main] com.example.demo.controlador             : un mensaje de error
2021-10-21 10:16:49.945 ERROR 13904 --- [main] com.example.demo.controlador             : un mensaje de error
2021-10-21 10:16:49.945 ERROR 13904 --- [main] com.example.demo.controlador             : un mensaje de error
2021-10-21 10:16:49.945 ERROR 13904 --- [main] com.example.demo.controlador             : un mensaje de error
2021-10-21 10:16:49.945 ERROR 13904 --- [main] com.example.demo.controlador             : un mensaje de error
2021-10-21 10:16:49.945 ERROR 13904 --- [main] com.example.demo.controlador             : un mensaje de error
2021-10-21 10:16:49.945 ERROR 13904 --- [main] com.example.demo.controlador             : un mensaje de error
2021-10-21 10:16:49.945 ERROR 13904 --- [main] com.example.demo.controlador             : un mensaje de error
2021-10-21 10:16:49.945 ERROR 13904 --- [main] com.example.demo.controlador             : un mensaje de error
2021-10-21 10:16:49.945 ERROR 13904 --- [main] com.example.demo.controlador             : un mensaje de error
2021-10-21 10:16:49.945 ERROR 13904 --- [main] com.example.demo.controlador             : un mensaje de error
2021-10-21 10:16:49.945 ERROR 13904 --- [main] com.example.demo.controlador             : un mensaje de error
2021-10-21 10:16:49.945 ERROR 13904 --- [main] com.example.demo.controlador             : un mensaje de error
2021-10-21 10:16:49.945 ERROR 13904 --- [main] com.example.demo.controlador             : un mensaje de error
2021-10-21 10:16:49.945 ERROR 13904 --- [main] com.example.demo.controlador             : un mensaje de error
2021-10-21 10:16:49.945 ERROR 13904 --- [main] com.example.demo.controlador             : un mensaje de error
2021-10-21 10:16:49.945 ERROR 13904 --- [main] com.example.demo.controlador             : un mensaje de error
2021-10-21 10:16:49.945 ERROR 13904 --- [main] com.example.demo.controlador             : un mensaje de error
2021-10-21 10:16:49.945 ERROR 13904 --- [main] com.example.demo.controlador             : un mensaje de error
2021-10-21 10:16:49.945 ERROR 13904 --- [main] com.example.demo.controlador             : un mensaje de error
2021-10-21 10:16:49.945 ERROR 13904 --- [main] com.example.demo.controlador             : un mensaje de error
2021-10-21 10:16:49.945 ERROR 13904 --- [main] com.example.demo.controlador             : un mensaje de error
2021-10-21 10:16:49.945 ERROR 13904 --- [main] com.example.demo.controlador             : un mensaje de error
2021-10-21 10:16:49.945 ERROR 13904 --- [main] com.example.demo.controlador             : un mensaje de error
2021-10-21 10:16:49.945 ERROR 13904 --- [main] com.example.demo.controlador             : un mensaje de error
2021-10-21 10:16:49.945 ERROR 13904 --- [main] com.example.demo.controlador             : un mensaje de error
2021-10-21 10:16:49.945 ERROR 13904 --- [main] com.example.demo.controlador             : un mensaje de error
2021-10-21 10:16:49.945 ERROR 13904 --- [main] com.example.demo.controlador             : un mensaje de error
2021-10-21 10:16:49.945 ERROR 13904 --- [main] com.example.demo.controlador             : un mensaje de error
2021-10-21 10:16:49.945 ERROR 13904 --- [main] com.example.demo.controlador             : un mensaje de error
2021-10-21 10:16:49.945 ERROR 13904 --- [main] com.example.demo.controlador             : un mensaje de error
2021-10-21 10:16:49.945 ERROR 13904 --- [main] com.example.demo.controlador             : un mensaje de error
2021-10-21 10:16:49.945 ERROR 13904 --- [main] com.example.demo.controlador             : un mensaje de error
2021-10-21 10:16:49.945 ERROR 13904 --- [main] com.example.demo.controlador             : un mensaje de error
2021-10-21 10:16:49.945 ERROR 13904 --- [main] com.example.demo.controlador             : un mensaje de error
2021-10-21 10:16:49.945 ERROR 13904 --- [main] com.example.demo.controlador             : un mensaje de error
2021-10-21 10:16:49.945 ERROR 13904 --- [main] com.example.demo.controlador             : un mensaje de error
2021-10-21 10:16:49.945 ERROR 13904 --- [main] com.example.demo.controlador             : un mensaje de error
2021-10-21 10:16:49.945 ERROR 13904 --- [main] com.example.demo.controlador             : un mensaje de error
2021-10-21 10:16:49.945 ERROR 13904 --- [main] com.example.demo.controlador             : un mensaje de error
2021-10-21 10:16:49.945 ERROR 13904 --- [main] com.example.demo.controlador             : un mensaje de error
2021-10-21 10:16:49.945 ERROR 13904 --- [main] com.example.demo.controlador             : un mensaje de error
2021-10-21 10:16:49.945 ERROR 13904 --- [main] com.example.demo.controlador             : un mensaje de error
2021-10-21 10:16:49.945 ERROR 13904 --- [main] com.example.demo.controlador             : un mensaje de error
2021-10-21 10:16:49.945 ERROR 13904 --- [main] com.example.demo.controlador             : un mensaje de error
2021-10-21 10:16:49.945 ERROR 13904 --- [main] com.example.demo.controlador             : un mensaje de error
2021-10-21 10:16:49.945 ERROR 13904 --- [main] com.example.demo.controlador             : un mensaje de error
2021-10-21 10:16:49.945 ERROR 13904 --- [main] com.example.demo.controlador             : un mensaje de error
2021-10-21 10:16:49.945 ERROR 13904 --- [main] com.example.demo.controlador             : un mensaje de error
2021-10-21 10:16:49.945 ERROR 13904 --- [main] com.example.demo.controlador             : un mensaje de error
2021-10-21 10:16:49.945 ERROR 13904 --- [main] com.example.demo.controlador             : un mensaje de error
2021-10-21 10:16:49.945 ERROR 13904 --- [main] com.example.demo.controlador             : un mensaje de error
2021-10-21 10:16:49.945 ERROR 13904 --- [main] com.example.demo.controlador             : un mensaje de error
2021-10-21 10:16:49.945 ERROR 13904 --- [main] com.example.demo.controlador             : un mensaje de error
2021-10-21 10:16:49.945 ERROR 13904 --- [main] com.example.demo.controlador             : un mensaje de error
2021-10-21 10:16:49.945 ERROR 13904 --- [main] com.example.demo.controlador             : un mensaje de error
2021-10-21 10:16:49.945 ERROR 13904 --- [main] com.example.demo.controlador             : un mensaje de error
2021-10-21 10:16:49.945 ERROR 13904 --- [main] com.example.demo.controlador             : un mensaje de error
2021-10-21 10:16:49.945 ERROR 13904 --- [main] com.example.demo.controlador             : un mensaje de error
2021-10-21 10:16:49.945 ERROR 13904 --- [main] com.example.demo.controlador             : un mensaje de error
2021-10-21 10:16:49.945 ERROR 13904 --- [main] com.example.demo.controlador             : un mensaje de error
2021-10-21 10:16:49.945 ERROR 13904 --- [main] com.example.demo.controlador             : un mensaje de error
2021-10-21 10:16:49.945 ERROR 13904 --- [main] com.example.demo.controlador             : un mensaje de error
2021-10-21 10:16:49.945 ERROR 13904 --- [main] com.example.demo.controlador             : un mensaje de error
2021-10-21 10:16:49.945 ERROR 13904 --- [main] com.example.demo.controlador             : un mensaje de error
2021-10-21 10:16:49.945 ERROR 13904 --- [main] com.example.demo.controlador             : un mensaje de error
2021-10-21 10:16:49.945 ERROR 13904 --- [main] com.example.demo.controlador             : un mensaje de error
2021-10-21 10:16:49.945 ERROR 13904 --- [main] com.example.demo.controlador             : un mensaje de error
2021-10-21 10:16:49.945 ERROR 13904 --- [main] com.example.demo.controlador             : un mensaje de error
2021-10-21 10:16:49.945 ERROR 13904 --- [main] com.example.demo.controlador             : un mensaje de error
2021-10-21 10:16:49.945 ERROR 13904 --- [main] com.example.demo.controlador             : un mensaje de error
2021-10-21 10:16:49.945 ERROR 13904 --- [main] com.example.demo.controlador             : un mensaje de error
2021-10-21 10:16:49.945 ERROR 13904 --- [main] com.example.demo.controlador             : un mensaje de error
2021-10-21 10:16:49.945 ERROR 13904 --- [main] com.example.demo.controlador             : un mensaje de error
2021-10-21 10:16:49.945 ERROR 13904 --- [main] com.example.demo.controlador             : un mensaje de error
2021-10-21 10:16:49.945 ERROR 13904 --- [main] com.example.demo.controlador             : un mensaje de error
2021-10-21 10:16:49.945 ERROR 13904 --- [main] com.example.demo.controlador             : un mensaje de error
2021-10-21 10:16:49.945 ERROR 13904 --- [main] com.example.demo.controlador             : un mensaje de error
2021-10-21 10:16:49.945 ERROR 13904 --- [main] com.example.demo.controlador             : un mensaje de error
2021-10-21 10:16:49.945 ERROR 13904 --- [main] com.example.demo.controlador             : un mensaje de error
2021-10-21 10:16:49.945 ERROR 13904 --- [main] com.example.demo.controlador             : un mensaje de error
2021-10-21 10:16:49.945 ERROR 13904 --- [main] com.example.demo.controlador             : un mensaje de error
2021-10-21 10:16:49.945 ERROR 13904 --- [main] com.example.demo.controlador             : un mensaje de error
2021-10-21 10:16:49.945 ERROR 13904 --- [main] com.example.demo.controlador             : un mensaje de error
2021-10-21 10:16:49.945 ERROR 13904 --- [main] com.example.demo.controlador             : un mensaje de error
2021-10-21 10:16:49.945 ERROR 13904 --- [main] com.example.demo.controlador             : un mensaje de error
2021-10-21 10:16:49.945 ERROR 13904 --- [main] com.example.demo.controlador             : un mensaje de error
2021-10-21 10:16:49.945 ERROR 13904 --- [main] com.example.demo.controlador             : un mensaje de error
2021-10-21 10:16:49.945 ERROR 13904 --- [main] com.example.demo.controlador             : un mensaje de error
2021-10-21 10:16:49.945 ERROR 13904 --- [main] com.example.demo.controlador             : un mensaje de error
2021-10-21 10:16:49.945 ERROR 13904 --- [main] com.example.demo.controlador             : un mensaje de error
2021-10-21 10:16:49.945 ERROR 13904 --- [main] com.example.demo.controlador             : un mensaje de error
2021-10-21 10:16:49.945 ERROR 13904 --- [main] com.example.demo.controlador             : un mensaje de error
2021-10-21 10:16:49.945 ERROR 13904 --- [main] com.example.demo.controlador             : un mensaje de error
2021-10-21 10:16:49.945 ERROR 13904 --- [main] com.example.demo.controlador             : un mensaje de error
2021-10-21 10:16:49.945 ERROR 13904 --- [main] com.example.demo.controlador             : un mensaje de error
2021-10-21 10:16:49.945 ERROR 13904 --- [main] com.example.demo.controlador             : un mensaje de error
2021-10-21 10:16:49.945 ERROR 13904 --- [main] com.example.demo.controlador             : un mensaje de error
2021-10-21 10:16:49.945 ERROR 13904 --- [main] com.example.demo.controlador             : un mensaje de error
2021-10-21 10:16:49.945 ERROR 13904 --- [main] com.example.demo.controlador             : un mensaje de error
2021-10-21 10:16:49.945 ERROR 13904 --- [main] com.example.demo.controlador             : un mensaje de error
2021-10-21 10:16:49.945 ERROR 13904 --- [main] com.example.demo.controlador             : un mensaje de error
2021-10-21 10:16:49.945 ERROR 13904 --- [main] com.example.demo.controlador             : un mensaje de error
2021-10-21 10:16:49.945 ERROR 13904 --- [main] com.example.demo.controlador             : un mensaje de error
2021-10-21 10:16:49.945 ERROR 13904 --- [main] com.example.demo.controlador             : un mensaje de error
2021-10-21 10:16:49.945 ERROR 13904 --- [main] com.example.demo.controlador             : un mensaje de error
2021-10-21 10:16:49.945 ERROR 13904 --- [main] com.example.demo.controlador             : un mensaje de error
2021-10-21 10:16:49.945 ERROR 13904 --- [main] com.example.demo.controlador             : un mensaje de error
2021-10-21 10:16:49.945 ERROR 13904 --- [main] com.example.demo.controlador             : un mensaje de error
2021-10-21 10:16:49.945 ERROR 13904 --- [main] com.example.demo.controlador             : un mensaje de error
2021-10-21 10:16:49.945 ERROR 13904 --- [main] com.example.demo.controlador             : un mensaje de error
2021-10-21 10:16:49.945 ERROR 13904 --- [main] com.example.demo.controlador             : un mensaje de error
2021-10-21 10:16:49.945 ERROR 13904 --- [main] com.example.demo.controlador             : un mensaje de error
2021-10-21 10:16:49.945 ERROR 13904 --- [main] com.example.demo.controlador             : un mensaje de error
2021-10-21 10:16:49.945 ERROR 13904 --- [main] com.example.demo.controlador             : un mensaje de error
2021-10-21 10:16:49.945 ERROR 13904 --- [main] com.example.demo.controlador             : un mensaje de error
2021-10-21 10:16:49.945 ERROR 13904 --- [main] com.example.demo.controlador             : un mensaje de error
2021-10-21 10:16:49.962 ERROR 13904 --- [main] com.example.demo.controlador             : un mensaje de error
2021-10-21 10:16:49.963 ERROR 13904 --- [main] com.example.demo.controlador             : un mensaje de error
2021-10-21 10:16:49.964 ERROR 13904 --- [main] com.example.demo.controlador             : un mensaje de error
2021-10-21 10:16:49.964 ERROR 13904 --- [main] com.example.demo.controlador             : un mensaje de error
2021-10-21 10:16:49.964 ERROR 13904 --- [main] com.example.demo.controlador             : un mensaje de error
2021-10-21 10:16:49.964 ERROR 13904 --- [main] com.example.demo.controlador             : un mensaje de error
2021-10-21 10:16:49.965 ERROR 13904 --- [main] com.example.demo.controlador             : un mensaje de error
2021-10-21 10:16:49.965 ERROR 13904 --- [main] com.example.demo.controlador             : un mensaje de error
2021-10-21 10:16:49.965 ERROR 13904 --- [main] com.example.demo.controlador             : un mensaje de error
2021-10-21 10:16:49.965 ERROR 13904 --- [main] com.example.demo.controlador             : un mensaje de error
2021-10-21 10:16:49.965 ERROR 13904 --- [main] com.example.demo.controlador             : un mensaje de error
2021-10-21 10:16:49.965 ERROR 13904 --- [main] com.example.demo.controlador             : un mensaje de error
2021-10-21 10:16:49.965 ERROR 13904 --- [main] com.example.demo.controlador             : un mensaje de error
2021-10-21 10:16:49.965 ERROR 13904 --- [main] com.example.demo.controlador             : un mensaje de error
2021-10-21 10:16:49.965 ERROR 13904 --- [main] com.example.demo.controlador             : un mensaje de error
2021-10-21 10:16:49.965 ERROR 13904 --- [main] com.example.demo.controlador             : un mensaje de error
2021-10-21 10:16:49.965 ERROR 13904 --- [main] com.example.demo.controlador             : un mensaje de error
2021-10-21 10:16:49.965 ERROR 13904 --- [main] com.example.demo.controlador             : un mensaje de error
2021-10-21 10:16:49.965 ERROR 13904 --- [main] com.example.demo.controlador             : un mensaje de error
2021-10-21 10:16:49.965 ERROR 13904 --- [main] com.example.demo.controlador             : un mensaje de error
2021-10-21 10:16:49.965 ERROR 13904 --- [main] com.example.demo.controlador             : un mensaje de error
2021-10-21 10:16:49.965 ERROR 13904 --- [main] com.example.demo.controlador             : un mensaje de error
2021-10-21 10:16:49.965 ERROR 13904 --- [main] com.example.demo.controlador             : un mensaje de error
2021-10-21 10:16:49.965 ERROR 13904 --- [main] com.example.demo.controlador             : un mensaje de error
2021-10-21 10:16:49.965 ERROR 13904 --- [main] com.example.demo.controlador             : un mensaje de error
2021-10-21 10:16:49.965 ERROR 13904 --- [main] com.example.demo.controlador             : un mensaje de error
2021-10-21 10:16:49.965 ERROR 13904 --- [main] com.example.demo.controlador             : un mensaje de error
2021-10-21 10:16:49.965 ERROR 13904 --- [main] com.example.demo.controlador             : un mensaje de error
2021-10-21 10:16:49.965 ERROR 13904 --- [main] com.example.demo.controlador             : un mensaje de error
2021-10-21 10:16:49.965 ERROR 13904 --- [main] com.example.demo.controlador             : un mensaje de error
2021-10-21 10:16:49.965 ERROR 13904 --- [main] com.example.demo.controlador             : un mensaje de error
2021-10-21 10:16:49.965 ERROR 13904 --- [main] com.example.demo.controlador             : un mensaje de error
2021-10-21 10:16:49.965 ERROR 13904 --- [main] com.example.demo.controlador             : un mensaje de error
2021-10-21 10:16:49.965 ERROR 13904 --- [main] com.example.demo.controlador             : un mensaje de error
2021-10-21 10:16:49.965 ERROR 13904 --- [main] com.example.demo.controlador             : un mensaje de error
2021-10-21 10:16:49.965 ERROR 13904 --- [main] com.example.demo.controlador             : un mensaje de error
2021-10-21 10:16:49.965 ERROR 13904 --- [main] com.example.demo.controlador             : un mensaje de error
2021-10-21 10:16:49.965 ERROR 13904 --- [main] com.example.demo.controlador             : un mensaje de error
2021-10-21 10:16:49.965 ERROR 13904 --- [main] com.example.demo.controlador             : un mensaje de error
2021-10-21 10:16:49.965 ERROR 13904 --- [main] com.example.demo.controlador             : un mensaje de error
2021-10-21 10:16:49.965 ERROR 13904 --- [main] com.example.demo.controlador             : un mensaje de error
2021-10-21 10:16:49.965 ERROR 13904 --- [main] com.example.demo.controlador             : un mensaje de error
2021-10-21 10:16:49.965 ERROR 13904 --- [main] com.example.demo.controlador             : un mensaje de error
2021-10-21 10:16:49.965 ERROR 13904 --- [main] com.example.demo.controlador             : un mensaje de error
2021-10-21 10:16:49.965 ERROR 13904 --- [main] com.example.demo.controlador             : un mensaje de error
2021-10-21 10:16:49.965 ERROR 13904 --- [main] com.example.demo.controlador             : un mensaje de error
2021-10-21 10:16:49.965 ERROR 13904 --- [main] com.example.demo.controlador             : un mensaje de error
2021-10-21 10:16:49.965 ERROR 13904 --- [main] com.example.demo.controlador             : un mensaje de error
2021-10-21 10:16:49.965 ERROR 13904 --- [main] com.example.demo.controlador             : un mensaje de error
2021-10-21 10:16:49.965 ERROR 13904 --- [main] com.example.demo.controlador             : un mensaje de error
2021-10-21 10:16:49.965 ERROR 13904 --- [main] com.example.demo.controlador             : un mensaje de error
2021-10-21 10:16:49.965 ERROR 13904 --- [main] com.example.demo.controlador             : un mensaje de error
2021-10-21 10:16:49.965 ERROR 13904 --- [main] com.example.demo.controlador             : un mensaje de error
2021-10-21 10:16:49.965 ERROR 13904 --- [main] com.example.demo.controlador             : un mensaje de error
2021-10-21 10:16:49.965 ERROR 13904 --- [main] com.example.demo.controlador             : un mensaje de error
2021-10-21 10:16:49.965 ERROR 13904 --- [main] com.example.demo.controlador             : un mensaje de error
2021-10-21 10:16:49.965 ERROR 13904 --- [main] com.example.demo.controlador             : un mensaje de error
2021-10-21 10:16:49.965 ERROR 13904 --- [main] com.example.demo.controlador             : un mensaje de error
2021-10-21 10:16:49.965 ERROR 13904 --- [main] com.example.demo.controlador             : un mensaje de error
2021-10-21 10:16:49.965 ERROR 13904 --- [main] com.example.demo.controlador             : un mensaje de error
2021-10-21 10:16:49.965 ERROR 13904 --- [main] com.example.demo.controlador             : un mensaje de error
2021-10-21 10:16:49.965 ERROR 13904 --- [main] com.example.demo.controlador             : un mensaje de error
2021-10-21 10:16:49.965 ERROR 13904 --- [main] com.example.demo.controlador             : un mensaje de error
2021-10-21 10:16:49.965 ERROR 13904 --- [main] com.example.demo.controlador             : un mensaje de error
2021-10-21 10:16:49.965 ERROR 13904 --- [main] com.example.demo.controlador             : un mensaje de error
2021-10-21 10:16:49.965 ERROR 13904 --- [main] com.example.demo.controlador             : un mensaje de error
2021-10-21 10:16:49.965 ERROR 13904 --- [main] com.example.demo.controlador             : un mensaje de error
2021-10-21 10:16:49.965 ERROR 13904 --- [main] com.example.demo.controlador             : un mensaje de error
2021-10-21 10:16:49.965 ERROR 13904 --- [main] com.example.demo.controlador             : un mensaje de error
2021-10-21 10:16:49.965 ERROR 13904 --- [main] com.example.demo.controlador             : un mensaje de error
2021-10-21 10:16:49.965 ERROR 13904 --- [main] com.example.demo.controlador             : un mensaje de error
2021-10-21 10:16:49.965 ERROR 13904 --- [main] com.example.demo.controlador             : un mensaje de error
2021-10-21 10:16:49.965 ERROR 13904 --- [main] com.example.demo.controlador             : un mensaje de error
2021-10-21 10:16:49.965 ERROR 13904 --- [main] com.example.demo.controlador             : un mensaje de error
2021-10-21 10:16:49.965 ERROR 13904 --- [main] com.example.demo.controlador             : un mensaje de error
2021-10-21 10:16:49.965 ERROR 13904 --- [main] com.example.demo.controlador             : un mensaje de error
2021-10-21 10:16:49.965 ERROR 13904 --- [main] com.example.demo.controlador             : un mensaje de error
2021-10-21 10:16:49.965 ERROR 13904 --- [main] com.example.demo.controlador             : un mensaje de error
2021-10-21 10:16:49.965 ERROR 13904 --- [main] com.example.demo.controlador             : un mensaje de error
2021-10-21 10:16:49.965 ERROR 13904 --- [main] com.example.demo.controlador             : un mensaje de error
2021-10-21 10:16:49.965 ERROR 13904 --- [main] com.example.demo.controlador             : un mensaje de error
2021-10-21 10:16:49.965 ERROR 13904 --- [main] com.example.demo.controlador             : un mensaje de error
2021-10-21 10:16:49.965 ERROR 13904 --- [main] com.example.demo.controlador             : un mensaje de error
2021-10-21 10:16:49.965 ERROR 13904 --- [main] com.example.demo.controlador             : un mensaje de error
2021-10-21 10:16:49.965 ERROR 13904 --- [main] com.example.demo.controlador             : un mensaje de error
2021-10-21 10:16:49.965 ERROR 13904 --- [main] com.example.demo.controlador             : un mensaje de error
2021-10-21 10:16:49.965 ERROR 13904 --- [main] com.example.demo.controlador             : un mensaje de error
2021-10-21 10:16:49.965 ERROR 13904 --- [main] com.example.demo.controlador             : un mensaje de error
2021-10-21 10:16:49.965 ERROR 13904 --- [main] com.example.demo.controlador             : un mensaje de error
2021-10-21 10:16:49.965 ERROR 13904 --- [main] com.example.demo.controlador             : un mensaje de error
2021-10-21 10:16:49.965 ERROR 13904 --- [main] com.example.demo.controlador             : un mensaje de error
2021-10-21 10:16:49.965 ERROR 13904 --- [main] com.example.demo.controlador             : un mensaje de error
2021-10-21 10:16:49.965 ERROR 13904 --- [main] com.example.demo.controlador             : un mensaje de error
2021-10-21 10:16:49.965 ERROR 13904 --- [main] com.example.demo.controlador             : un mensaje de error
2021-10-21 10:16:49.965 ERROR 13904 --- [main] com.example.demo.controlador             : un mensaje de error
2021-10-21 10:16:49.965 ERROR 13904 --- [main] com.example.demo.controlador             : un mensaje de error
2021-10-21 10:16:49.965 ERROR 13904 --- [main] com.example.demo.controlador             : un mensaje de error
2021-10-21 10:16:49.965 ERROR 13904 --- [main] com.example.demo.controlador             : un mensaje de error
