{
    "Version": "2020-12-01",
    "Metadata": {},
    "Parameters": [
        {
            "Name": "ProcessingInstanceCount",
            "Type": "Integer",
            "DefaultValue": 1
        },
        {
            "Name": "ModelApprovalStatus",
            "Type": "String",
            "DefaultValue": "PendingManualApproval"
        },
        {
            "Name": "InputDataUrl",
            "Type": "String",
            "DefaultValue": "s3://sagemaker-servicecatalog-seedcode-us-east-1/dataset/abalone-dataset.csv"
        },
        {
            "Name": "SkipDataQualityCheck",
            "Type": "Boolean",
            "DefaultValue": false
        },
        {
            "Name": "RegisterNewDataQualityBaseline",
            "Type": "Boolean",
            "DefaultValue": false
        },
        {
            "Name": "DataQualitySuppliedStatistics",
            "Type": "String",
            "DefaultValue": ""
        },
        {
            "Name": "DataQualitySuppliedConstraints",
            "Type": "String",
            "DefaultValue": ""
        },
        {
            "Name": "SkipDataBiasCheck",
            "Type": "Boolean",
            "DefaultValue": false
        },
        {
            "Name": "RegisterNewDataBiasBaseline",
            "Type": "Boolean",
            "DefaultValue": false
        },
        {
            "Name": "DataBiasSuppliedBaselineConstraints",
            "Type": "String",
            "DefaultValue": ""
        },
        {
            "Name": "SkipModelQualityCheck",
            "Type": "Boolean",
            "DefaultValue": false
        },
        {
            "Name": "RegisterNewModelQualityBaseline",
            "Type": "Boolean",
            "DefaultValue": false
        },
        {
            "Name": "ModelQualitySuppliedStatistics",
            "Type": "String",
            "DefaultValue": ""
        },
        {
            "Name": "ModelQualitySuppliedConstraints",
            "Type": "String",
            "DefaultValue": ""
        },
        {
            "Name": "SkipModelBiasCheck",
            "Type": "Boolean",
            "DefaultValue": false
        },
        {
            "Name": "RegisterNewModelBiasBaseline",
            "Type": "Boolean",
            "DefaultValue": false
        },
        {
            "Name": "ModelBiasSuppliedBaselineConstraints",
            "Type": "String",
            "DefaultValue": ""
        },
        {
            "Name": "SkipModelExplainabilityCheck",
            "Type": "Boolean",
            "DefaultValue": false
        },
        {
            "Name": "RegisterNewModelExplainabilityBaseline",
            "Type": "Boolean",
            "DefaultValue": false
        },
        {
            "Name": "ModelExplainabilitySuppliedBaselineConstraints",
            "Type": "String",
            "DefaultValue": ""
        }
    ],
    "PipelineExperimentConfig": {
        "ExperimentName": {
            "Get": "Execution.PipelineName"
        },
        "TrialName": {
            "Get": "Execution.PipelineExecutionId"
        }
    },
    "Steps": [
        {
            "Name": "PreprocessAbaloneData",
            "Type": "Processing",
            "Arguments": {
                "ProcessingResources": {
                    "ClusterConfig": {
                        "InstanceType": "ml.m5.xlarge",
                        "InstanceCount": {
                            "Get": "Parameters.ProcessingInstanceCount"
                        },
                        "VolumeSizeInGB": 30
                    }
                },
                "AppSpecification": {
                    "ImageUri": "683313688378.dkr.ecr.us-east-1.amazonaws.com/sagemaker-scikit-learn:0.23-1-cpu-py3",
                    "ContainerArguments": [
                        "--input-data",
                        {
                            "Get": "Parameters.InputDataUrl"
                        }
                    ],
                    "ContainerEntrypoint": [
                        "python3",
                        "/opt/ml/processing/input/code/preprocess.py"
                    ]
                },
                "RoleArn": "arn:aws:iam::622722613492:role/service-role/AmazonSageMakerServiceCatalogProductsUseRole",
                "ProcessingInputs": [
                    {
                        "InputName": "code",
                        "AppManaged": false,
                        "S3Input": {
                            "S3Uri": "s3://sagemaker-project-p-ovhfbnegrtx9/Samay2024-p-ovhfbnegrtx9/sklearn-abalon-2024-02-04-04-07-32-149/input/code/preprocess.py",
                            "LocalPath": "/opt/ml/processing/input/code",
                            "S3DataType": "S3Prefix",
                            "S3InputMode": "File",
                            "S3DataDistributionType": "FullyReplicated",
                            "S3CompressionType": "None"
                        }
                    }
                ],
                "ProcessingOutputConfig": {
                    "Outputs": [
                        {
                            "OutputName": "train",
                            "AppManaged": false,
                            "S3Output": {
                                "S3Uri": "s3://sagemaker-project-p-ovhfbnegrtx9/Samay2024-p-ovhfbnegrtx9/sklearn-abalon-2024-02-04-04-07-32-149/output/train",
                                "LocalPath": "/opt/ml/processing/train",
                                "S3UploadMode": "EndOfJob"
                            }
                        },
                        {
                            "OutputName": "validation",
                            "AppManaged": false,
                            "S3Output": {
                                "S3Uri": "s3://sagemaker-project-p-ovhfbnegrtx9/Samay2024-p-ovhfbnegrtx9/sklearn-abalon-2024-02-04-04-07-32-149/output/validation",
                                "LocalPath": "/opt/ml/processing/validation",
                                "S3UploadMode": "EndOfJob"
                            }
                        },
                        {
                            "OutputName": "test",
                            "AppManaged": false,
                            "S3Output": {
                                "S3Uri": "s3://sagemaker-project-p-ovhfbnegrtx9/Samay2024-p-ovhfbnegrtx9/sklearn-abalon-2024-02-04-04-07-32-149/output/test",
                                "LocalPath": "/opt/ml/processing/test",
                                "S3UploadMode": "EndOfJob"
                            }
                        }
                    ]
                }
            }
        },
        {
            "Name": "DataQualityCheckStep",
            "Type": "QualityCheck",
            "Arguments": {
                "ProcessingResources": {
                    "ClusterConfig": {
                        "InstanceType": "ml.c5.xlarge",
                        "InstanceCount": 1,
                        "VolumeSizeInGB": 120
                    }
                },
                "AppSpecification": {
                    "ImageUri": "156813124566.dkr.ecr.us-east-1.amazonaws.com/sagemaker-model-monitor-analyzer"
                },
                "RoleArn": "arn:aws:iam::622722613492:role/service-role/AmazonSageMakerServiceCatalogProductsUseRole",
                "ProcessingInputs": [
                    {
                        "InputName": "baseline_dataset_input",
                        "AppManaged": false,
                        "S3Input": {
                            "S3Uri": {
                                "Get": "Steps.PreprocessAbaloneData.ProcessingOutputConfig.Outputs['train'].S3Output.S3Uri"
                            },
                            "LocalPath": "/opt/ml/processing/input/baseline_dataset_input",
                            "S3DataType": "S3Prefix",
                            "S3InputMode": "File",
                            "S3DataDistributionType": "FullyReplicated",
                            "S3CompressionType": "None"
                        }
                    }
                ],
                "ProcessingOutputConfig": {
                    "Outputs": [
                        {
                            "OutputName": "quality_check_output",
                            "AppManaged": false,
                            "S3Output": {
                                "S3Uri": {
                                    "Std:Join": {
                                        "On": "/",
                                        "Values": [
                                            "s3:/",
                                            "sagemaker-project-p-ovhfbnegrtx9",
                                            "Samay2024-p-ovhfbnegrtx9",
                                            {
                                                "Get": "Execution.PipelineExecutionId"
                                            },
                                            "dataqualitycheckstep"
                                        ]
                                    }
                                },
                                "LocalPath": "/opt/ml/processing/output",
                                "S3UploadMode": "EndOfJob"
                            }
                        }
                    ]
                },
                "Environment": {
                    "output_path": "/opt/ml/processing/output",
                    "publish_cloudwatch_metrics": "Disabled",
                    "dataset_format": "{\"csv\": {\"header\": false, \"output_columns_position\": \"START\"}}",
                    "dataset_source": "/opt/ml/processing/input/baseline_dataset_input"
                }
            },
            "CheckType": "DATA_QUALITY",
            "ModelPackageGroupName": "Samay2024-p-ovhfbnegrtx9",
            "SkipCheck": {
                "Get": "Parameters.SkipDataQualityCheck"
            },
            "RegisterNewBaseline": {
                "Get": "Parameters.RegisterNewDataQualityBaseline"
            },
            "SuppliedBaselineStatistics": {
                "Get": "Parameters.DataQualitySuppliedStatistics"
            },
            "SuppliedBaselineConstraints": {
                "Get": "Parameters.DataQualitySuppliedConstraints"
            }
        },
        {
            "Name": "DataBiasCheckStep",
            "Type": "ClarifyCheck",
            "Arguments": {
                "ProcessingResources": {
                    "ClusterConfig": {
                        "InstanceType": "ml.c5.xlarge",
                        "InstanceCount": 1,
                        "VolumeSizeInGB": 120
                    }
                },
                "AppSpecification": {
                    "ImageUri": "205585389593.dkr.ecr.us-east-1.amazonaws.com/sagemaker-clarify-processing:1.0"
                },
                "RoleArn": "arn:aws:iam::622722613492:role/service-role/AmazonSageMakerServiceCatalogProductsUseRole",
                "ProcessingInputs": [
                    {
                        "InputName": "analysis_config",
                        "AppManaged": false,
                        "S3Input": {
                            "S3Uri": "s3://sagemaker-project-p-ovhfbnegrtx9/Samay2024-p-ovhfbnegrtx9/databiascheckstep/analysis_cfg/analysis_config.json",
                            "LocalPath": "/opt/ml/processing/input/config",
                            "S3DataType": "S3Prefix",
                            "S3InputMode": "File",
                            "S3DataDistributionType": "FullyReplicated",
                            "S3CompressionType": "None"
                        }
                    },
                    {
                        "InputName": "dataset",
                        "AppManaged": false,
                        "S3Input": {
                            "S3Uri": {
                                "Get": "Steps.PreprocessAbaloneData.ProcessingOutputConfig.Outputs['train'].S3Output.S3Uri"
                            },
                            "LocalPath": "/opt/ml/processing/input/data",
                            "S3DataType": "S3Prefix",
                            "S3InputMode": "File",
                            "S3DataDistributionType": "FullyReplicated",
                            "S3CompressionType": "None"
                        }
                    }
                ],
                "ProcessingOutputConfig": {
                    "Outputs": [
                        {
                            "OutputName": "analysis_result",
                            "AppManaged": false,
                            "S3Output": {
                                "S3Uri": {
                                    "Std:Join": {
                                        "On": "/",
                                        "Values": [
                                            "s3:/",
                                            "sagemaker-project-p-ovhfbnegrtx9",
                                            "Samay2024-p-ovhfbnegrtx9",
                                            {
                                                "Get": "Execution.PipelineExecutionId"
                                            },
                                            "databiascheckstep"
                                        ]
                                    }
                                },
                                "LocalPath": "/opt/ml/processing/output",
                                "S3UploadMode": "EndOfJob"
                            }
                        }
                    ]
                }
            },
            "CheckType": "DATA_BIAS",
            "ModelPackageGroupName": "Samay2024-p-ovhfbnegrtx9",
            "SkipCheck": {
                "Get": "Parameters.SkipDataBiasCheck"
            },
            "RegisterNewBaseline": {
                "Get": "Parameters.RegisterNewDataBiasBaseline"
            },
            "SuppliedBaselineConstraints": null
        },
        {
            "Name": "TrainAbaloneModel",
            "Type": "Training",
            "Arguments": {
                "AlgorithmSpecification": {
                    "TrainingInputMode": "File",
                    "TrainingImage": "683313688378.dkr.ecr.us-east-1.amazonaws.com/sagemaker-xgboost:1.0-1-cpu-py3"
                },
                "OutputDataConfig": {
                    "S3OutputPath": "s3://sagemaker-project-p-ovhfbnegrtx9/Samay2024-p-ovhfbnegrtx9/AbaloneTrain"
                },
                "StoppingCondition": {
                    "MaxRuntimeInSeconds": 86400
                },
                "ResourceConfig": {
                    "InstanceCount": 1,
                    "InstanceType": "ml.m5.xlarge",
                    "VolumeSizeInGB": 30
                },
                "RoleArn": "arn:aws:iam::622722613492:role/service-role/AmazonSageMakerServiceCatalogProductsUseRole",
                "InputDataConfig": [
                    {
                        "DataSource": {
                            "S3DataSource": {
                                "S3DataType": "S3Prefix",
                                "S3Uri": {
                                    "Get": "Steps.PreprocessAbaloneData.ProcessingOutputConfig.Outputs['train'].S3Output.S3Uri"
                                },
                                "S3DataDistributionType": "FullyReplicated"
                            }
                        },
                        "ContentType": "text/csv",
                        "ChannelName": "train"
                    },
                    {
                        "DataSource": {
                            "S3DataSource": {
                                "S3DataType": "S3Prefix",
                                "S3Uri": {
                                    "Get": "Steps.PreprocessAbaloneData.ProcessingOutputConfig.Outputs['validation'].S3Output.S3Uri"
                                },
                                "S3DataDistributionType": "FullyReplicated"
                            }
                        },
                        "ContentType": "text/csv",
                        "ChannelName": "validation"
                    }
                ],
                "HyperParameters": {
                    "objective": "reg:linear",
                    "num_round": "50",
                    "max_depth": "5",
                    "eta": "0.2",
                    "gamma": "4",
                    "min_child_weight": "6",
                    "subsample": "0.7",
                    "silent": "0"
                },
                "ProfilerRuleConfigurations": [
                    {
                        "RuleConfigurationName": "ProfilerReport-1707019652",
                        "RuleEvaluatorImage": "503895931360.dkr.ecr.us-east-1.amazonaws.com/sagemaker-debugger-rules:latest",
                        "RuleParameters": {
                            "rule_to_invoke": "ProfilerReport"
                        }
                    }
                ],
                "ProfilerConfig": {
                    "S3OutputPath": "s3://sagemaker-project-p-ovhfbnegrtx9/Samay2024-p-ovhfbnegrtx9/AbaloneTrain"
                }
            },
            "DependsOn": [
                "DataQualityCheckStep",
                "DataBiasCheckStep"
            ]
        },
        {
            "Name": "AbaloneCreateModel-CreateModel",
            "Type": "Model",
            "Arguments": {
                "ExecutionRoleArn": "arn:aws:iam::622722613492:role/service-role/AmazonSageMakerServiceCatalogProductsUseRole",
                "PrimaryContainer": {
                    "Image": "683313688378.dkr.ecr.us-east-1.amazonaws.com/sagemaker-xgboost:1.0-1-cpu-py3",
                    "Environment": {},
                    "ModelDataUrl": {
                        "Get": "Steps.TrainAbaloneModel.ModelArtifacts.S3ModelArtifacts"
                    }
                }
            }
        },
        {
            "Name": "AbaloneTransform",
            "Type": "Transform",
            "Arguments": {
                "ModelName": {
                    "Get": "Steps.AbaloneCreateModel-CreateModel.ModelName"
                },
                "TransformInput": {
                    "DataSource": {
                        "S3DataSource": {
                            "S3DataType": "S3Prefix",
                            "S3Uri": {
                                "Get": "Steps.PreprocessAbaloneData.ProcessingOutputConfig.Outputs['test'].S3Output.S3Uri"
                            }
                        }
                    },
                    "ContentType": "text/csv",
                    "SplitType": "Line"
                },
                "TransformOutput": {
                    "S3OutputPath": "s3://sagemaker-project-p-ovhfbnegrtx9/AbaloneTransform",
                    "AssembleWith": "Line",
                    "Accept": "text/csv"
                },
                "TransformResources": {
                    "InstanceCount": 1,
                    "InstanceType": "ml.m5.xlarge"
                },
                "DataProcessing": {
                    "InputFilter": "$[1:]",
                    "OutputFilter": "$[0,-1]",
                    "JoinSource": "Input"
                }
            }
        },
        {
            "Name": "ModelQualityCheckStep",
            "Type": "QualityCheck",
            "Arguments": {
                "ProcessingResources": {
                    "ClusterConfig": {
                        "InstanceType": "ml.c5.xlarge",
                        "InstanceCount": 1,
                        "VolumeSizeInGB": 120
                    }
                },
                "AppSpecification": {
                    "ImageUri": "156813124566.dkr.ecr.us-east-1.amazonaws.com/sagemaker-model-monitor-analyzer"
                },
                "RoleArn": "arn:aws:iam::622722613492:role/service-role/AmazonSageMakerServiceCatalogProductsUseRole",
                "ProcessingInputs": [
                    {
                        "InputName": "baseline_dataset_input",
                        "AppManaged": false,
                        "S3Input": {
                            "S3Uri": {
                                "Get": "Steps.AbaloneTransform.TransformOutput.S3OutputPath"
                            },
                            "LocalPath": "/opt/ml/processing/input/baseline_dataset_input",
                            "S3DataType": "S3Prefix",
                            "S3InputMode": "File",
                            "S3DataDistributionType": "FullyReplicated",
                            "S3CompressionType": "None"
                        }
                    }
                ],
                "ProcessingOutputConfig": {
                    "Outputs": [
                        {
                            "OutputName": "quality_check_output",
                            "AppManaged": false,
                            "S3Output": {
                                "S3Uri": {
                                    "Std:Join": {
                                        "On": "/",
                                        "Values": [
                                            "s3:/",
                                            "sagemaker-project-p-ovhfbnegrtx9",
                                            "Samay2024-p-ovhfbnegrtx9",
                                            {
                                                "Get": "Execution.PipelineExecutionId"
                                            },
                                            "modelqualitycheckstep"
                                        ]
                                    }
                                },
                                "LocalPath": "/opt/ml/processing/output",
                                "S3UploadMode": "EndOfJob"
                            }
                        }
                    ]
                },
                "Environment": {
                    "output_path": "/opt/ml/processing/output",
                    "publish_cloudwatch_metrics": "Disabled",
                    "dataset_format": "{\"csv\": {\"header\": false, \"output_columns_position\": \"START\"}}",
                    "dataset_source": "/opt/ml/processing/input/baseline_dataset_input",
                    "analysis_type": "MODEL_QUALITY",
                    "problem_type": "Regression",
                    "inference_attribute": "_c0",
                    "ground_truth_attribute": "_c1"
                }
            },
            "CheckType": "MODEL_QUALITY",
            "ModelPackageGroupName": "Samay2024-p-ovhfbnegrtx9",
            "SkipCheck": {
                "Get": "Parameters.SkipModelQualityCheck"
            },
            "RegisterNewBaseline": {
                "Get": "Parameters.RegisterNewModelQualityBaseline"
            },
            "SuppliedBaselineStatistics": {
                "Get": "Parameters.ModelQualitySuppliedStatistics"
            },
            "SuppliedBaselineConstraints": {
                "Get": "Parameters.ModelQualitySuppliedConstraints"
            }
        },
        {
            "Name": "ModelBiasCheckStep",
            "Type": "ClarifyCheck",
            "Arguments": {
                "ProcessingResources": {
                    "ClusterConfig": {
                        "InstanceType": "ml.c5.xlarge",
                        "InstanceCount": 1,
                        "VolumeSizeInGB": 120
                    }
                },
                "AppSpecification": {
                    "ImageUri": "205585389593.dkr.ecr.us-east-1.amazonaws.com/sagemaker-clarify-processing:1.0"
                },
                "RoleArn": "arn:aws:iam::622722613492:role/service-role/AmazonSageMakerServiceCatalogProductsUseRole",
                "ProcessingInputs": [
                    {
                        "InputName": "analysis_config",
                        "AppManaged": false,
                        "S3Input": {
                            "S3Uri": "s3://sagemaker-project-p-ovhfbnegrtx9/Samay2024-p-ovhfbnegrtx9/modelbiascheckstep/analysis_cfg/analysis_config.json",
                            "LocalPath": "/opt/ml/processing/input/config",
                            "S3DataType": "S3Prefix",
                            "S3InputMode": "File",
                            "S3DataDistributionType": "FullyReplicated",
                            "S3CompressionType": "None"
                        }
                    },
                    {
                        "InputName": "dataset",
                        "AppManaged": false,
                        "S3Input": {
                            "S3Uri": {
                                "Get": "Steps.PreprocessAbaloneData.ProcessingOutputConfig.Outputs['train'].S3Output.S3Uri"
                            },
                            "LocalPath": "/opt/ml/processing/input/data",
                            "S3DataType": "S3Prefix",
                            "S3InputMode": "File",
                            "S3DataDistributionType": "FullyReplicated",
                            "S3CompressionType": "None"
                        }
                    }
                ],
                "ProcessingOutputConfig": {
                    "Outputs": [
                        {
                            "OutputName": "analysis_result",
                            "AppManaged": false,
                            "S3Output": {
                                "S3Uri": {
                                    "Std:Join": {
                                        "On": "/",
                                        "Values": [
                                            "s3:/",
                                            "sagemaker-project-p-ovhfbnegrtx9",
                                            "Samay2024-p-ovhfbnegrtx9",
                                            {
                                                "Get": "Execution.PipelineExecutionId"
                                            },
                                            "modelbiascheckstep"
                                        ]
                                    }
                                },
                                "LocalPath": "/opt/ml/processing/output",
                                "S3UploadMode": "EndOfJob"
                            }
                        }
                    ]
                }
            },
            "CheckType": "MODEL_BIAS",
            "ModelPackageGroupName": "Samay2024-p-ovhfbnegrtx9",
            "SkipCheck": {
                "Get": "Parameters.SkipModelBiasCheck"
            },
            "RegisterNewBaseline": {
                "Get": "Parameters.RegisterNewModelBiasBaseline"
            },
            "SuppliedBaselineConstraints": {
                "Get": "Parameters.ModelBiasSuppliedBaselineConstraints"
            },
            "ModelName": {
                "Get": "Steps.AbaloneCreateModel-CreateModel.ModelName"
            }
        },
        {
            "Name": "ModelExplainabilityCheckStep",
            "Type": "ClarifyCheck",
            "Arguments": {
                "ProcessingResources": {
                    "ClusterConfig": {
                        "InstanceType": "ml.c5.xlarge",
                        "InstanceCount": 1,
                        "VolumeSizeInGB": 120
                    }
                },
                "AppSpecification": {
                    "ImageUri": "205585389593.dkr.ecr.us-east-1.amazonaws.com/sagemaker-clarify-processing:1.0"
                },
                "RoleArn": "arn:aws:iam::622722613492:role/service-role/AmazonSageMakerServiceCatalogProductsUseRole",
                "ProcessingInputs": [
                    {
                        "InputName": "analysis_config",
                        "AppManaged": false,
                        "S3Input": {
                            "S3Uri": "s3://sagemaker-project-p-ovhfbnegrtx9/Samay2024-p-ovhfbnegrtx9/modelexplainabilitycheckstep/analysis_cfg/analysis_config.json",
                            "LocalPath": "/opt/ml/processing/input/config",
                            "S3DataType": "S3Prefix",
                            "S3InputMode": "File",
                            "S3DataDistributionType": "FullyReplicated",
                            "S3CompressionType": "None"
                        }
                    },
                    {
                        "InputName": "dataset",
                        "AppManaged": false,
                        "S3Input": {
                            "S3Uri": {
                                "Get": "Steps.PreprocessAbaloneData.ProcessingOutputConfig.Outputs['train'].S3Output.S3Uri"
                            },
                            "LocalPath": "/opt/ml/processing/input/data",
                            "S3DataType": "S3Prefix",
                            "S3InputMode": "File",
                            "S3DataDistributionType": "FullyReplicated",
                            "S3CompressionType": "None"
                        }
                    }
                ],
                "ProcessingOutputConfig": {
                    "Outputs": [
                        {
                            "OutputName": "analysis_result",
                            "AppManaged": false,
                            "S3Output": {
                                "S3Uri": {
                                    "Std:Join": {
                                        "On": "/",
                                        "Values": [
                                            "s3:/",
                                            "sagemaker-project-p-ovhfbnegrtx9",
                                            "Samay2024-p-ovhfbnegrtx9",
                                            {
                                                "Get": "Execution.PipelineExecutionId"
                                            },
                                            "modelexplainabilitycheckstep"
                                        ]
                                    }
                                },
                                "LocalPath": "/opt/ml/processing/output",
                                "S3UploadMode": "EndOfJob"
                            }
                        }
                    ]
                }
            },
            "CheckType": "MODEL_EXPLAINABILITY",
            "ModelPackageGroupName": "Samay2024-p-ovhfbnegrtx9",
            "SkipCheck": {
                "Get": "Parameters.SkipModelExplainabilityCheck"
            },
            "RegisterNewBaseline": {
                "Get": "Parameters.RegisterNewModelExplainabilityBaseline"
            },
            "SuppliedBaselineConstraints": {
                "Get": "Parameters.ModelExplainabilitySuppliedBaselineConstraints"
            },
            "ModelName": {
                "Get": "Steps.AbaloneCreateModel-CreateModel.ModelName"
            }
        },
        {
            "Name": "EvaluateAbaloneModel",
            "Type": "Processing",
            "Arguments": {
                "ProcessingResources": {
                    "ClusterConfig": {
                        "InstanceType": "ml.m5.xlarge",
                        "InstanceCount": 1,
                        "VolumeSizeInGB": 30
                    }
                },
                "AppSpecification": {
                    "ImageUri": "683313688378.dkr.ecr.us-east-1.amazonaws.com/sagemaker-xgboost:1.0-1-cpu-py3",
                    "ContainerEntrypoint": [
                        "python3",
                        "/opt/ml/processing/input/code/evaluate.py"
                    ]
                },
                "RoleArn": "arn:aws:iam::622722613492:role/service-role/AmazonSageMakerServiceCatalogProductsUseRole",
                "ProcessingInputs": [
                    {
                        "InputName": "input-1",
                        "AppManaged": false,
                        "S3Input": {
                            "S3Uri": {
                                "Get": "Steps.TrainAbaloneModel.ModelArtifacts.S3ModelArtifacts"
                            },
                            "LocalPath": "/opt/ml/processing/model",
                            "S3DataType": "S3Prefix",
                            "S3InputMode": "File",
                            "S3DataDistributionType": "FullyReplicated",
                            "S3CompressionType": "None"
                        }
                    },
                    {
                        "InputName": "input-2",
                        "AppManaged": false,
                        "S3Input": {
                            "S3Uri": {
                                "Get": "Steps.PreprocessAbaloneData.ProcessingOutputConfig.Outputs['test'].S3Output.S3Uri"
                            },
                            "LocalPath": "/opt/ml/processing/test",
                            "S3DataType": "S3Prefix",
                            "S3InputMode": "File",
                            "S3DataDistributionType": "FullyReplicated",
                            "S3CompressionType": "None"
                        }
                    },
                    {
                        "InputName": "code",
                        "AppManaged": false,
                        "S3Input": {
                            "S3Uri": "s3://sagemaker-project-p-ovhfbnegrtx9/Samay2024-p-ovhfbnegrtx9/script-abalone-2024-02-04-04-07-33-215/input/code/evaluate.py",
                            "LocalPath": "/opt/ml/processing/input/code",
                            "S3DataType": "S3Prefix",
                            "S3InputMode": "File",
                            "S3DataDistributionType": "FullyReplicated",
                            "S3CompressionType": "None"
                        }
                    }
                ],
                "ProcessingOutputConfig": {
                    "Outputs": [
                        {
                            "OutputName": "evaluation",
                            "AppManaged": false,
                            "S3Output": {
                                "S3Uri": "s3://sagemaker-project-p-ovhfbnegrtx9/Samay2024-p-ovhfbnegrtx9/script-abalone-2024-02-04-04-07-33-215/output/evaluation",
                                "LocalPath": "/opt/ml/processing/evaluation",
                                "S3UploadMode": "EndOfJob"
                            }
                        }
                    ]
                }
            },
            "PropertyFiles": [
                {
                    "PropertyFileName": "AbaloneEvaluationReport",
                    "OutputName": "evaluation",
                    "FilePath": "evaluation.json"
                }
            ]
        },
        {
            "Name": "CheckMSEAbaloneEvaluation",
            "Type": "Condition",
            "Arguments": {
                "Conditions": [
                    {
                        "Type": "LessThanOrEqualTo",
                        "LeftValue": {
                            "Std:JsonGet": {
                                "PropertyFile": {
                                    "Get": "Steps.EvaluateAbaloneModel.PropertyFiles.AbaloneEvaluationReport"
                                },
                                "Path": "regression_metrics.mse.value"
                            }
                        },
                        "RightValue": 6
                    }
                ],
                "IfSteps": [
                    {
                        "Name": "RegisterAbaloneModel-RegisterModel",
                        "Type": "RegisterModel",
                        "Arguments": {
                            "ModelPackageGroupName": "Samay2024-p-ovhfbnegrtx9",
                            "ModelMetrics": {
                                "ModelQuality": {
                                    "Statistics": {
                                        "ContentType": "application/json",
                                        "S3Uri": {
                                            "Get": "Steps.ModelQualityCheckStep.CalculatedBaselineStatistics"
                                        }
                                    },
                                    "Constraints": {
                                        "ContentType": "application/json",
                                        "S3Uri": {
                                            "Get": "Steps.ModelQualityCheckStep.CalculatedBaselineConstraints"
                                        }
                                    }
                                },
                                "ModelDataQuality": {
                                    "Statistics": {
                                        "ContentType": "application/json",
                                        "S3Uri": {
                                            "Get": "Steps.DataQualityCheckStep.CalculatedBaselineStatistics"
                                        }
                                    },
                                    "Constraints": {
                                        "ContentType": "application/json",
                                        "S3Uri": {
                                            "Get": "Steps.DataQualityCheckStep.CalculatedBaselineConstraints"
                                        }
                                    }
                                },
                                "Bias": {
                                    "Report": {
                                        "ContentType": "application/json",
                                        "S3Uri": {
                                            "Get": "Steps.ModelBiasCheckStep.CalculatedBaselineConstraints"
                                        }
                                    },
                                    "PreTrainingReport": {
                                        "ContentType": "application/json",
                                        "S3Uri": {
                                            "Get": "Steps.DataBiasCheckStep.CalculatedBaselineConstraints"
                                        }
                                    },
                                    "PostTrainingReport": {
                                        "ContentType": "application/json",
                                        "S3Uri": {
                                            "Get": "Steps.ModelBiasCheckStep.CalculatedBaselineConstraints"
                                        }
                                    }
                                },
                                "Explainability": {
                                    "Report": {
                                        "ContentType": "application/json",
                                        "S3Uri": {
                                            "Get": "Steps.ModelExplainabilityCheckStep.CalculatedBaselineConstraints"
                                        }
                                    }
                                }
                            },
                            "DriftCheckBaselines": {
                                "ModelQuality": {
                                    "Statistics": {
                                        "ContentType": "application/json",
                                        "S3Uri": {
                                            "Get": "Steps.ModelQualityCheckStep.BaselineUsedForDriftCheckStatistics"
                                        }
                                    },
                                    "Constraints": {
                                        "ContentType": "application/json",
                                        "S3Uri": {
                                            "Get": "Steps.ModelQualityCheckStep.BaselineUsedForDriftCheckConstraints"
                                        }
                                    }
                                },
                                "ModelDataQuality": {
                                    "Statistics": {
                                        "ContentType": "application/json",
                                        "S3Uri": {
                                            "Get": "Steps.DataQualityCheckStep.BaselineUsedForDriftCheckStatistics"
                                        }
                                    },
                                    "Constraints": {
                                        "ContentType": "application/json",
                                        "S3Uri": {
                                            "Get": "Steps.DataQualityCheckStep.BaselineUsedForDriftCheckConstraints"
                                        }
                                    }
                                },
                                "Bias": {
                                    "ConfigFile": {
                                        "S3Uri": "s3://sagemaker-project-p-ovhfbnegrtx9/Samay2024-p-ovhfbnegrtx9/modelbiascheckstep/analysis_cfg/bias-monitoring-configuration/bias-monitoring-config-2024-02-04-04-07-32-745/27f6bd7c-9861-415b-8e73-bf15b9810d72/analysis_config.json",
                                        "ContentType": "application/json"
                                    },
                                    "PreTrainingConstraints": {
                                        "ContentType": "application/json",
                                        "S3Uri": {
                                            "Get": "Steps.DataBiasCheckStep.BaselineUsedForDriftCheckConstraints"
                                        }
                                    },
                                    "PostTrainingConstraints": {
                                        "ContentType": "application/json",
                                        "S3Uri": {
                                            "Get": "Steps.ModelBiasCheckStep.BaselineUsedForDriftCheckConstraints"
                                        }
                                    }
                                },
                                "Explainability": {
                                    "Constraints": {
                                        "ContentType": "application/json",
                                        "S3Uri": {
                                            "Get": "Steps.ModelExplainabilityCheckStep.BaselineUsedForDriftCheckConstraints"
                                        }
                                    },
                                    "ConfigFile": {
                                        "S3Uri": "s3://sagemaker-project-p-ovhfbnegrtx9/Samay2024-p-ovhfbnegrtx9/modelexplainabilitycheckstep/analysis_cfg/model-explainability-monitoring-configuration/model-explainability-monitoring-config-2024-02-04-04-07-32-970/fa209161-bf77-4a78-822b-45bd8865aa9a/analysis_config.json",
                                        "ContentType": "application/json"
                                    }
                                }
                            },
                            "InferenceSpecification": {
                                "Containers": [
                                    {
                                        "Image": "683313688378.dkr.ecr.us-east-1.amazonaws.com/sagemaker-xgboost:1.0-1-cpu-py3",
                                        "Environment": {},
                                        "ModelDataUrl": {
                                            "Get": "Steps.TrainAbaloneModel.ModelArtifacts.S3ModelArtifacts"
                                        }
                                    }
                                ],
                                "SupportedContentTypes": [
                                    "text/csv"
                                ],
                                "SupportedResponseMIMETypes": [
                                    "text/csv"
                                ],
                                "SupportedRealtimeInferenceInstanceTypes": [
                                    "ml.t2.medium",
                                    "ml.m5.large"
                                ],
                                "SupportedTransformInstanceTypes": [
                                    "ml.m5.large"
                                ]
                            },
                            "ModelApprovalStatus": {
                                "Get": "Parameters.ModelApprovalStatus"
                            }
                        }
                    }
                ],
                "ElseSteps": []
            }
        }
    ]
}