Place,WeightClassKg,Name,State,Sex,BodyweightKg,Best3SquatKg,Best3BenchKg,Best3DeadliftKg,TotalKg,Division,Event,Equipment,Squat4Kg,Deadlift4Kg
1,90,Ashley Tennison,TX,F,87.14,132.5,75,170,377.5,sm1,SBD,Wraps,,
1,56,Cindy Fernandez,TX,F,53.25,97.5,37.5,107.5,242.5,int,SBD,Wraps,,
1,60,Melissa Castillo,TX,F,59.47,90,50,107.5,247.5,open,SBD,Wraps,,
1,67.5,Jodie Thornton,TX,F,64.09,77.5,47.5,117.5,242.5,m1,SBD,Raw,,
1,90+,Whitley Hamilton,TX,F,103.06,105,52.5,142.5,300,jr,SBD,Wraps,,
1,82.5,Savannah Adams,TX,F,79.88,80,37.5,120,237.5,teen,SBD,Wraps,,
1,48,Matty Duncan,TX,F,46.81,37.5,30,60,127.5,jr,SBD,Raw,,
1,48,Baylie Nugent,TX,F,46.08,37.5,25,57.5,120,open,SBD,Raw,,
1,82.5,Jennifer Seaton,TX,F,79.2,45,35,92.5,172.5,nov,SBD,Raw,,
1,48,Melinda Mendez,TX,F,45.4,27.5,25,52.5,105,pure,SBD,Raw,,
1,67.5,Robbin Hedrick,TX,F,65.36,,42.5,,42.5,sm2,B,Raw,,
1,90,Ashley Tennison,TX,F,87.14,,75,170,245,sm1,BD,Raw,,
1,75,Sandi Duncan,TX,F,73.39,,55,140,195,int,BD,Raw,,
1,100,Brad Anderson,TX,M,98.52,,185,,185,p+f,B,Single-ply,,
1,100,Brad Anderson,TX,M,98.52,,185,,185,pure,B,Single-ply,,
1,75,Chad Tucker,AR,M,71.71,,115,,115,jr,B,Raw,,
1,140+,Ben Vaughn,TX,M,148.6,,176,,176,nov,B,Raw,,
1,125,Aaron Baxter,TX,M,115.71,,157.5,,157.5,sm2,B,Raw,,
1,110,Jim Moody,TX,M,109.81,,130,,130,mp,B,Raw,,
1,100,Jimmy Roberts,TX,M,92.58,,170,260,430,m1,BD,Raw,,
1,90,Sebastian McGee,TX,M,86.23,,135,242.5,377.5,int,BD,Raw,,
1,90,Bonner Hankey,TX,M,87.72,,145,230,375,int,BD,Raw,,
1,75,Toddrick Perry,TX,M,74.12,,101,217.5,318.5,nov,BD,Raw,,
1,90,Colton Lynn,TX,M,85.46,,135,195,330,nov,BD,Raw,,
1,82.5,Mark Miller,TX,M,82.37,,77.5,132.5,210,m2,BD,Raw,,
1,75,Danny Harris,OK,M,73.07,,55,97.5,152.5,mp,BD,Raw,,
1,90,Joe Sowards,TX,M,88.95,245,155,230,630,m1,SBD,Single-ply,,
1,100,German Barron,TX,M,96.52,257.5,137.5,237.5,632.5,nov,SBD,Single-ply,,
1,140+,Randall Reid,TX,M,150.18,250,190,272.5,712.5,sm2,SBD,Single-ply,,
1,67.5,Christian Kearney,TX,M,64.23,210,122.5,295,627.5,int,SBD,Wraps,,
1,67.5,Christian Kearney,TX,M,64.23,210,122.5,295,627.5,open,SBD,Wraps,,
1,67.5,Christian Kearney,TX,M,64.23,210,122.5,295,627.5,pure,SBD,Wraps,,
1,75,Victor Solis,TX,M,72.17,230,150,235,615,int,SBD,Wraps,235,247.5
1,140,Alex Hamblin,TX,M,128.82,320,198.5,287.5,806,open,SBD,Wraps,,
1,140,Alex Hamblin,TX,M,128.82,320,198.5,287.5,806,p+f,SBD,Wraps,,
1,140,Alex Hamblin,TX,M,128.82,320,198.5,287.5,806,sm1,SBD,Wraps,,
1,90,Ashton Slaughter,TX,M,89.81,215,150,255,620,open,SBD,Wraps,,
1,75,Chad Tucker,AR,M,71.71,185,115,220,520,jr,SBD,Wraps,,
1,75,Tanner Bailey,TX,M,74.89,187.5,105,227.5,520,nov,SBD,Wraps,,
1,110,Justin Brown,TX,M,103.69,220,132.5,227.5,580,jr,SBD,Wraps,,
1,140+,Thomas Martin,TX,M,149.69,235,140,265,640,int,SBD,Wraps,,
1,75,Toddrick Perry,TX,M,74.12,122.5,101,217.5,441,nov,SBD,Raw,,
1,100,Randy Richardson,TX,M,90.76,160,122.5,185,467.5,m1,SBD,Wraps,,
1,100,Kevin Parker,TX,M,93.53,180,92.5,195,467.5,m2,SBD,Wraps,,
1,90,Bryan Pondoff,TX,M,89.72,152.5,125,171,448.5,sm2,SBD,Wraps,,
1,75,Marcos Monrial,TX,M,74.93,145,85,175,405,teen,SBD,Wraps,,
1,100,Thomas Newland,TX,M,98.93,155,102.5,195,452.5,nov,SBD,Wraps,,
2,140,Miguel Garcia,TX,M,133.81,190,95,220,505,sm1,SBD,Wraps,,
1,100,Joshua Marks,TX,M,95.3,142.5,100,187.5,430,m1,SBD,Raw,,
2,100,Eric Perez,TX,M,95.75,157.5,92.5,180,430,nov,SBD,Wraps,,
1,100,Jimmy Roberts,TX,M,92.58,,170,260,430,m1,BD,Raw,,
1,90,Sebastian McGee,TX,M,86.23,,135,242.5,377.5,int,BD,Raw,,
1,140+,Jared Bratcher,OK,M,145.6,,185,252.5,437.5,sm1,BD,Raw,,
1,125,Aaron Baxter,TX,M,115.71,,157.5,227.5,385,sm2,BD,Raw,,
2,90,Colton Lynn,TX,M,85.46,,135,195,330,int,BD,Raw,,
1,140+,Thomas Martin,TX,M,149.69,,140,265,405,int,BD,Raw,,
1,110,Dustin Shilling,OK,M,109.04,,125,217.5,342.5,int,BD,Raw,,
1,100,Joseph Stephens,TX,M,91.99,,130,185,315,m2,BD,Raw,,
2,100,Kevin Parker,TX,M,93.53,,92.5,195,287.5,m2,BD,Raw,,
1,90,Preston Hankey,TX,M,83.28,,42.5,90,132.5,teen,BD,Raw,,
