<svg width="27" height="27" viewBox="0 0 27 27" fill="none" xmlns="http://www.w3.org/2000/svg">
<path d="M13 21C17.4183 21 21 17.4183 21 13C21 8.58172 17.4183 5 13 5C8.58172 5 5 8.58172 5 13C5 17.4183 8.58172 21 13 21Z" stroke="#6F6C99" stroke-width="1.5" stroke-linecap="round" stroke-linejoin="round"/>
<path d="M16.9531 16.1394L13.5433 9.31967C13.3301 8.89344 12.7441 8.89344 12.531 9.31967L9.06783 16.1394C8.85472 16.5123 9.17439 16.9918 9.60062 16.9918H16.4203C16.8466 16.9918 17.113 16.5123 16.9531 16.1394ZM13.0105 15.9263C12.5842 15.9263 12.2113 15.5533 12.2113 15.1271C12.2113 14.7008 12.531 14.3279 13.0105 14.3279C13.49 14.3279 13.8097 14.7008 13.8097 15.1271C13.8097 15.6066 13.4367 15.9263 13.0105 15.9263ZM13.5433 13.7951H12.4777L12.2113 11.9303C12.2113 11.7705 12.3178 11.6639 12.4777 11.6639H13.5433C13.7031 11.6639 13.8097 11.7705 13.8097 11.9303L13.5433 13.7951Z" fill="#6F6C99"/>
</svg>
