{
	"-id":"course123",
	"name":"Full Stack Web Dev in Javascript",
	"description":"Learn how to do web development using Javascript",
	"price": 10000,
	"slots": 25,
	"isActive": true,
	"dateTimeCreated":"2022-08-15-1819PM"
},
{
	"-id":"course456",
	"name":"Introduction to PHP",
	"description":"Learn how to do create music Library",
	"price": 10000,
	"slots": 20,
	"isActive": true,
	"dateTimeCreated":"2022-08-15-1820PM"
},