lat,lng
55.167814490887174,-57.30468750000001
69.40715220150605,-13.359375000000002
55.167814490887174,-57.30468750000001
69.40715220150605,-13.359375000000002
55.167814490887174,-57.30468750000001
69.40715220150605,-13.359375000000002
55.167814490887174,-57.30468750000001
69.40715220150605,-13.359375000000002
55.167814490887174,-57.30468750000001
69.40715220150605,-13.359375000000002
55.167814490887174,-57.30468750000001
69.40715220150605,-13.359375000000002
55.167814490887174,-57.30468750000001
69.40715220150605,-13.359375000000002
55.167814490887174,-57.30468750000001
69.40715220150605,-13.359375000000002
55.167814490887174,-57.30468750000001
69.40715220150605,-13.359375000000002
55.167814490887174,-57.30468750000001
69.40715220150605,-13.359375000000002
55.167814490887174,-57.30468750000001
69.40715220150605,-13.359375000000002
55.167814490887174,-57.30468750000001
69.40715220150605,-13.359375000000002
55.167814490887174,-57.30468750000001
69.40715220150605,-13.359375000000002
55.167814490887174,-57.30468750000001
69.40715220150605,-13.359375000000002
55.167814490887174,-57.30468750000001
69.40715220150605,-13.359375000000002
55.167814490887174,-57.30468750000001
69.40715220150605,-13.359375000000002
55.167814490887174,-57.30468750000001
69.40715220150605,-13.359375000000002
55.167814490887174,-57.30468750000001
69.40715220150605,-13.359375000000002
55.167814490887174,-57.30468750000001
69.40715220150605,-13.359375000000002
55.167814490887174,-57.30468750000001
69.40715220150605,-13.359375000000002
55.167814490887174,-57.30468750000001
69.40715220150605,-13.359375000000002
55.167814490887174,-57.30468750000001
69.40715220150605,-13.359375000000002
55.167814490887174,-57.30468750000001
69.40715220150605,-13.359375000000002
55.167814490887174,-57.30468750000001
69.40715220150605,-13.359375000000002
55.167814490887174,-57.30468750000001
69.40715220150605,-13.359375000000002
55.167814490887174,-57.30468750000001
69.40715220150605,-13.359375000000002
55.167814490887174,-57.30468750000001
69.40715220150605,-13.359375000000002
55.167814490887174,-57.30468750000001
69.40715220150605,-13.359375000000002
55.167814490887174,-57.30468750000001
69.40715220150605,-13.359375000000002
55.167814490887174,-57.30468750000001
69.40715220150605,-13.359375000000002
55.167814490887174,-57.30468750000001
69.40715220150605,-13.359375000000002
55.167814490887174,-57.30468750000001
69.40715220150605,-13.359375000000002
55.167814490887174,-57.30468750000001
69.40715220150605,-13.359375000000002
55.167814490887174,-57.30468750000001
69.40715220150605,-13.359375000000002
55.167814490887174,-57.30468750000001
69.40715220150605,-13.359375000000002
55.167814490887174,-57.30468750000001
69.40715220150605,-13.359375000000002
55.167814490887174,-57.30468750000001
69.40715220150605,-13.359375000000002
55.167814490887174,-57.30468750000001
69.40715220150605,-13.359375000000002
55.167814490887174,-57.30468750000001
69.40715220150605,-13.359375000000002
55.167814490887174,-57.30468750000001
69.40715220150605,-13.359375000000002
55.167814490887174,-57.30468750000001
69.40715220150605,-13.359375000000002
55.167814490887174,-57.30468750000001
69.40715220150605,-13.359375000000002
55.167814490887174,-57.30468750000001
69.40715220150605,-13.359375000000002
55.167814490887174,-57.30468750000001
69.40715220150605,-13.359375000000002
55.167814490887174,-57.30468750000001
69.40715220150605,-13.359375000000002
55.167814490887174,-57.30468750000001
69.40715220150605,-13.359375000000002
55.167814490887174,-57.30468750000001
69.40715220150605,-13.359375000000002
55.167814490887174,-57.30468750000001
69.40715220150605,-13.359375000000002
55.167814490887174,-57.30468750000001
69.40715220150605,-13.359375000000002
55.167814490887174,-57.30468750000001
69.40715220150605,-13.359375000000002
55.167814490887174,-57.30468750000001
69.40715220150605,-13.359375000000002
55.167814490887174,-57.30468750000001
69.40715220150605,-13.359375000000002
55.167814490887174,-57.30468750000001
69.40715220150605,-13.359375000000002
55.167814490887174,-57.30468750000001
69.40715220150605,-13.359375000000002
55.167814490887174,-57.30468750000001
69.40715220150605,-13.359375000000002
55.167814490887174,-57.30468750000001
69.40715220150605,-13.359375000000002
55.167814490887174,-57.30468750000001
69.40715220150605,-13.359375000000002
55.167814490887174,-57.30468750000001
69.40715220150605,-13.359375000000002
55.167814490887174,-57.30468750000001
69.40715220150605,-13.359375000000002
55.167814490887174,-57.30468750000001
69.40715220150605,-13.359375000000002
55.167814490887174,-57.30468750000001
69.40715220150605,-13.359375000000002
55.167814490887174,-57.30468750000001
69.40715220150605,-13.359375000000002
55.167814490887174,-57.30468750000001
69.40715220150605,-13.359375000000002
55.167814490887174,-57.30468750000001
69.40715220150605,-13.359375000000002
55.167814490887174,-57.30468750000001
69.40715220150605,-13.359375000000002
55.167814490887174,-57.30468750000001
69.40715220150605,-13.359375000000002
55.167814490887174,-57.30468750000001
69.40715220150605,-13.359375000000002
55.167814490887174,-57.30468750000001
69.40715220150605,-13.359375000000002
55.167814490887174,-57.30468750000001
69.40715220150605,-13.359375000000002
55.167814490887174,-57.30468750000001
69.40715220150605,-13.359375000000002
55.167814490887174,-57.30468750000001
69.40715220150605,-13.359375000000002
55.167814490887174,-57.30468750000001
69.40715220150605,-13.359375000000002
55.167814490887174,-57.30468750000001
69.40715220150605,-13.359375000000002
55.167814490887174,-57.30468750000001
69.40715220150605,-13.359375000000002
55.167814490887174,-57.30468750000001
69.40715220150605,-13.359375000000002
55.167814490887174,-57.30468750000001
69.40715220150605,-13.359375000000002
55.167814490887174,-57.30468750000001
69.40715220150605,-13.359375000000002
55.167814490887174,-57.30468750000001
69.40715220150605,-13.359375000000002
55.167814490887174,-57.30468750000001
69.40715220150605,-13.359375000000002
55.167814490887174,-57.30468750000001
69.40715220150605,-13.359375000000002
55.167814490887174,-57.30468750000001
69.40715220150605,-13.359375000000002
55.167814490887174,-57.30468750000001
69.40715220150605,-13.359375000000002
55.167814490887174,-57.30468750000001
69.40715220150605,-13.359375000000002
55.167814490887174,-57.30468750000001
69.40715220150605,-13.359375000000002
55.167814490887174,-57.30468750000001
69.40715220150605,-13.359375000000002
55.167814490887174,-57.30468750000001
69.40715220150605,-13.359375000000002
55.167814490887174,-57.30468750000001
69.40715220150605,-13.359375000000002
55.167814490887174,-57.30468750000001
69.40715220150605,-13.359375000000002
55.167814490887174,-57.30468750000001
69.40715220150605,-13.359375000000002
55.167814490887174,-57.30468750000001
69.40715220150605,-13.359375000000002
55.167814490887174,-57.30468750000001
69.40715220150605,-13.359375000000002
55.167814490887174,-57.30468750000001
69.40715220150605,-13.359375000000002
55.167814490887174,-57.30468750000001
69.40715220150605,-13.359375000000002
55.167814490887174,-57.30468750000001
69.40715220150605,-13.359375000000002
55.167814490887174,-57.30468750000001
69.40715220150605,-13.359375000000002
55.167814490887174,-57.30468750000001
69.40715220150605,-13.359375000000002
55.167814490887174,-57.30468750000001
69.40715220150605,-13.359375000000002
55.167814490887174,-57.30468750000001
69.40715220150605,-13.359375000000002
55.167814490887174,-57.30468750000001
69.40715220150605,-13.359375000000002
