{
    "_id": "x7EMZNMavris2aHY",
    "data": {
        "actionCategory": {
            "value": ""
        },
        "actionType": {
            "value": "passive"
        },
        "actions": {
            "value": null
        },
        "description": {
            "value": "<p>You've researched many faiths enough to recognize notions about them that are unlikely to be true.</p>\n<p>If you roll a critical failure at a Religion check to Decipher Writing of a religious nature or to Recall Knowledge about the tenets of faiths, you get a failure instead.</p>\n<p>When attempting to Recall Knowledge about the tenets of your own faith, if you roll a failure, you get a success instead, and if you roll a success, you get a critical success instead.</p>"
        },
        "featType": {
            "value": "skill"
        },
        "level": {
            "value": 1
        },
        "location": "",
        "prerequisites": {
            "value": [
                {
                    "value": "trained in Religion"
                }
            ]
        },
        "rules": [
            {
                "key": "Note",
                "predicate": {
                    "any": [
                        "action:recall-knowledge",
                        "action:decipher-writing"
                    ]
                },
                "selector": "religion",
                "text": "<p class='compact-text'><strong>{item|name}</strong> When you roll a critical failure at a Religion check to Decipher Writing of a religious nature or to Recall Knowledge about the tenets of faiths, you get a failure instead.</p>"
            },
            {
                "key": "Note",
                "predicate": {
                    "any": [
                        "action:recall-knowledge",
                        "your-faith"
                    ]
                },
                "selector": "religion",
                "text": "<p class='compact-text'><strong>{item|name}</strong> When attempting to Recall Knowledge about the tenets of your own faith, if you roll a failure, you get a success instead, and if you roll a success, you get a critical success instead.</p>"
            }
        ],
        "source": {
            "value": "Pathfinder Core Rulebook"
        },
        "traits": {
            "custom": "",
            "rarity": {
                "value": "common"
            },
            "value": [
                "general",
                "skill"
            ]
        }
    },
    "effects": [],
    "flags": {},
    "img": "systems/pf2e/icons/features/feats/feats.webp",
    "name": "Student of the Canon",
    "type": "feat"
}
