{
    "_id": "y93whGnGZjFyw5A0",
    "content": "<h1>Vildeis (The Cardinal Martyr) [LG]</h1><p>The Cardinal Martyr presides over devotion, sacrifice, and scars. Vildeis is driven entirely by her abhorrence for evil. Evil should not and must not be allowed to exist. It should be fought without pause and without rest until it is completely and utterly destroyed. Not only does the fight never end, but every sacrifice that needs to be made to end evil must be made, and is worth making. There are no material rewards to be had for destroying evil-its destruction is all the reward necessary, and that reward can be enjoyed only once there is no more evil. Scars are the marks the fight leaves behind, the memory of all the sacrifices made. Vildeis expects total commitment from her followers, who leave everything behind and dedicate their lives to destroying all that is vile.</p><p>The Cardinal Martyr appears as a human woman covered in scars, each forming a rune depicting a sacrifice she has made. Her eyes are covered in a red cloth so that she cannot see the horrors of evil upon the world. Vildeis flies on gigantic, blood-colored wings, and the whispered screams of all the planes' martyrs can be heard in her presence. Followers of Vildeis include martyrs, paladins, and zealots.</p><p><strong>Edicts</strong> Sacrifice yourself in pursuit of good, champion noble causes, scar your body</p><p><strong>Anathema</strong> Joke or laugh about injustice, sacrifice others in your place, indulge in luxury</p><p><strong>Areas of Concern</strong> devotion, sacrifice, and scars</p><p><strong>Follower Alignments</strong> LG</span></p><h2>Devotee Benefits</h2><div><div><strong>Divine Ability</strong> Constitution or Charisma</div><div><strong>Divine Font</strong> harm or heal</div><div><strong>Divine Skill</strong> Medicine</div><div><strong>Favored Weapon</strong> dagger</div><div><strong>Domains</strong> duty, pain, sorrow, zeal</div><div><strong>Cleric Spells</strong> 1st: phantom pain, 2nd: slough skin (appears as streams of blood), 5th: synaptic pulse</div></div>",
    "flags": {},
    "name": "Vildeis",
    "permission": {
        "default": 0
    }
}
