{
    "_id": "SS70TEfozroKA9G1",
    "content": "<p>Play at any time.</p>\n<hr />\n<p>All persistent damage affecting you immediately comes to an end.</p>",
    "flags": {},
    "name": "Shake it Off",
    "permission": {
        "default": 0
    }
}
