{
    "_id": "Up7nUIT42zwhgZf4",
    "data": {
        "actionCategory": {
            "value": ""
        },
        "actionType": {
            "value": "passive"
        },
        "actions": {
            "value": null
        },
        "description": {
            "value": "<p><strong>Minor Curse</strong>: You always seem to lose your way or have strange mishaps on the road that delay your travel.</p>\n<p>You (and thus any group that travels with you) travel at only 3/4 normal exploration Speed, before taking into account the terrain and other features that might slow you down further.</p>"
        },
        "featType": {
            "value": "curse"
        },
        "level": {
            "value": 0
        },
        "prerequisites": {
            "value": []
        },
        "rules": [],
        "source": {
            "value": ""
        },
        "traits": {
            "custom": "",
            "rarity": {
                "value": "common"
            },
            "selected": {},
            "value": []
        }
    },
    "effects": [],
    "flags": {},
    "img": "systems/pf2e/icons/deity/Desna.webp",
    "name": "Desna - Minor Curse",
    "type": "feat"
}
