{
    "_id": "3zr5Gt5LgHsMNpSO",
    "data": {
        "actionCategory": {
            "value": ""
        },
        "actionType": {
            "value": "passive"
        },
        "actions": {
            "value": null
        },
        "description": {
            "value": "<p>You favor unusual weapons tied to your people, such as blades with curved and peculiar shapes. You are trained with the @Compendium[pf2e.equipment-srd.Glaive]{Glaive} and @Compendium[pf2e.equipment-srd.Kukri]{Kukri}.</p>\n<p>In addition, you gain access to kukris and all uncommon gnome weapons. For the purpose of determining your proficiency, martial gnome weapons are simple weapons and advanced gnome weapons are martial weapons.</p>"
        },
        "featType": {
            "value": "ancestry"
        },
        "level": {
            "value": 1
        },
        "location": "",
        "prerequisites": {
            "value": []
        },
        "rules": [
            {
                "key": "ActiveEffectLike",
                "mode": "upgrade",
                "path": "data.martial.weapon-base-glaive.rank",
                "value": 1
            },
            {
                "key": "ActiveEffectLike",
                "mode": "upgrade",
                "path": "data.martial.weapon-base-kukri.rank",
                "value": 1
            },
            {
                "key": "LinkedProficiency",
                "predicate": {
                    "all": [
                        "weapon:trait:gnome",
                        "weapon:category:advanced"
                    ]
                },
                "sameAs": "martial",
                "slug": "advanced-gnome-weapons"
            },
            {
                "key": "LinkedProficiency",
                "predicate": {
                    "all": [
                        "weapon:trait:gnome",
                        "weapon:category:martial"
                    ]
                },
                "sameAs": "simple",
                "slug": "martial-gnome-weapons"
            }
        ],
        "source": {
            "value": "Pathfinder Core Rulebook"
        },
        "traits": {
            "custom": "",
            "rarity": {
                "value": "common"
            },
            "value": [
                "gnome"
            ]
        }
    },
    "effects": [],
    "flags": {},
    "img": "systems/pf2e/icons/features/feats/feats.webp",
    "name": "Gnome Weapon Familiarity",
    "type": "feat"
}
