{
    "_id": "ABXUfGoeBgCyFasg",
    "data": {
        "actionCategory": {
            "value": ""
        },
        "actionType": {
            "value": "passive"
        },
        "actions": {
            "value": null
        },
        "description": {
            "value": "<p>You take on the imposing form of a large, winged oni.</p>\n<p>Once per day, as part of using Long-Nosed Form, you also gain the benefits of 4th-level <em>@Compendium[pf2e.spells-srd.Enlarge]{Enlarge}</em>and <em>@Compendium[pf2e.spells-srd.Fly]{Fly}</em>.</p>\n<p>This lasts for 5 minutes or until you shift out of your Long-Nosed Form, whichever happens first.</p>"
        },
        "featType": {
            "value": "ancestry"
        },
        "level": {
            "value": 17
        },
        "prerequisites": {
            "value": [
                {
                    "value": "Long-Nosed Form"
                }
            ]
        },
        "rules": [],
        "source": {
            "value": "Pathfinder Advanced Player's Guide"
        },
        "traits": {
            "custom": "",
            "rarity": {
                "value": "common"
            },
            "value": [
                "tengu"
            ]
        }
    },
    "effects": [],
    "flags": {},
    "img": "systems/pf2e/icons/features/feats/feats.webp",
    "name": "Great Tengu Form",
    "type": "feat"
}
