{
    "_id": "yUjuLbBMflVum8Yn",
    "data": {
        "actionCategory": {
            "value": "offensive"
        },
        "actionType": {
            "value": "action"
        },
        "actions": {
            "value": 1
        },
        "description": {
            "value": "<p><strong>Cost</strong> 1 or more batches of infused reagents;</p>\n<p><strong>Requirements</strong> You have a free hand;</p>\n<p><strong>Effect</strong> You set off a fireworks display. You can launch a normal firework to simply create a visual or audible signal within 20 feet or you can choose one of the following special effects. A firework display has the listed traits, and if it costs more than 1 batch of infused reagents, it is noted in its Cost entry.</p>\n<p><strong>Comet</strong> <span class=\"pf2-icon\">1</span> (visual) You shoot a streak of shining light in a <span data-pf2-effect-area=\"line\" data-pf2-distance=\"60\" data-pf2-traits=\"visual\">60-foot line</span>. All spaces in that line are lit with bright light until the start of your next turn. As part of this action, you can also Point Out a single creature in the line, and your allies do not need to hear or understand you.</p>\n<p><strong>Flower</strong> <span class=\"pf2-icon\">1</span> (visual) You ignite a ring of sparks, creating a shape that might be reminiscent of a flower blooming in the sky. Each enemy with 20 feet of you must attempt a Fortitude save. On a failure, the enemy is @Compendium[pf2e.conditionitems.Dazzled]{Dazzled} for 1 round, and on a critical failure they are dazzled for 2 rounds.</p>\n<p><strong>Salute</strong> <span class=\"pf2-icon\">1</span> (auditory) You create a startling bang or whistle, adding an auditory component to your fireworks display. When you launch a salute display, you can choose a @Compendium[pf2e.conditionitems.Confused]{Confused} or @Compendium[pf2e.conditionitems.Fascinated]{Fascinated} ally within 60 feet. If the ally you chose is fascinated, the noise is so violent that it acts as a hostile effect for the purpose of their fascinated condition (though it has no negative repercussions) automatically ending most applications of the fascinated condition. If they're confused, the sound is so loud and violent that it might snap the ally out of confusion. They can immediately attempt the flat check to remove the confused condition which normally occurs when a creature is damaged. If the confused condition has special rules that remove the flat check when taking damage or make the flat check harder, those rules also apply to the salute.</p>"
        },
        "requirements": {
            "value": ""
        },
        "rules": [],
        "source": {
            "value": ""
        },
        "traits": {
            "custom": "",
            "rarity": {
                "value": "common"
            },
            "value": [
                "manipulate"
            ]
        },
        "trigger": {
            "value": ""
        }
    },
    "effects": [],
    "flags": {},
    "img": "systems/pf2e/icons/actions/OneAction.webp",
    "name": "Launch Fireworks Display",
    "type": "action"
}
