{
    "_id": "qM566kCXljkOpocA",
    "data": {
        "actionCategory": {
            "value": ""
        },
        "actionType": {
            "value": "passive"
        },
        "actions": {
            "value": null
        },
        "description": {
            "value": "<p>Your talons are every bit as sharp and strong as your beak. You gain a talon unarmed attack that deals [[/r {1d4}[slashing]]]{1d4 slashing damage}. Your talons are in the brawling group, and have the agile, finesse, unarmed and versatile piercing traits.</p>"
        },
        "featType": {
            "value": "heritage"
        },
        "level": {
            "value": 1
        },
        "location": "",
        "prerequisites": {
            "value": []
        },
        "rules": [
            {
                "category": "unarmed",
                "damage": {
                    "base": {
                        "damageType": "slashing",
                        "dice": 1,
                        "die": "d4"
                    }
                },
                "group": "brawling",
                "key": "Strike",
                "label": "Talon",
                "range": null,
                "traits": [
                    "agile",
                    "finesse",
                    "unarmed",
                    "versatile-p"
                ]
            }
        ],
        "source": {
            "value": ""
        },
        "traits": {
            "custom": "",
            "rarity": {
                "value": "common"
            },
            "value": [
                "tengu"
            ]
        }
    },
    "effects": [],
    "flags": {},
    "img": "systems/pf2e/icons/features/ancestry/taloned-tengu.webp",
    "name": "Taloned Tengu",
    "type": "feat"
}
