{
    "_id": "IOdk7bOJ4dgYVh9I",
    "data": {
        "actionCategory": {
            "value": ""
        },
        "actionType": {
            "value": "passive"
        },
        "actions": {
            "value": null
        },
        "description": {
            "value": "<p>You can direct excess channeled energy outward to benefit an ally.</p>\n<p>You can grant the Hit Points you would regain from @Compendium[pf2e.feats-srd.Communal Healing]{Communal Healing} to any one creature within the range of your heal spell instead of yourself. You can also use Communal Healing when you target only yourself with a <em>heal</em> spell, though if you do, you must grant the additional healing to someone other than yourself.</p>"
        },
        "featType": {
            "value": "class"
        },
        "level": {
            "value": 4
        },
        "location": "",
        "prerequisites": {
            "value": [
                {
                    "value": "Communal Healing"
                }
            ]
        },
        "rules": [],
        "source": {
            "value": "Pathfinder Core Rulebook"
        },
        "traits": {
            "custom": "",
            "rarity": {
                "value": "common"
            },
            "value": [
                "cleric"
            ]
        }
    },
    "effects": [],
    "flags": {},
    "img": "systems/pf2e/icons/features/feats/feats.webp",
    "name": "Improved Communal Healing",
    "type": "feat"
}
