{
    "_id": "AbgHCPWOKULeXrJ2",
    "data": {
        "actionCategory": {
            "value": ""
        },
        "actionType": {
            "value": "passive"
        },
        "actions": {
            "value": null
        },
        "description": {
            "value": "<p>Your attacks deal more damage, even against creatures that aren't flat-footed.</p>\n<p>When you succeed or critically succeed at a Strike against a creature that isn't flat-footed, you also deal 1d6 precision damage. This applies only if you're using a weapon or unarmed attack you could deal sneak attack damage with.</p>\n<p>At 14th level, if you would normally deal 3d6 or more sneak attack damage to flat-footed creatures, you deal 2d6 precision damage to creatures that aren't flat-footed.</p>"
        },
        "featType": {
            "value": "class"
        },
        "level": {
            "value": 8
        },
        "location": "",
        "prerequisites": {
            "value": [
                {
                    "value": "sneak attack"
                }
            ]
        },
        "rules": [
            {
                "damageType": "precision",
                "dieSize": "d6",
                "key": "DamageDice",
                "predicate": {
                    "any": [
                        "finesse",
                        "agile",
                        "ranged"
                    ],
                    "not": [
                        "target:flatFooted"
                    ]
                },
                "selector": "damage",
                "value": {
                    "brackets": [
                        {
                            "end": 10,
                            "value": {
                                "diceNumber": 1
                            }
                        },
                        {
                            "start": 14,
                            "value": {
                                "diceNumber": 2
                            }
                        }
                    ]
                }
            }
        ],
        "source": {
            "value": "Pathfinder Core Rulebook"
        },
        "traits": {
            "custom": "",
            "rarity": {
                "value": "common"
            },
            "value": [
                "rogue"
            ]
        }
    },
    "effects": [],
    "flags": {},
    "img": "systems/pf2e/icons/features/feats/feats.webp",
    "name": "Sly Striker",
    "type": "feat"
}
