{
    "_id": "i98NcWSAbWmNmBik",
    "data": {
        "actionCategory": {
            "value": ""
        },
        "actionType": {
            "value": "passive"
        },
        "actions": {
            "value": null
        },
        "description": {
            "value": "<p>Your blade ally thirsts for the blood of your foes.</p>\n<p>Whenever you critically hit an enemy with the weapon inhabited by your blade ally while dealing extra damage from your champion's reaction, the target takes @Compendium[pf2e.conditionitems.Persistent Damage]{Persistent Bleed Damage} equal to two of the weapon's damage dice.</p>"
        },
        "featType": {
            "value": "class"
        },
        "level": {
            "value": 16
        },
        "location": "",
        "prerequisites": {
            "value": [
                {
                    "value": "divine ally (blade)"
                },
                {
                    "value": "tenets of evil"
                }
            ]
        },
        "rules": [
            {
                "key": "Note",
                "predicate": {
                    "any": [
                        "destructive-vengeance-negative",
                        "destructive-vengeance-evil",
                        "selfish-shield-negative",
                        "selfish-shield-evil",
                        "iron-command-negative",
                        "iron-command-evil"
                    ]
                },
                "selector": "damage",
                "text": "<p class='compact-text'><strong>{item|name}</strong> Whenever you critically hit an enemy with the weapon inhabited by your blade ally while dealing extra damage from your champion's reaction, the target takes @Compendium[pf2e.conditionitems.Persistent Damage]{Persistent Bleed Damage} equal to two of the weapon's damage dice.</p>"
            }
        ],
        "source": {
            "value": "Pathfinder Advanced Player's Guide"
        },
        "traits": {
            "custom": "",
            "rarity": {
                "value": "uncommon"
            },
            "value": [
                "champion"
            ]
        }
    },
    "effects": [],
    "flags": {},
    "img": "systems/pf2e/icons/features/feats/feats.webp",
    "name": "Instrument Of Slaughter",
    "type": "feat"
}
