{
    "_id": "nfQAqTSVHcA2JSyI",
    "data": {
        "description": {
            "value": "<p>Granted by <em>@Compendium[pf2e.spells-srd.Elemental Absorption]{Elemental Absorption}</em></p>\n<p>You absorb elemental energy, which you can release as a powerful counterattack. Choose air, earth, fire, or water. You gain resistance 5 to damage dealt by effects with the chosen elemental trait; if you choose water, you also gain resistance to cold damage. As usual, if a spell has a multiple effects, such as a spell that deals both fire damage and bludgeoning damage with superheated rocks, you gain resistance to only the effects associated with the element you chose. Keep track of how much damage you have prevented with this spell.</p>\n<p>As a 2-action activity, which has the concentrate trait and the trait matching the element you chose, you can release the stored energy. This deals damage equal to the amount you've stored (maximum 30 damage) to one enemy within 60 feet, with a basic Reflex save. The damage type depends on the element you chose: fire damage for fire; bludgeoning or cold damage for water; bludgeoning or slashing damage for air; or bludgeoning, piercing, or slashing damage for earth. After releasing the energy, the spell ends. If you do not use the stored energy before the spell ends, the energy is lost.</p>\n<hr />\n<p><strong>Heightened (+3)</strong> The resistance increases by 5 and the maximum damage increases by 30.</p>"
        },
        "duration": {
            "expiry": "turn-start",
            "sustained": false,
            "unit": "minutes",
            "value": 1
        },
        "level": {
            "value": 3
        },
        "rules": [
            {
                "key": "Resistance",
                "type": "air",
                "value": "5*floor(@item.level.value/3)"
            }
        ],
        "source": {
            "value": "Pathfinder Secrets of Magic"
        },
        "start": {
            "initiative": null,
            "value": 0
        },
        "target": null,
        "tokenIcon": {
            "show": true
        },
        "traits": {
            "custom": "",
            "rarity": {
                "value": "common"
            },
            "value": []
        }
    },
    "effects": [],
    "flags": {},
    "img": "systems/pf2e/icons/spells/elemental-absorption.webp",
    "name": "Spell Effect: Elemental Absorption (Air)",
    "type": "effect"
}
