{
    "_id": "fLlCodqKXyXbZR7C",
    "data": {
        "actionCategory": {
            "value": "offensive"
        },
        "actionType": {
            "value": "action"
        },
        "actions": {
            "value": 2
        },
        "description": {
            "value": "<p><strong>Frequency</strong> once per minute</p>\n<p><strong>Requirements</strong> You're in Reflective Ripple Stance.</p>\n<hr />\n<p>You dip and spin, unleashing a wide whirlpool of water. Make an Athletics check to @Compendium[pf2e.actionspf2e.Trip]{Trip} each creature standing on the ground in a <span data-pf2-effect-area=\"emanation\" data-pf2-distance=\"10\">10-foot emanation</span>.</p>\n<p>These attacks all count toward your multiple attack penalty, but the penalty doesn't increase until after you make all the attacks.</p>"
        },
        "featType": {
            "value": "class"
        },
        "level": {
            "value": 12
        },
        "location": "",
        "prerequisites": {
            "value": [
                {
                    "value": "Reflective Ripple Stance"
                }
            ]
        },
        "rules": [],
        "source": {
            "value": ""
        },
        "traits": {
            "custom": "",
            "rarity": {
                "value": "common"
            },
            "value": [
                "monk",
                "water"
            ]
        }
    },
    "effects": [],
    "flags": {},
    "img": "systems/pf2e/icons/default-icons/feat.svg",
    "name": "Wave Spiral",
    "type": "feat"
}
