{
    "_id": "B5f7eCAC3ZEmlR9h",
    "data": {
        "actionCategory": {
            "value": ""
        },
        "actionType": {
            "value": "passive"
        },
        "actions": {
            "value": null
        },
        "description": {
            "value": "<p>You increase your ability to cast spells. You gain the basic spellcasting benefits granted by spellcasting archetypes, gaining a spell repertoire. Each time you gain a spell slot of a new level from the basic, expert, and master spellcasting benefits from pervasive magic feats, add a spell of the appropriate spell level to your repertoire: a common spell of the magical tradition matching your trait, or another spell of that tradition that you have learned or discovered.</p>"
        },
        "featType": {
            "value": "class"
        },
        "level": {
            "value": 4
        },
        "location": "",
        "prerequisites": {
            "value": [
                {
                    "value": "Cantrip Casting"
                }
            ]
        },
        "rules": [],
        "source": {
            "value": ""
        },
        "traits": {
            "custom": "",
            "rarity": {
                "value": "rare"
            },
            "value": [
                "pervasive-magic"
            ]
        }
    },
    "effects": [],
    "flags": {},
    "img": "systems/pf2e/icons/default-icons/feat.svg",
    "name": "Basic Spellcasting",
    "type": "feat"
}
