{
    "_id": "gX8O0ArQXbEVDUbW",
    "data": {
        "description": {
            "value": "<p>Granted by <em>@Compendium[pf2e.spells-srd.Embrace the Pit]{Embrace the Pit}</em></p>"
        },
        "duration": {
            "expiry": "turn-start",
            "sustained": false,
            "unit": "minutes",
            "value": 1
        },
        "level": {
            "value": 3
        },
        "rules": [
            {
                "key": "Resistance",
                "type": "evil",
                "value": "5 + 5*floor((@item.level.value -3)/2)"
            },
            {
                "key": "Resistance",
                "type": "fire",
                "value": "5 + 5*floor((@item.level.value -3)/2)"
            },
            {
                "key": "Resistance",
                "type": "poison",
                "value": "5 + 5*floor((@item.level.value -3)/2)"
            },
            {
                "except": "Silver",
                "key": "Resistance",
                "type": "physical",
                "value": "1 + 2*floor((@item.level.value -3)/2)"
            },
            {
                "key": "Weakness",
                "type": "good",
                "value": "5 + 5*floor((@item.level.value -3)/2)"
            }
        ],
        "source": {
            "value": "Pathfinder Core Rulebook"
        },
        "start": {
            "initiative": null,
            "value": 0
        },
        "target": null,
        "tokenIcon": {
            "show": true
        },
        "traits": {
            "custom": "",
            "rarity": {
                "value": "common"
            },
            "value": []
        }
    },
    "effects": [],
    "flags": {},
    "img": "systems/pf2e/icons/spells/embrace-the-pit.webp",
    "name": "Spell Effect: Embrace the Pit",
    "type": "effect"
}
