{
    "_id": "dwloLQzWgwjJWzXt",
    "data": {
        "actionCategory": {
            "value": ""
        },
        "actionType": {
            "value": "passive"
        },
        "actions": {
            "value": null
        },
        "description": {
            "value": "<p><strong>Trigger</strong> You use your champion's reaction, triggered by a fiend within your reach.</p>\n<hr />\n<p>The erratic teleportation magic you experienced in the Kortos Mounts has taught you a few tricks. You attempt an Athletics check to @Compendium[pf2e.actionspf2e.Shove]{Shove} the fiend that triggered your champion's reaction; on a success, the target can't teleport or summon creatures for 1 minute. On a critical success, the target is also @Compendium[pf2e.conditionitems.Stunned]{Stunned 1} and can't teleport or summon creatures for 1 hour, and if you are on your home plane and the target is a fiend of level 18 or lower from another plane, it is also banished to its home plane. Your multiple attack penalty doesn't apply to this attack.</p>"
        },
        "featType": {
            "value": "class"
        },
        "level": {
            "value": 20
        },
        "prerequisites": {
            "value": [
                {
                    "value": "Fiendsbane Oath"
                }
            ]
        },
        "rules": [],
        "source": {
            "value": "Pathfinder #156: The Apocalypse Prophet"
        },
        "traits": {
            "custom": "",
            "rarity": {
                "value": "uncommon"
            },
            "selected": {
                "champion": "Champion"
            },
            "value": [
                "champion"
            ]
        }
    },
    "effects": [],
    "flags": {},
    "img": "systems/pf2e/icons/features/feats/feats.webp",
    "name": "Banishing Blow",
    "type": "feat"
}
