('D:\\WinLocalTransceiver\\win-local-transceiver\\PythonFTPServer\\defender\\build\\defender\\PKG-00.pkg',
 {'BINARY': 1,
  'DATA': 1,
  'EXECUTABLE': 1,
  'EXTENSION': 1,
  'PYMODULE': 1,
  'PYSOURCE': 1,
  'PYZ': 0},
 [('PYZ-00.pyz',
   'D:\\WinLocalTransceiver\\win-local-transceiver\\PythonFTPServer\\defender\\build\\defender\\PYZ-00.pyz',
   'PYZ'),
  ('struct',
   'c:\\users\\jesch\\appdata\\local\\programs\\python\\python39\\lib\\struct.pyo',
   'PYMODULE'),
  ('pyimod01_os_path',
   'c:\\users\\jesch\\appdata\\local\\programs\\python\\python39\\lib\\site-packages\\PyInstaller\\loader\\pyimod01_os_path.pyc',
   'PYMODULE'),
  ('pyimod02_archive',
   'c:\\users\\jesch\\appdata\\local\\programs\\python\\python39\\lib\\site-packages\\PyInstaller\\loader\\pyimod02_archive.pyc',
   'PYMODULE'),
  ('pyimod03_importers',
   'c:\\users\\jesch\\appdata\\local\\programs\\python\\python39\\lib\\site-packages\\PyInstaller\\loader\\pyimod03_importers.pyc',
   'PYMODULE'),
  ('pyiboot01_bootstrap',
   'c:\\users\\jesch\\appdata\\local\\programs\\python\\python39\\lib\\site-packages\\PyInstaller\\loader\\pyiboot01_bootstrap.py',
   'PYSOURCE'),
  ('pyi_rth_multiprocessing',
   'C:\\Users\\jesch\\AppData\\Local\\Programs\\Python\\Python39\\Lib\\site-packages\\PyInstaller\\hooks\\rthooks\\pyi_rth_multiprocessing.py',
   'PYSOURCE'),
  ('defender',
   'D:\\WinLocalTransceiver\\win-local-transceiver\\PythonFTPServer\\defender\\defender.py',
   'PYSOURCE'),
  ('defender.exe.manifest',
   'D:\\WinLocalTransceiver\\win-local-transceiver\\PythonFTPServer\\defender\\build\\defender\\defender.exe.manifest',
   'BINARY')],
 True,
 False,
 False,
 [])
