{
    "development": {
        "username": "toFNUJeJ0H",
        "password": "Lf3460TRXP",
        "database": "toFNUJeJ0H",
        "host": "remotemysql.com",
        "dialect": "mysql"
    },
    "test": {
        "username": "root",
        "password": "",
        "database": "psccaslm",
        "host": "127.0.0.1",
        "dialect": "mysql"
    },
    "production": {
        "username": "root",
        "password": "",
        "database": "psccaslm",
        "host": "127.0.0.1",
        "dialect": "mysql"
    }
}