
 ________                              __                   ______
|_   __  |                            [  |  _             .' ____ \
  | |_ \_|  __   _    _ .--.   .---.   | | / ]   ,--.     | (___ \_|  .---.   _ .--.   _   __   .---.   _ .--.
  |  _| _  [  | | |  [ `/'`\] / /__\\  | '' <   `'_\ :     _.____`.  / /__\\ [ `/'`\] [ \ [  ] / /__\\ [ `/'`\]
 _| |__/ |  | \_/ |,  | |     | \__.,  | |`\ \  // | |,   | \____) | | \__.,  | |      \ \/ /  | \__.,  | |
|________|  '.__.'_/ [___]     '.__.' [__|  \_] \'-;__/    \______.'  '.__.' [___]      \__/    '.__.' [___]
${application.title} ${application.version}
Powered by Spring Boot ${spring-boot.version}
