C:/TouchGFXProjects/Temperature_contrl_INT/Core/Src/stm32f4xx_hal_msp.c:67:6:HAL_MspInit	8	static
C:/TouchGFXProjects/Temperature_contrl_INT/Core/Src/stm32f4xx_hal_msp.c:91:6:HAL_CRC_MspInit	8	static
C:/TouchGFXProjects/Temperature_contrl_INT/Core/Src/stm32f4xx_hal_msp.c:113:6:HAL_CRC_MspDeInit	0	static
C:/TouchGFXProjects/Temperature_contrl_INT/Core/Src/stm32f4xx_hal_msp.c:135:6:HAL_DMA2D_MspInit	16	static
C:/TouchGFXProjects/Temperature_contrl_INT/Core/Src/stm32f4xx_hal_msp.c:160:6:HAL_DMA2D_MspDeInit	0	static
C:/TouchGFXProjects/Temperature_contrl_INT/Core/Src/stm32f4xx_hal_msp.c:185:6:HAL_I2C_MspInit	64	static
C:/TouchGFXProjects/Temperature_contrl_INT/Core/Src/stm32f4xx_hal_msp.c:233:6:HAL_I2C_MspDeInit	8	static
C:/TouchGFXProjects/Temperature_contrl_INT/Core/Src/stm32f4xx_hal_msp.c:264:6:HAL_LTDC_MspInit	120	static
C:/TouchGFXProjects/Temperature_contrl_INT/Core/Src/stm32f4xx_hal_msp.c:388:6:HAL_LTDC_MspDeInit	8	static
C:/TouchGFXProjects/Temperature_contrl_INT/Core/Src/stm32f4xx_hal_msp.c:450:6:HAL_SPI_MspInit	48	static
C:/TouchGFXProjects/Temperature_contrl_INT/Core/Src/stm32f4xx_hal_msp.c:512:6:HAL_SPI_MspDeInit	0	static
C:/TouchGFXProjects/Temperature_contrl_INT/Core/Src/stm32f4xx_hal_msp.c:561:6:HAL_TIM_PWM_MspInit	24	static
C:/TouchGFXProjects/Temperature_contrl_INT/Core/Src/stm32f4xx_hal_msp.c:597:6:HAL_TIM_MspPostInit	32	static
C:/TouchGFXProjects/Temperature_contrl_INT/Core/Src/stm32f4xx_hal_msp.c:629:6:HAL_TIM_PWM_MspDeInit	0	static
C:/TouchGFXProjects/Temperature_contrl_INT/Core/Src/stm32f4xx_hal_msp.c:654:6:HAL_UART_MspInit	40	static
C:/TouchGFXProjects/Temperature_contrl_INT/Core/Src/stm32f4xx_hal_msp.c:690:6:HAL_UART_MspDeInit	0	static
C:/TouchGFXProjects/Temperature_contrl_INT/Core/Src/stm32f4xx_hal_msp.c:821:6:HAL_SDRAM_MspInit	48	static
C:/TouchGFXProjects/Temperature_contrl_INT/Core/Src/stm32f4xx_hal_msp.c:907:6:HAL_SDRAM_MspDeInit	8	static
