../Core/Src/ring_buffer.c:11:13:ring_buffer_reset	16	static
../Core/Src/ring_buffer.c:18:9:ring_buffer_full	16	static
../Core/Src/ring_buffer.c:23:9:ring_buffer_empty	16	static
../Core/Src/ring_buffer.c:28:8:ring_buffer_size	24	static
../Core/Src/ring_buffer.c:44:9:ring_buffer_get	16	static
../Core/Src/ring_buffer.c:56:6:ring_buffer_put	16	static
../Core/Src/ring_buffer.c:70:9:ring_buffer_init	24	static
../Core/Src/ring_buffer.c:83:10:ring_buffer_tail_position	16	static
